db.products.find({ "actulPrice": {$lte : 1000 } })

db.products.find({"category":{"$in":[ObjectId("5fd78671340cd701620505fd")]},"brand":ObjectId("5fd7868f23919a02acdc01c8"),"actulPrice": {$lte : 1000 } }).pretty()
db.products.find({"category":{"$in":[ObjectId("1fd7868f23919a02acdc0190")]},"brand":ObjectId("5fd9f3bfd27c8e1d220b3f83")})
db.products.find({"actulPrice":{"$lte":1111}})

db.products.deleteMany({})