[{
    "id": 1,
    "thumb_url": "assets/images/news-event/news-1.jpg",
    "home_thumb_url": "assets/images/home/news-event/img-01.jpg",
    "title": "ประมวลภาพรับรางวัลผู้ประกอบธุรกิจส่งออกดีเด่นประจำปี 2561",
    "desc": "วันพฤหัสบดีที่ 17 กันยายน 2558 ณ ห้องบอลรูม ชั้น 2 โซน เอ ศูนย์การประชุมแห่งชาติสิริกิติ์ กรมส่งเสริมการค้าระหว่างประเทศ",
    "date": "13th Sep 2018",
    "link_url": "news-event-detail.php"
  },
  {
    "id": 2,
    "thumb_url": "assets/images/news-event/news-2.jpg",
    "home_thumb_url": "assets/images/home/news-event/img-02.jpg",
    "title": "ผู้ประกอบการเข้าร่วม PM AWARD คึกคัก",
    "desc": "วันพฤหัสบดีที่ 17 กันยายน 2558 ณ ห้องบอลรูม ชั้น 2 โซน เอ ศูนย์การประชุมแห่งชาติสิริกิติ์ กรมส่งเสริมการค้าระหว่างประเทศ",
    "date": "13th Sep 2018",
    "link_url": "news-event-detail.php"
  },
  {
    "id": 3,
    "thumb_url": "assets/images/news-event/news-3.jpg",
    "home_thumb_url": "assets/images/home/news-event/img-03.jpg",
    "title": "ออกแบบเชิงนวัตกรรมรายการอายุน้อยร้อยล้านสู่อาเซียน",
    "desc": "วันพฤหัสบดีที่ 17 กันยายน 2558 ณ ห้องบอลรูม ชั้น 2 โซน เอ ศูนย์การประชุมแห่งชาติสิริกิติ์ กรมส่งเสริมการค้าระหว่างประเทศ",
    "date": "13th Sep 2018",
    "link_url": "news-event-detail.php"
  },
  {
    "id": 4,
    "thumb_url": "assets/images/news-event/news-4.jpg",
    "home_thumb_url": "assets/images/home/news-event/img-04.jpg",
    "title": "“ประเทศไทย 4.0” เดินหน้าเฟ้นหาผู้ประกอบการส่งออกไทยเพื่อรับ “รางวัลผู้ประกอบธุรกิจส่งออกประจำปี 2560” ดีเด่น",
    "desc": "วันพฤหัสบดีที่ 17 กันยายน 2558 ณ ห้องบอลรูม ชั้น 2 โซน เอ ศูนย์การประชุมแห่งชาติสิริกิติ์ กรมส่งเสริมการค้าระหว่างประเทศ",
    "date": "13th Sep 2018",
    "link_url": "news-event-detail.php"
  },
  {
    "id": 5,
    "thumb_url": "assets/images/news-event/news-1.jpg",
    "home_thumb_url": "assets/images/home/news-event/img-01.jpg",
    "title": "ประมวลภาพรับรางวัลผู้ประกอบธุรกิจส่งออกดีเด่นประจำปี 2561",
    "desc": "วันพฤหัสบดีที่ 17 กันยายน 2558 ณ ห้องบอลรูม ชั้น 2 โซน เอ ศูนย์การประชุมแห่งชาติสิริกิติ์ กรมส่งเสริมการค้าระหว่างประเทศ",
    "date": "13th Sep 2018",
    "link_url": "news-event-detail.php"
  },
  {
    "id": 6,
    "thumb_url": "assets/images/news-event/news-2.jpg",
    "home_thumb_url": "assets/images/home/news-event/img-02.jpg",
    "title": "ผู้ประกอบการเข้าร่วม PM AWARD คึกคัก",
    "desc": "วันพฤหัสบดีที่ 17 กันยายน 2558 ณ ห้องบอลรูม ชั้น 2 โซน เอ ศูนย์การประชุมแห่งชาติสิริกิติ์ กรมส่งเสริมการค้าระหว่างประเทศ",
    "date": "13th Sep 2018",
    "link_url": "news-event-detail.php"
  },
  {
    "id": 7,
    "thumb_url": "assets/images/news-event/news-3.jpg",
    "home_thumb_url": "assets/images/home/news-event/img-03.jpg",
    "title": "ออกแบบเชิงนวัตกรรมรายการอายุน้อยร้อยล้านสู่อาเซียน",
    "desc": "วันพฤหัสบดีที่ 17 กันยายน 2558 ณ ห้องบอลรูม ชั้น 2 โซน เอ ศูนย์การประชุมแห่งชาติสิริกิติ์ กรมส่งเสริมการค้าระหว่างประเทศ",
    "date": "13th Sep 2018",
    "link_url": "news-event-detail.php"
  },
  {
    "id": 8,
    "thumb_url": "assets/images/news-event/news-4.jpg",
    "home_thumb_url": "assets/images/home/news-event/img-04.jpg",
    "title": "“ประเทศไทย 4.0” เดินหน้าเฟ้นหาผู้ประกอบการส่งออกไทยเพื่อรับ “รางวัลผู้ประกอบธุรกิจส่งออกประจำปี 2560” ดีเด่น",
    "desc": "วันพฤหัสบดีที่ 17 กันยายน 2558 ณ ห้องบอลรูม ชั้น 2 โซน เอ ศูนย์การประชุมแห่งชาติสิริกิติ์ กรมส่งเสริมการค้าระหว่างประเทศ",
    "date": "13th Sep 2018",
    "link_url": "news-event-detail.php"
  },
  {
    "id": 9,
    "thumb_url": "assets/images/news-event/news-1.jpg",
    "home_thumb_url": "assets/images/home/news-event/img-01.jpg",
    "title": "ประมวลภาพรับรางวัลผู้ประกอบธุรกิจส่งออกดีเด่นประจำปี 2561",
    "desc": "วันพฤหัสบดีที่ 17 กันยายน 2558 ณ ห้องบอลรูม ชั้น 2 โซน เอ ศูนย์การประชุมแห่งชาติสิริกิติ์ กรมส่งเสริมการค้าระหว่างประเทศ",
    "date": "13th Sep 2018",
    "link_url": "news-event-detail.php"
  },
  {
    "id": 10,
    "thumb_url": "assets/images/news-event/news-2.jpg",
    "home_thumb_url": "assets/images/home/news-event/img-02.jpg",
    "title": "ผู้ประกอบการเข้าร่วม PM AWARD คึกคัก",
    "desc": "วันพฤหัสบดีที่ 17 กันยายน 2558 ณ ห้องบอลรูม ชั้น 2 โซน เอ ศูนย์การประชุมแห่งชาติสิริกิติ์ กรมส่งเสริมการค้าระหว่างประเทศ",
    "date": "13th Sep 2018",
    "link_url": "news-event-detail.php"
  },
  {
    "id": 11,
    "thumb_url": "assets/images/news-event/news-3.jpg",
    "home_thumb_url": "assets/images/home/news-event/img-03.jpg",
    "title": "ออกแบบเชิงนวัตกรรมรายการอายุน้อยร้อยล้านสู่อาเซียน",
    "desc": "วันพฤหัสบดีที่ 17 กันยายน 2558 ณ ห้องบอลรูม ชั้น 2 โซน เอ ศูนย์การประชุมแห่งชาติสิริกิติ์ กรมส่งเสริมการค้าระหว่างประเทศ",
    "date": "13th Sep 2018",
    "link_url": "news-event-detail.php"
  },
  {
    "id": 12,
    "thumb_url": "assets/images/news-event/news-4.jpg",
    "home_thumb_url": "assets/images/home/news-event/img-04.jpg",
    "title": "“ประเทศไทย 4.0” เดินหน้าเฟ้นหาผู้ประกอบการส่งออกไทยเพื่อรับ “รางวัลผู้ประกอบธุรกิจส่งออกประจำปี 2560” ดีเด่น",
    "desc": "วันพฤหัสบดีที่ 17 กันยายน 2558 ณ ห้องบอลรูม ชั้น 2 โซน เอ ศูนย์การประชุมแห่งชาติสิริกิติ์ กรมส่งเสริมการค้าระหว่างประเทศ",
    "date": "13th Sep 2018",
    "link_url": "news-event-detail.php"
  }
  
]