{
  "CN": "system:node:node2.k8s.hard.com",
  "key": {
    "algo": "rsa",
    "size": 2048
  },
  "names": [
    {
      "C": "BR",
      "L": "Brasilia",
      "O": "system:nodes",
      "OU": "Kubernetes RAIZ",
      "ST": "DF"
    }
  ]
}
