{
    "/js/core/app.js": "/js/core/app.js?id=d0d7eb96bac32369e84c",
    "/js/core/app-menu.js": "/js/core/app-menu.js?id=683a81fb67d60e66d60a",
    "/css/plugins/file-uploaders/dropzone.css": "/css/plugins/file-uploaders/dropzone.css?id=fb7a6e2318c0ff75acd1",
    "/css/plugins/forms/extended/typeahed.css": "/css/plugins/forms/extended/typeahed.css?id=8f1500e4cc82905f1204",
    "/css/plugins/forms/form-inputs-groups.css": "/css/plugins/forms/form-inputs-groups.css?id=828e312c44ad5d05d0de",
    "/css/plugins/forms/validation/form-validation.css": "/css/plugins/forms/validation/form-validation.css?id=3b80a9026be07bfa9795",
    "/css/plugins/forms/wizard.css": "/css/plugins/forms/wizard.css?id=274741fe73e3ced19412",
    "/css/plugins/tour/tour.css": "/css/plugins/tour/tour.css?id=3a52109b60a992907fb8",
    "/css/themes/dark-layout.css": "/css/themes/dark-layout.css?id=336cb0d86ce431ef29ad",
    "/css/themes/semi-dark-layout.css": "/css/themes/semi-dark-layout.css?id=ee352f9bd2b0136f24fa",
    "/css/pages/acl/plans-profiles.css": "/css/pages/acl/plans-profiles.css?id=b64cf32e996d6f5aceb4",
    "/css/pages/app-user.css": "/css/pages/app-user.css?id=9b4cca2e776c0a6f01b0",
    "/css/pages/auth/authentication.css": "/css/pages/auth/authentication.css?id=da01720a679815bacc4a",
    "/css/pages/card-analytics.css": "/css/pages/card-analytics.css?id=61e39180ac2c018a652b",
    "/css/pages/dashboard-analytics.css": "/css/pages/dashboard-analytics.css?id=f4f82f933694b6ac1e38",
    "/css/pages/data-list-view.css": "/css/pages/data-list-view.css?id=4dfee36b3bbbec863144",
    "/css/pages/plans.css": "/css/pages/plans.css?id=26275fad5c18a1319848",
    "/css/core/colors/palette-gradient.css": "/css/core/colors/palette-gradient.css?id=d70cefb6149d8aa6e048",
    "/css/core/colors/palette-noui.css": "/css/core/colors/palette-noui.css?id=2727eaff2f3ac6ee3610",
    "/css/core/colors/palette-variables.css": "/css/core/colors/palette-variables.css?id=d41d8cd98f00b204e980",
    "/css/core/menu/menu-types/horizontal-menu.css": "/css/core/menu/menu-types/horizontal-menu.css?id=3c6733d25f0bdd8dceba",
    "/css/core/menu/menu-types/vertical-menu.css": "/css/core/menu/menu-types/vertical-menu.css?id=b9a2a348eddbbc39bcae",
    "/css/core/menu/menu-types/vertical-overlay-menu.css": "/css/core/menu/menu-types/vertical-overlay-menu.css?id=1fc867533bce02393156",
    "/css/core/mixins/alert.css": "/css/core/mixins/alert.css?id=d41d8cd98f00b204e980",
    "/css/core/mixins/hex2rgb.css": "/css/core/mixins/hex2rgb.css?id=d41d8cd98f00b204e980",
    "/css/core/mixins/main-menu-mixin.css": "/css/core/mixins/main-menu-mixin.css?id=d41d8cd98f00b204e980",
    "/css/core/mixins/transitions.css": "/css/core/mixins/transitions.css?id=d41d8cd98f00b204e980",
    "/css/bootstrap.css": "/css/bootstrap.css?id=3efc2f1840e0da7aefe8",
    "/css/bootstrap-extended.css": "/css/bootstrap-extended.css?id=58becd0d626ce19d4eaf",
    "/css/colors.css": "/css/colors.css?id=4d3d0bdd0fbe14f1d1ef",
    "/css/components.css": "/css/components.css?id=e96ea417e947a6a368b8",
    "/css/custom-rtl.css": "/css/custom-rtl.css?id=a77bc6b78fbf85c90e5a",
    "/css/custom-laravel.css": "/css/custom-laravel.css?id=94113c1793155380380c",
    "/js/scripts/components.js": "/js/scripts/components.js?id=2ab188ae0fa7b622cdb1",
    "/js/scripts/editors/custon-editor.js": "/js/scripts/editors/custon-editor.js?id=9c95cb12e8c74c512ebc",
    "/js/scripts/editors/editor-quill.js": "/js/scripts/editors/editor-quill.js?id=f3e5d7fdf2fb88c201c4",
    "/js/scripts/footer.js": "/js/scripts/footer.js?id=b382ec364916c35eff84",
    "/js/scripts/forms/basic-inputs.js": "/js/scripts/forms/basic-inputs.js?id=f5807b49b347df9b6d2d",
    "/js/scripts/forms/form-maxlength.js": "/js/scripts/forms/form-maxlength.js?id=e50dbc1951ef5e303a66",
    "/js/scripts/forms/form-tooltip-valid.js": "/js/scripts/forms/form-tooltip-valid.js?id=c63799f462a1bb4338c3",
    "/js/scripts/forms/number-input.js": "/js/scripts/forms/number-input.js?id=ed66f6924d17ac139fb5",
    "/js/scripts/forms/select/form-select2.js": "/js/scripts/forms/select/form-select2.js?id=0d4bdc2132f9a7397ee3",
    "/js/scripts/forms/validation/form-validation.js": "/js/scripts/forms/validation/form-validation.js?id=b6b46ea6d6454207a5f4",
    "/js/scripts/forms/wizard-steps.js": "/js/scripts/forms/wizard-steps.js?id=b401b1bd71e204c26461",
    "/js/scripts/functions/useful.js": "/js/scripts/functions/useful.js?id=3a20698edcf3172a6b97",
    "/js/scripts/modal/components-modal.js": "/js/scripts/modal/components-modal.js?id=d57c9be3baa989e6db93",
    "/js/scripts/modal/profiles-permissions-modal.js": "/js/scripts/modal/profiles-permissions-modal.js?id=13616e1ee3cce38d0be2",
    "/js/scripts/pages/acl/plans-profiles.js": "/js/scripts/pages/acl/plans-profiles.js?id=1050aa21c8e4d77a2c6b",
    "/js/scripts/pages/app-user.js": "/js/scripts/pages/app-user.js?id=7696014e07dfb2c0fd73",
    "/js/scripts/pages/dashboard-analytics.js": "/js/scripts/pages/dashboard-analytics.js?id=6ef85083f3c1840937ad",
    "/js/scripts/pages/permissions-list-view.js": "/js/scripts/pages/permissions-list-view.js?id=0e110d9ec9c83285aedd",
    "/js/scripts/pages/plans-resources.js": "/js/scripts/pages/plans-resources.js?id=1844338fdd0d7dd77c22",
    "/js/scripts/pages/profiles-permissions-list-view.js": "/js/scripts/pages/profiles-permissions-list-view.js?id=23aa7d1c26f72de1c941",
    "/js/scripts/pages/sk-content-sidebar.js": "/js/scripts/pages/sk-content-sidebar.js?id=e9be6921c870358dea3d",
    "/js/scripts/ui/profiles-list-view.js": "/js/scripts/ui/profiles-list-view.js?id=578288cf7b92fe722e0d",
    "/vendors/js/charts/apexcharts.js": "/vendors/js/charts/apexcharts.js?id=3df6ec86fc996137c434",
    "/vendors/js/charts/apexcharts.min.js": "/vendors/js/charts/apexcharts.min.js?id=bbb1adadc937c1636f35",
    "/vendors/js/editors/quill/highlight.min.js": "/vendors/js/editors/quill/highlight.min.js?id=8e417c082a73a048c1d7",
    "/vendors/js/editors/quill/katex.min.js": "/vendors/js/editors/quill/katex.min.js?id=51236ca553d5c37c4690",
    "/vendors/js/editors/quill/quill.js": "/vendors/js/editors/quill/quill.js?id=c11e87e46275c866af8e",
    "/vendors/js/editors/quill/quill.min.js": "/vendors/js/editors/quill/quill.min.js?id=c2734fd6895bdfba1324",
    "/vendors/js/editors/quill/themes/base.js": "/vendors/js/editors/quill/themes/base.js?id=5749ffc9d019e4662bed",
    "/vendors/js/editors/quill/themes/bubble.js": "/vendors/js/editors/quill/themes/bubble.js?id=d2e6f70979129747de57",
    "/vendors/js/editors/quill/themes/snow.js": "/vendors/js/editors/quill/themes/snow.js?id=0b6ff52f966e612a6fbf",
    "/vendors/js/editors/quill/ui/color-picker.js": "/vendors/js/editors/quill/ui/color-picker.js?id=7a93c27a2800a480c97e",
    "/vendors/js/editors/quill/ui/icon-picker.js": "/vendors/js/editors/quill/ui/icon-picker.js?id=39a31ff7ca023fce75b1",
    "/vendors/js/editors/quill/ui/icons.js": "/vendors/js/editors/quill/ui/icons.js?id=b2cda2c9dd117bab915d",
    "/vendors/js/editors/quill/ui/picker.js": "/vendors/js/editors/quill/ui/picker.js?id=a9cf453a1ed4a90498d5",
    "/vendors/js/editors/quill/ui/tooltip.js": "/vendors/js/editors/quill/ui/tooltip.js?id=5fded70615a9871d6a08",
    "/vendors/js/extensions/dropzone.min.js": "/vendors/js/extensions/dropzone.min.js?id=3c9d8e84d8ae182fa8d5",
    "/vendors/js/extensions/i18next.min.js": "/vendors/js/extensions/i18next.min.js?id=c3928955658d349c765b",
    "/vendors/js/extensions/i18nextBrowserLanguageDetector.min.js": "/vendors/js/extensions/i18nextBrowserLanguageDetector.min.js?id=9447300696a662d791c9",
    "/vendors/js/extensions/i18nextXHRBackend.min.js": "/vendors/js/extensions/i18nextXHRBackend.min.js?id=59de2505fb73fb4e05d6",
    "/vendors/js/extensions/jquery-i18next.min.js": "/vendors/js/extensions/jquery-i18next.min.js?id=f1fcc9d4eb99cc1414d0",
    "/vendors/js/extensions/jquery.mousewheel.min.js": "/vendors/js/extensions/jquery.mousewheel.min.js?id=b6bddcf63d04135bab37",
    "/vendors/js/extensions/jquery.steps.min.js": "/vendors/js/extensions/jquery.steps.min.js?id=4c5e9f4e84d32b7df69a",
    "/vendors/js/extensions/lang-all.js": "/vendors/js/extensions/lang-all.js?id=ac6faef018c845f0493d",
    "/vendors/js/extensions/locale-all.js": "/vendors/js/extensions/locale-all.js?id=c61d63888b913a98ea1c",
    "/vendors/js/extensions/moment.min.js": "/vendors/js/extensions/moment.min.js?id=e9b400a35be784331a51",
    "/vendors/js/extensions/pace.min.js": "/vendors/js/extensions/pace.min.js?id=24d2d5e3e331c4efa3cd",
    "/vendors/js/extensions/transition.js": "/vendors/js/extensions/transition.js?id=9299a9022d8bef625922",
    "/vendors/js/forms/extended/maxlength/bootstrap-maxlength.js": "/vendors/js/forms/extended/maxlength/bootstrap-maxlength.js?id=413ef9bb71f508be3a66",
    "/vendors/js/forms/extended/typeahead/bloodhound.min.js": "/vendors/js/forms/extended/typeahead/bloodhound.min.js?id=8c29d1c00a6eafd32e76",
    "/vendors/js/forms/extended/typeahead/handlebars.js": "/vendors/js/forms/extended/typeahead/handlebars.js?id=f8f6c4173d79cbcbeb7e",
    "/vendors/js/forms/extended/typeahead/typeahead.bundle.min.js": "/vendors/js/forms/extended/typeahead/typeahead.bundle.min.js?id=cc8f408384805d4c997b",
    "/vendors/js/forms/repeater/jquery.repeater.min.js": "/vendors/js/forms/repeater/jquery.repeater.min.js?id=422a9663b1a9c0ff6e34",
    "/vendors/js/forms/select/select2.full.js": "/vendors/js/forms/select/select2.full.js?id=c15debf3d43b49294fb2",
    "/vendors/js/forms/select/select2.full.min.js": "/vendors/js/forms/select/select2.full.min.js?id=708724c21c5073e9e228",
    "/vendors/js/forms/select/select2.js": "/vendors/js/forms/select/select2.js?id=bba0969383e7d9fed524",
    "/vendors/js/forms/select/select2.min.js": "/vendors/js/forms/select/select2.min.js?id=43ad14ea1941ab163e98",
    "/vendors/js/forms/spinner/jquery.bootstrap-touchspin.js": "/vendors/js/forms/spinner/jquery.bootstrap-touchspin.js?id=cab4d1a449d12405adc5",
    "/vendors/js/forms/toggle/switchery.js": "/vendors/js/forms/toggle/switchery.js?id=41e10932c227029c0db9",
    "/vendors/js/forms/toggle/switchery.min.js": "/vendors/js/forms/toggle/switchery.min.js?id=21a250f2616216d7fe50",
    "/vendors/js/forms/validation/jqBootstrapValidation.js": "/vendors/js/forms/validation/jqBootstrapValidation.js?id=5d1f81dcb60da23b468b",
    "/vendors/js/forms/validation/jquery.validate.min.js": "/vendors/js/forms/validation/jquery.validate.min.js?id=aad785d450d475b0fd63",
    "/vendors/js/tables/ag-grid/ag-grid-community.min.noStyle.js": "/vendors/js/tables/ag-grid/ag-grid-community.min.noStyle.js?id=65906e87666f574ef1ca",
    "/vendors/js/tables/datatable/buttons.bootstrap.min.js": "/vendors/js/tables/datatable/buttons.bootstrap.min.js?id=77c8d7c4b64bceb0251c",
    "/vendors/js/tables/datatable/buttons.html5.min.js": "/vendors/js/tables/datatable/buttons.html5.min.js?id=173b003d8c9ea70fe069",
    "/vendors/js/tables/datatable/buttons.print.min.js": "/vendors/js/tables/datatable/buttons.print.min.js?id=6545b810f684f84e00e5",
    "/vendors/js/tables/datatable/datatables.bootstrap4.min.js": "/vendors/js/tables/datatable/datatables.bootstrap4.min.js?id=b63fdeeb4941fd4cab8a",
    "/vendors/js/tables/datatable/datatables.buttons.min.js": "/vendors/js/tables/datatable/datatables.buttons.min.js?id=ef66b6c574a0c5e99fae",
    "/vendors/js/tables/datatable/datatables.checkboxes.min.js": "/vendors/js/tables/datatable/datatables.checkboxes.min.js?id=fbefb5342e6319df72b7",
    "/vendors/js/tables/datatable/datatables.min.js": "/vendors/js/tables/datatable/datatables.min.js?id=97fd6a774fc6211e7619",
    "/vendors/js/tables/datatable/dataTables.select.min.js": "/vendors/js/tables/datatable/dataTables.select.min.js?id=e06c874532cc59e272dc",
    "/vendors/js/tables/datatable/pdfmake.min.js": "/vendors/js/tables/datatable/pdfmake.min.js?id=ffa9a02736fe4a19a3a0",
    "/vendors/js/tables/datatable/vfs_fonts.js": "/vendors/js/tables/datatable/vfs_fonts.js?id=795e143b8f4eeb5089b2",
    "/vendors/js/ui/affix.js": "/vendors/js/ui/affix.js?id=76d0f746d06d24675053",
    "/vendors/js/ui/blockUI.min.js": "/vendors/js/ui/blockUI.min.js?id=b129b6324a9a466ab62d",
    "/vendors/js/ui/jquery-sliding-menu.js": "/vendors/js/ui/jquery-sliding-menu.js?id=c92c55c67be28f2f3e83",
    "/vendors/js/ui/jquery.matchHeight-min.js": "/vendors/js/ui/jquery.matchHeight-min.js?id=18c617d1d125e6347677",
    "/vendors/js/ui/jquery.sticky-kit.min.js": "/vendors/js/ui/jquery.sticky-kit.min.js?id=71d0a960da3ff3ae0cc8",
    "/vendors/js/ui/jquery.sticky.js": "/vendors/js/ui/jquery.sticky.js?id=17f0788e54b9dc4eb93d",
    "/vendors/js/ui/popper.min.js": "/vendors/js/ui/popper.min.js?id=f88d86189c66d177dc4a",
    "/vendors/js/ui/prism-treeview.js": "/vendors/js/ui/prism-treeview.js?id=90cb70f2d3d42443f2e2",
    "/vendors/js/ui/prism.min.js": "/vendors/js/ui/prism.min.js?id=fde910813cf7141eae50",
    "/vendors/js/ui/screenfull.min.js": "/vendors/js/ui/screenfull.min.js?id=8b5a8694c96375ced260",
    "/vendors/js/ui/unison.min.js": "/vendors/js/ui/unison.min.js?id=bc362b7e0103b2974ad8",
    "/vendors/js/vendors.min.js": "/vendors/js/vendors.min.js?id=ed6997ca654de02b28ef",
    "/vendors/css/charts/apexcharts.css": "/vendors/css/charts/apexcharts.css?id=d3b53e6191f8e9844532",
    "/vendors/css/editors/quill/katex.min.css": "/vendors/css/editors/quill/katex.min.css?id=5b2eab19f157133d8b2f",
    "/vendors/css/editors/quill/monokai-sublime.min.css": "/vendors/css/editors/quill/monokai-sublime.min.css?id=2bd355b6557c287e187e",
    "/vendors/css/editors/quill/quill.bubble.css": "/vendors/css/editors/quill/quill.bubble.css?id=bb254c78f1a4bb92e692",
    "/vendors/css/editors/quill/quill.snow.css": "/vendors/css/editors/quill/quill.snow.css?id=2ee7ff53f78832309fa9",
    "/vendors/css/extensions/pace.css": "/vendors/css/extensions/pace.css?id=8a484df21b7346425c6c",
    "/vendors/css/extensions/unslider.css": "/vendors/css/extensions/unslider.css?id=2fdb13cbb57c9b78ea14",
    "/vendors/css/file-uploaders/dropzone.min.css": "/vendors/css/file-uploaders/dropzone.min.css?id=3a741c1915cad001223d",
    "/vendors/css/forms/select/select2.css": "/vendors/css/forms/select/select2.css?id=a2194c2626489df39c39",
    "/vendors/css/forms/select/select2.min.css": "/vendors/css/forms/select/select2.min.css?id=9f54e6414f87e0d14b9e",
    "/vendors/css/forms/spinner/jquery.bootstrap-touchspin.css": "/vendors/css/forms/spinner/jquery.bootstrap-touchspin.css?id=d0f43d5a0f337005344d",
    "/vendors/css/forms/toggle/switchery.css": "/vendors/css/forms/toggle/switchery.css?id=319ffce6fbb071c20dfb",
    "/vendors/css/forms/toggle/switchery.min.css": "/vendors/css/forms/toggle/switchery.min.css?id=3d5c5f2d195cad6c3658",
    "/vendors/css/perfect-scrollbar/perfect-scrollbar.min.css": "/vendors/css/perfect-scrollbar/perfect-scrollbar.min.css?id=14dcf6162f6e16678f6b",
    "/vendors/css/tables/ag-grid/ag-grid.css": "/vendors/css/tables/ag-grid/ag-grid.css?id=ba916b1dd4dde0d0233e",
    "/vendors/css/tables/ag-grid/ag-theme-material.css": "/vendors/css/tables/ag-grid/ag-theme-material.css?id=87805c0706c254640d14",
    "/vendors/css/tables/datatable/datatables.min.css": "/vendors/css/tables/datatable/datatables.min.css?id=5a73106bc8032d95933a",
    "/vendors/css/tables/datatable/extensions/dataTables.checkboxes.css": "/vendors/css/tables/datatable/extensions/dataTables.checkboxes.css?id=d2a2b3187b52afca7838",
    "/vendors/css/tables/datatable/select.dataTables.min.css": "/vendors/css/tables/datatable/select.dataTables.min.css?id=aebdacb509c7a9f9579a",
    "/vendors/css/ui/prism-treeview.css": "/vendors/css/ui/prism-treeview.css?id=d4a772304237b8605637",
    "/vendors/css/ui/prism.min.css": "/vendors/css/ui/prism.min.css?id=2b6ec658f3078cb5a481",
    "/vendors/css/vendors.min.css": "/vendors/css/vendors.min.css?id=188a0bbf498c6a3c494c"
}
