{
  "parent": "minecraft:recipes/root",
  "criteria": {
    "has_minecart": {
      "conditions": {
        "items": [
          {
            "items": "minecraft:minecart"
          }
        ]
      },
      "trigger": "minecraft:inventory_changed"
    }
  },
  "requirements": [
    [
      "has_minecart"
    ]
  ],
  "rewards": {
    "recipes": [
      "sturdy_vehicles:uncraft_chest_minecart"
    ]
  }
}