{
  "parent": "minecraft:recipes/root",
  "criteria": {
    "has_boat": {
      "conditions": {
        "items": [
          {
            "items": "#minecraft:boats"
          }
        ]
      },
      "trigger": "minecraft:inventory_changed"
    }
  },
  "requirements": [
    [
      "has_boat"
    ]
  ],
  "rewards": {
    "recipes": [
      "sturdy_vehicles:birch_chest_boat"
    ]
  }
}