{
  "type": "sturdy_vehicles:combining",
  "addition": "minecraft:chest",
  "base": "minecraft:spruce_boat",
  "category": "misc",
  "result": {
    "count": 1,
    "id": "minecraft:spruce_chest_boat"
  }
}