{
  "filter": {
    "block": [
      {
        "namespace": "^\\Qminecraft\\E$",
        "path": "^\\Qrecipe/chest_minecart.json\\E$"
      },
      {
        "namespace": "^\\Qminecraft\\E$",
        "path": "^\\Qrecipe/hopper_minecart.json\\E$"
      },
      {
        "namespace": "^\\Qminecraft\\E$",
        "path": "^\\Qrecipe/furnace_minecart.json\\E$"
      },
      {
        "namespace": "^\\Qminecraft\\E$",
        "path": "^\\Qrecipe/tnt_minecart.json\\E$"
      },
      {
        "namespace": "^\\Qminecraft\\E$",
        "path": "^\\Qadvancement/recipes/transportation/chest_minecart.json\\E$"
      },
      {
        "namespace": "^\\Qminecraft\\E$",
        "path": "^\\Qadvancement/recipes/transportation/hopper_minecart.json\\E$"
      },
      {
        "namespace": "^\\Qminecraft\\E$",
        "path": "^\\Qadvancement/recipes/transportation/furnace_minecart.json\\E$"
      },
      {
        "namespace": "^\\Qminecraft\\E$",
        "path": "^\\Qadvancement/recipes/transportation/tnt_minecart.json\\E$"
      }
    ]
  },
  "pack": {
    "description": {
      "translate": "pack.sturdy_vehicles.keep_minecart_names.description"
    },
    "pack_format": 57
  }
}