{
  "type": "sturdy_vehicles:splitting",
  "base": {
    "count": 1,
    "id": "minecraft:acacia_boat"
  },
  "category": "misc",
  "composite": "minecraft:acacia_chest_boat",
  "result": {
    "count": 1,
    "id": "minecraft:chest"
  }
}