{
  "type": "sturdy_vehicles:splitting",
  "base": {
    "count": 1,
    "id": "minecraft:minecart"
  },
  "category": "misc",
  "composite": "minecraft:furnace_minecart",
  "result": {
    "count": 1,
    "id": "minecraft:furnace"
  }
}