{
  "schemaVersion": 1,
  "id": "${mod_id}_datagen",
  "version": "${mod_version}",

  "environment": "*",
  "entrypoints": {
    "fabric-datagen": [
      "${maven_group}.${mod_id}.datagen.DataGen"
    ]
  },
  "mixins": [
    "${mod_id}_datagen.mixins.json"
  ],
  "depends": {
    "${mod_id}": "*"
  }
}
