{
  "type": "sturdy_vehicles:combining",
  "addition": "minecraft:chest",
  "base": "minecraft:bamboo_raft",
  "category": "misc",
  "result": {
    "count": 1,
    "id": "minecraft:bamboo_chest_raft"
  }
}