{
  "schemaVersion": 1,
  "id": "${MOD_NAME_SNAKE_CASE}",
  "version": "${VERSION}",

  "name": "${MOD_NAME}",
  "description": "${DESCRIPTION}",
  "authors": [ "${AUTHOR}" ],
  "contact": {
    "homepage": "https://modrinth.com/mod/${MOD_NAME_KEBAB_CASE}",
    "sources": "https://gitlab.com/${AUTHOR}-group/minecraft-mods/${MOD_NAME_SNAKE_CASE}",
    "issues": "https://gitlab.com/${AUTHOR}-group/minecraft-mods/${MOD_NAME_SNAKE_CASE}/-/issues"
  },

  "custom": {
    "modmenu": {
      "links": {
        "modmenu.discord": "https://discord.gg/xABmPngXAH"
      },
      "badges": [
        "library"
      ]
    }
  },

  "license": "MIT",
  "icon": "assets/${MOD_NAME_SNAKE_CASE}/icon.png",

  "environment": "*",
  "entrypoints": {
    "main": [
      "${GROUP}.${MOD_NAME_SNAKE_CASE}.Init"
    ]
  },
  "mixins": [
    "${MOD_NAME_SNAKE_CASE}.mixins.json"
  ],
  "depends": {
    "minecraft": ">=${MIN_MINECRAFT_VERSION} <=${MINECRAFT_VERSION}",
    "fabricloader": ">=${MIN_FABRIC_LOADER_VERSION}",
    "fabric": ">=${MIN_FABRIC_API_VERSION}"
  }
}
