<svg width="20" height="20" viewBox="0 0 20 20" fill="none" xmlns="http://www.w3.org/2000/svg">
<path d="M14.21 10.3626C14.4193 10.3214 14.6383 10.3422 14.8375 10.4186C15.183 10.5511 15.5572 10.6253 15.9495 10.6253C16.3417 10.6253 16.7159 10.5511 17.0614 10.4186C17.2606 10.3422 17.4796 10.3214 17.6889 10.3626C18.8391 10.589 19.707 11.6006 19.707 12.8173V14.0388C19.707 14.5576 19.2864 14.9782 18.7677 14.9782H13.1313C12.6125 14.9782 12.192 14.5576 12.192 14.0388V12.8173C12.1919 11.6006 13.0598 10.589 14.21 10.3626Z" fill="#EE7326"/>
<path d="M18.7677 14.0704V10.8672C19.3395 11.3254 19.707 12.0276 19.707 12.8178V14.3835C19.707 14.9023 19.2864 15.3229 18.7677 15.3229H13.1313C12.6125 15.3229 12.192 14.9023 12.192 14.3835H18.4545C18.6275 14.3835 18.7677 14.2433 18.7677 14.0704Z" fill="#EE7326"/>
<path d="M15.9495 9.06102C15.0848 9.06102 14.3838 8.36004 14.3838 7.49535C14.3838 6.63066 15.0848 5.92969 15.9495 5.92969C16.8142 5.92969 17.5151 6.63066 17.5151 7.49535C17.5151 8.36004 16.8142 9.06102 15.9495 9.06102Z" fill="#EE7326"/>
<path d="M2.31107 10.3626C2.52037 10.3214 2.73943 10.3422 2.93861 10.4186C3.28416 10.5511 3.65834 10.6253 4.05057 10.6253C4.44279 10.6253 4.81697 10.5511 5.16252 10.4186C5.3617 10.3422 5.58076 10.3214 5.79006 10.3626C6.94022 10.589 7.80814 11.6006 7.80811 12.8173V14.3829C7.80811 14.9017 7.38752 15.3223 6.86873 15.3223H1.2324C0.713575 15.3223 0.293028 14.9017 0.293028 14.3829V12.8173C0.293028 11.6006 1.16092 10.589 2.31107 10.3626Z" fill="#EE7326"/>
<path d="M9.99998 7.80765C8.78942 7.80765 7.80807 6.8263 7.80807 5.61574C7.80807 4.40518 8.78942 3.42383 9.99998 3.42383C11.2105 3.42383 12.1919 4.40518 12.1919 5.61574C12.1919 6.8263 11.2105 7.80765 9.99998 7.80765Z" fill="#EE7326"/>
<path d="M7.48086 9.14343C7.68996 9.08831 7.91586 9.11487 8.10703 9.21597C8.67262 9.51507 9.31559 9.68683 9.99996 9.68683C10.6843 9.68683 11.3273 9.51507 11.8929 9.21597C12.0841 9.11487 12.31 9.08827 12.5191 9.14343C13.5923 9.42636 14.3838 10.4035 14.3838 11.5656V15.3232C14.3838 16.015 13.823 16.5757 13.1313 16.5757H6.86863C6.17688 16.5757 5.6161 16.015 5.6161 15.3232V11.5656C5.6161 10.4035 6.40754 9.42636 7.48086 9.14343Z" fill="#EE7326"/>
<path d="M4.05055 9.06102C3.18585 9.06102 2.48488 8.36004 2.48488 7.49535C2.48488 6.63066 3.18585 5.92969 4.05055 5.92969C4.91524 5.92969 5.61621 6.63066 5.61621 7.49535C5.61621 8.36004 4.91524 9.06102 4.05055 9.06102Z" fill="#EE7326"/>
<path d="M13.1313 15.6364C13.3041 15.6364 13.4444 15.4959 13.4444 15.3232V9.61133C14.0168 10.0704 14.3838 10.7748 14.3838 11.5657V15.3233C14.3838 16.015 13.823 16.5758 13.1313 16.5758H6.86864C6.28567 16.5758 5.80008 16.1757 5.66039 15.6364H13.1313V15.6364Z" fill="#EE7326"/>
<path d="M9.21713 7.02531C10.4277 7.02531 11.409 6.04395 11.409 4.8334C11.409 4.42914 11.2977 4.05168 11.1068 3.72656C11.7553 4.10727 12.1919 4.80996 12.1919 5.61625C12.1919 6.8268 11.2105 7.80816 9.99998 7.80816C9.19369 7.80816 8.491 7.37156 8.11029 6.72309C8.43541 6.91395 8.81287 7.02531 9.21713 7.02531Z" fill="#EE7326"/>
<path d="M3.26774 8.27805C4.13242 8.27805 4.8334 7.57707 4.8334 6.71238C4.8334 6.48293 4.78133 6.26668 4.69266 6.07031C5.23629 6.31582 5.61621 6.85996 5.61621 7.49519C5.61621 8.35988 4.91527 9.06086 4.05055 9.06086C3.41531 9.06086 2.87113 8.6809 2.62563 8.13727C2.82207 8.22598 3.03832 8.27805 3.26774 8.27805Z" fill="#EE7326"/>
<path d="M15.1667 8.27805C16.0313 8.27805 16.7323 7.57707 16.7323 6.71238C16.7323 6.48293 16.6803 6.26668 16.5916 6.07031C17.1352 6.31582 17.5151 6.85996 17.5151 7.49519C17.5151 8.35988 16.8142 9.06086 15.9495 9.06086C15.3142 9.06086 14.7701 8.6809 14.5246 8.13727C14.721 8.22598 14.9372 8.27805 15.1667 8.27805Z" fill="#EE7326"/>
<path d="M9.99998 8.10062C8.62983 8.10062 7.5151 6.9859 7.5151 5.61574C7.5151 4.24559 8.62983 3.13086 9.99998 3.13086C11.3701 3.13086 12.4849 4.24559 12.4849 5.61574C12.4849 6.9859 11.3701 8.10062 9.99998 8.10062ZM9.99998 3.7168C8.95291 3.7168 8.10104 4.56867 8.10104 5.61574C8.10104 6.66281 8.95291 7.51469 9.99998 7.51469C11.0471 7.51469 11.8989 6.66281 11.8989 5.61574C11.8989 4.56867 11.0471 3.7168 9.99998 3.7168Z" fill="#EE7326"/>
<path d="M7.40621 8.85966C7.68379 8.78645 7.98918 8.82177 8.24399 8.95653C8.79211 9.24641 9.38293 9.39341 9.99996 9.39341C10.617 9.39341 11.2078 9.24641 11.7559 8.95653C12.0107 8.82181 12.3161 8.78649 12.5937 8.8597C13.8202 9.18298 14.6768 10.2955 14.6768 11.5652V15.3227C14.6768 16.1749 13.9834 16.8683 13.1313 16.8683H6.86871C6.01653 16.8683 5.32324 16.1749 5.32324 15.3227V11.5651C5.32317 10.2955 6.17977 9.18294 7.40621 8.85966ZM5.9091 15.3227C5.9091 15.8518 6.33957 16.2823 6.86863 16.2823H13.1313C13.6604 16.2823 14.0908 15.8518 14.0908 15.3227V11.5651C14.0908 10.5613 13.4137 9.68177 12.4443 9.42622C12.3975 9.41388 12.3491 9.40782 12.3006 9.40782C12.207 9.40782 12.113 9.43048 12.0298 9.47446C11.3964 9.80946 10.7134 9.97931 9.99992 9.97931C9.28641 9.97931 8.60344 9.80946 7.97004 9.47446C7.84371 9.40767 7.69266 9.39005 7.55555 9.42622C6.58617 9.68177 5.9091 10.5613 5.9091 11.5651V15.3227Z" fill="#EE7326"/>
<path d="M4.05055 9.35398C3.0257 9.35398 2.19191 8.5202 2.19191 7.49535C2.19191 6.47051 3.0257 5.63672 4.05055 5.63672C5.07539 5.63672 5.90918 6.47047 5.90918 7.49535C5.90918 8.52023 5.07543 9.35398 4.05055 9.35398ZM4.05055 6.22266C3.34879 6.22266 2.77785 6.79355 2.77785 7.49535C2.77785 8.19715 3.34879 8.76805 4.05055 8.76805C4.7523 8.76805 5.32324 8.19711 5.32324 7.49535C5.32324 6.79359 4.75234 6.22266 4.05055 6.22266Z" fill="#EE7326"/>
<path d="M2.25451 10.0753C2.5167 10.0237 2.78959 10.0479 3.04353 10.1452C3.45611 10.3034 3.89396 10.3629 4.33412 10.3181C4.49525 10.3018 4.63885 10.419 4.65521 10.58C4.67158 10.7409 4.55435 10.8847 4.39338 10.9011C3.86197 10.9551 3.33193 10.8834 2.83373 10.6923C2.68283 10.6345 2.52166 10.6199 2.36767 10.6502C1.33533 10.8535 0.586033 11.7649 0.586033 12.8174V14.3831C0.586033 14.7395 0.875994 15.0295 1.23244 15.0295H4.36373C4.52553 15.0295 4.6567 15.1607 4.6567 15.3225C4.6567 15.4843 4.52553 15.6154 4.36373 15.6154H1.23244C0.552908 15.6154 9.48696e-05 15.0626 9.48696e-05 14.3831V12.8174C9.48696e-05 11.4857 0.948182 10.3325 2.25451 10.0753Z" fill="#EE7326"/>
<path d="M15.9495 9.35398C14.9246 9.35398 14.0908 8.5202 14.0908 7.49535C14.0908 6.47051 14.9246 5.63672 15.9495 5.63672C16.9743 5.63672 17.8081 6.47047 17.8081 7.49535C17.8081 8.52023 16.9743 9.35398 15.9495 9.35398ZM15.9495 6.22266C15.2477 6.22266 14.6768 6.79355 14.6768 7.49535C14.6768 8.19715 15.2477 8.76805 15.9495 8.76805C16.6512 8.76805 17.2222 8.19711 17.2222 7.49535C17.2222 6.79359 16.6512 6.22266 15.9495 6.22266Z" fill="#EE7326"/>
<path d="M17.6324 10.6502C17.4785 10.6199 17.3173 10.6345 17.1663 10.6923C16.6682 10.8833 16.1381 10.9551 15.6067 10.901C15.4457 10.8846 15.3285 10.7409 15.3448 10.5799C15.3612 10.4189 15.5052 10.3016 15.6659 10.3181C16.1061 10.3629 16.544 10.3034 16.9565 10.1452C17.2105 10.0479 17.4833 10.0237 17.7455 10.0753C19.0519 10.3325 20 11.4857 20 12.8174V14.3831C20 15.0626 19.4472 15.6154 18.7677 15.6154H15.6364C15.4746 15.6154 15.3434 15.4843 15.3434 15.3225C15.3434 15.1607 15.4746 15.0295 15.6364 15.0295H18.7677C19.1241 15.0295 19.4141 14.7395 19.4141 14.3831V12.8174C19.4141 11.7649 18.6648 10.8535 17.6324 10.6502Z" fill="#EE7326"/>
</svg>
