<svg width="264" height="266" viewBox="0 0 264 266" fill="none" xmlns="http://www.w3.org/2000/svg">
<g clip-path="url(#clip0_1998_18972)">
<path d="M132 266C204.902 266 264 231.964 264 189.978C264 147.992 204.902 113.955 132 113.955C59.0984 113.955 0 147.992 0 189.978C0 231.964 59.0984 266 132 266Z" fill="#F5F5F5"/>
<path d="M177.998 243.212C193.763 243.212 206.544 235.852 206.544 226.772C206.544 217.692 193.763 210.332 177.998 210.332C162.233 210.332 149.453 217.692 149.453 226.772C149.453 235.852 162.233 243.212 177.998 243.212Z" fill="#E0E0E0"/>
<path d="M163.165 171.109L86.8119 215.09C84.6638 216.328 80.9116 216.172 78.4313 214.744L51.3236 199.132C48.8432 197.703 48.5738 195.542 50.7219 194.305L127.075 150.323C129.223 149.086 132.975 149.241 135.455 150.67L162.563 166.282C165.044 167.711 165.313 169.872 163.165 171.109Z" fill="#E0E0E0"/>
<path d="M63.1782 177.977L60.2079 184.25C60.2079 184.25 57.2103 174.575 50.2938 167.523C48.6589 165.865 46.7272 164.528 44.5987 163.579C43.6528 163.04 37.218 160.099 38.2566 155.991C39.2954 151.882 48.6255 152.221 56.8651 164.741C59.5203 168.87 61.6415 173.317 63.1782 177.977Z" fill="#EE7326"/>
<path opacity="0.5" d="M63.1782 177.977L60.2079 184.25C60.2079 184.25 57.2103 174.575 50.2938 167.523C48.6589 165.865 46.7272 164.528 44.5987 163.579C43.6528 163.04 37.218 160.099 38.2566 155.991C39.2954 151.882 48.6255 152.221 56.8651 164.741C59.5203 168.87 61.6415 173.317 63.1782 177.977Z" fill="black"/>
<path d="M61.7972 181.165C61.7366 181.165 61.6778 181.145 61.63 181.108C61.5822 181.071 61.548 181.019 61.5329 180.961C61.5162 180.897 59.8261 174.512 54.0432 166.348C48.2986 158.238 41.0169 156.835 40.9441 156.821C40.8729 156.808 40.8098 156.768 40.7686 156.709C40.7274 156.649 40.7115 156.576 40.7243 156.505C40.7306 156.47 40.7439 156.436 40.7633 156.406C40.7827 156.376 40.8079 156.35 40.8373 156.33C40.8668 156.309 40.9 156.295 40.9351 156.287C40.9702 156.28 41.0063 156.279 41.0416 156.286C41.1163 156.299 48.6085 157.732 54.4889 166.034C60.3341 174.286 62.0447 180.761 62.0613 180.825C62.0793 180.895 62.0687 180.969 62.0319 181.031C61.9951 181.093 61.9351 181.138 61.865 181.156C61.8428 181.162 61.8201 181.165 61.7972 181.165Z" fill="white"/>
<path d="M60.8857 182.858L56.0196 193.282C56.0196 193.282 51.8929 195.306 49.7467 191.593C47.6005 187.881 48.5499 186.006 45.5871 185.763C42.6241 185.52 42.0644 185.754 41.1085 184.176C40.1526 182.599 40.7181 181.236 40.784 180.305C40.8501 179.375 41.3203 177.194 39.1151 176.015C36.9101 174.836 34.4136 173.949 35.7321 171.808C36.519 170.529 38.8561 169.847 41.0419 170.316C43.2277 170.785 44.9327 171.03 46.3431 170.519C47.7535 170.007 50.264 168.318 51.5998 170.431C52.9355 172.544 52.891 173.622 54.0212 174.191C56.1504 175.263 60.8117 173.424 60.8857 182.858Z" fill="#EE7326"/>
<path opacity="0.2" d="M60.8857 182.858L56.0196 193.282C56.0196 193.282 51.8929 195.306 49.7467 191.593C47.6005 187.881 48.5499 186.006 45.5871 185.763C42.6241 185.52 42.0644 185.754 41.1085 184.176C40.1526 182.599 40.7181 181.236 40.784 180.305C40.8501 179.375 41.3203 177.194 39.1151 176.015C36.9101 174.836 34.4136 173.949 35.7321 171.808C36.519 170.529 38.8561 169.847 41.0419 170.316C43.2277 170.785 44.9327 171.03 46.3431 170.519C47.7535 170.007 50.264 168.318 51.5998 170.431C52.9355 172.544 52.891 173.622 54.0212 174.191C56.1504 175.263 60.8117 173.424 60.8857 182.858Z" fill="black"/>
<path d="M58.9043 187.376C58.8563 187.376 58.8092 187.363 58.7677 187.339C58.7262 187.315 58.6918 187.281 58.6679 187.239C58.595 187.113 51.2035 174.555 37.471 172.43C37.3995 172.419 37.3354 172.38 37.2927 172.322C37.25 172.264 37.2322 172.191 37.2432 172.12C37.2483 172.084 37.2605 172.05 37.2791 172.019C37.2976 171.988 37.3221 171.962 37.3512 171.941C37.3802 171.919 37.4132 171.904 37.4482 171.896C37.4832 171.888 37.5195 171.886 37.555 171.892C51.551 174.058 59.0666 186.839 59.1407 186.968C59.1586 186.999 59.1702 187.033 59.1748 187.069C59.1795 187.104 59.177 187.14 59.1677 187.175C59.1583 187.209 59.1423 187.241 59.1204 187.27C59.0984 187.298 59.0712 187.322 59.0401 187.339C58.9988 187.363 58.9519 187.376 58.9043 187.376Z" fill="white"/>
<path d="M50.2336 177.955C50.186 177.955 50.1393 177.943 50.098 177.919C50.0567 177.895 50.0224 177.861 49.9984 177.82C49.3686 176.777 48.9628 175.614 48.8066 174.406C48.6504 173.198 48.7473 171.971 49.091 170.802C49.1029 170.768 49.1213 170.737 49.1453 170.71C49.1693 170.684 49.1983 170.662 49.2307 170.647C49.2631 170.632 49.2982 170.623 49.3339 170.621C49.3697 170.62 49.4054 170.625 49.4391 170.637C49.4729 170.649 49.5039 170.668 49.5305 170.692C49.5571 170.716 49.5787 170.745 49.5941 170.777C49.6095 170.809 49.6183 170.844 49.6201 170.88C49.6219 170.916 49.6167 170.951 49.6046 170.985C49.2967 172.08 49.2145 173.226 49.3631 174.354C49.5116 175.481 49.8878 176.567 50.4689 177.546C50.487 177.577 50.4989 177.611 50.5038 177.646C50.5088 177.682 50.5067 177.718 50.4976 177.752C50.4885 177.787 50.4727 177.819 50.451 177.848C50.4294 177.876 50.4023 177.9 50.3713 177.918C50.3296 177.942 50.282 177.955 50.2336 177.955Z" fill="white"/>
<path d="M44.1743 182.747C44.1364 182.747 44.099 182.739 44.0643 182.724C44.0297 182.708 43.9986 182.686 43.9731 182.658C43.9243 182.605 43.8986 182.534 43.9019 182.462C43.9051 182.39 43.937 182.322 43.9904 182.273C48.4553 178.208 52.1801 179.042 52.3357 179.079C52.3705 179.087 52.4033 179.102 52.4322 179.123C52.4612 179.144 52.4857 179.171 52.5044 179.201C52.523 179.232 52.5355 179.265 52.5411 179.3C52.5467 179.336 52.5453 179.372 52.5369 179.406C52.529 179.441 52.5142 179.474 52.4934 179.503C52.4725 179.533 52.4461 179.557 52.4155 179.576C52.385 179.595 52.3511 179.607 52.3156 179.613C52.2802 179.618 52.244 179.617 52.2091 179.608C52.1727 179.6 48.5955 178.817 44.3583 182.676C44.3081 182.721 44.2424 182.747 44.1743 182.747Z" fill="white"/>
<path d="M60.9552 50.9586C60.9551 49.1219 61.4398 47.3175 62.3604 45.7268C63.281 44.1362 64.6052 42.8153 66.1998 41.8969L132.9 3.48245C133.345 3.22671 133.841 3.07364 134.353 3.03449C134.865 2.99533 135.379 3.07108 135.858 3.25618C136.336 3.44127 136.767 3.73101 137.119 4.10408C137.47 4.47715 137.734 4.92408 137.889 5.41202C137.71 4.63241 137.375 3.89704 136.903 3.25016C136.431 2.60327 135.833 2.05823 135.145 1.64784L134.908 1.50666C133.248 0.520573 131.352 2.1908e-05 129.42 0V0.00101026C128.803 -0.00667127 128.195 0.153429 127.661 0.464154L60.9612 38.8786C59.3666 39.7969 58.0425 41.1178 57.1218 42.7085C56.2012 44.2991 55.7165 46.1035 55.7166 47.9403V191.83C55.7166 192.432 55.8753 193.022 56.1768 193.543C56.4782 194.064 56.9118 194.497 57.434 194.797C57.9562 195.098 58.5484 195.256 59.1514 195.256C59.7543 195.256 60.3466 195.098 60.8687 194.797L60.9552 194.748V50.9586Z" fill="#37474F"/>
<path d="M132.807 159.401L66.1071 197.816C65.585 198.116 64.9927 198.275 64.3898 198.275C63.7869 198.275 63.1946 198.116 62.6724 197.816C62.1503 197.515 61.7167 197.082 61.4152 196.562C61.1138 196.041 60.9551 195.45 60.9551 194.848V50.9586C60.9551 49.1219 61.4397 47.3175 62.3603 45.7268C63.281 44.1362 64.6051 42.8153 66.1997 41.8969L132.9 3.48245C133.422 3.18174 134.014 3.02343 134.617 3.02344C135.22 3.02344 135.812 3.18176 136.334 3.48248C136.857 3.78319 137.29 4.21572 137.592 4.73657C137.893 5.25742 138.052 5.84825 138.052 6.44967V150.34C138.052 152.176 137.567 153.981 136.646 155.571C135.726 157.162 134.402 158.483 132.807 159.401Z" fill="#455A64"/>
<path d="M60.9552 194.849V50.959C60.9558 49.3909 61.3101 47.843 61.992 46.43L56.8348 43.2441C56.0998 44.7011 55.7169 46.3095 55.7166 47.9406V193.032C55.7166 193.603 55.8653 194.164 56.1481 194.661C56.431 195.157 56.8382 195.572 57.33 195.864L59.9891 197.444C60.9104 197.991 61.9628 198.28 63.0351 198.28H64.3483V198.279C63.4441 198.267 62.5811 197.901 61.946 197.259C61.3109 196.617 60.9549 195.751 60.9552 194.849Z" fill="#263238"/>
<path d="M130.512 17.3125V138.253C130.512 139.875 130.084 141.469 129.271 142.873C128.458 144.278 127.289 145.444 125.881 146.255L66.9806 180.178C66.5364 180.435 66.0334 180.574 65.5198 180.582C65.6905 180.973 65.9422 181.324 66.2583 181.611C66.5743 181.899 66.9477 182.117 67.354 182.25C67.7603 182.384 68.1902 182.43 68.6157 182.387C69.0413 182.343 69.4528 182.21 69.8233 181.997L128.723 148.075C130.131 147.264 131.301 146.098 132.114 144.693C132.927 143.288 133.354 141.695 133.354 140.073V20.3303C133.355 19.5609 133.061 18.8204 132.532 18.2596C132.004 17.6989 131.282 17.3602 130.512 17.3125Z" fill="#37474F"/>
<path d="M65.5198 180.582C66.0334 180.574 66.5364 180.435 66.9807 180.178L125.881 146.255C127.289 145.444 128.458 144.278 129.271 142.873C130.084 141.469 130.512 139.875 130.512 138.253V17.3125C129.92 17.3172 129.337 17.453 128.805 17.7101L69.9051 51.6322C68.497 52.4432 67.3277 53.6096 66.5147 55.0142C65.7018 56.4189 65.2737 58.0122 65.2737 59.6342V179.377C65.2724 179.797 65.3589 180.213 65.5279 180.598L65.5198 180.582Z" fill="#EE7326"/>
<g opacity="0.5">
<path d="M65.5198 180.582C66.0334 180.574 66.5364 180.435 66.9807 180.178L125.881 146.255C127.289 145.444 128.458 144.278 129.271 142.873C130.084 141.469 130.512 139.875 130.512 138.253V17.3125C129.92 17.3172 129.337 17.453 128.805 17.7101L69.9051 51.6322C68.497 52.4432 67.3277 53.6096 66.5147 55.0142C65.7018 56.4189 65.2737 58.0122 65.2737 59.6342V179.377C65.2724 179.797 65.3589 180.213 65.5279 180.598L65.5198 180.582Z" fill="white"/>
</g>
<path d="M90.1688 33.9076C90.1489 34.2747 90.0425 34.632 89.8582 34.9504C89.6739 35.2688 89.417 35.5394 89.1082 35.7403C88.5225 36.0775 88.0476 35.8041 88.0476 35.1293C88.0676 34.7622 88.174 34.405 88.3583 34.0866C88.5425 33.7682 88.7995 33.4976 89.1082 33.2968C89.694 32.9595 90.1688 33.233 90.1688 33.9076Z" fill="#263238"/>
<path d="M94.1144 31.6343C94.0945 32.0014 93.9881 32.3587 93.8038 32.6771C93.6195 32.9955 93.3626 33.266 93.0538 33.4668C92.4681 33.8042 91.9932 33.5307 91.9932 32.856C92.0131 32.4889 92.1195 32.1316 92.3038 31.8132C92.4881 31.4948 92.7451 31.2242 93.0538 31.0234C93.6396 30.6861 94.1144 30.9595 94.1144 31.6343Z" fill="#263238"/>
<path d="M110.041 23.684L97.2118 31.0727C96.7045 31.3649 96.2932 31.0547 96.2932 30.3799C96.2984 30.0368 96.3843 29.6997 96.5438 29.3956C96.7033 29.0916 96.9321 28.8291 97.2118 28.6293L110.041 21.2408C110.548 20.9486 110.959 21.2587 110.959 21.9334C110.954 22.2766 110.868 22.6137 110.709 22.9177C110.549 23.2218 110.32 23.4842 110.041 23.684Z" fill="#263238"/>
<path d="M107.87 163.941C108.637 163.941 109.132 164.751 109.132 166.006C109.132 167.978 107.896 170.355 106.432 171.198L100.296 174.732C100.022 174.905 99.7067 175.003 99.3825 175.016C98.6161 175.016 98.1209 174.206 98.1209 172.951C98.1209 170.98 99.3571 168.602 100.82 167.759L106.956 164.225C107.231 164.053 107.546 163.955 107.87 163.941ZM107.87 163.418C107.454 163.431 107.048 163.554 106.694 163.773L100.558 167.306C98.9226 168.248 97.5967 170.776 97.5967 172.951C97.5967 174.571 98.3316 175.539 99.3825 175.539C99.7988 175.526 100.204 175.404 100.558 175.185L106.694 171.651C108.33 170.709 109.656 168.181 109.656 166.006C109.656 164.386 108.921 163.418 107.87 163.418Z" fill="#263238"/>
<path d="M73.9624 68.1119V203.674C73.9624 206.129 74.8669 207.779 76.2495 208.321L76.2883 208.333L76.2947 208.34L82.1674 211.549L82.1351 206.336L81.4826 65.766L75.2804 62.6016C74.4513 64.3232 74.0019 66.2022 73.9624 68.1119Z" fill="#E6E6E6"/>
<path d="M82.4863 212.084L76.13 208.609C74.5546 207.96 73.6465 206.128 73.6465 203.674V68.1117C73.6872 66.1561 74.1467 64.2319 74.9941 62.468L75.133 62.1719L81.798 65.5725L81.7986 65.7644L82.4511 206.334L82.4863 212.084ZM76.4466 208.064L81.848 211.016L81.819 206.337L81.1671 65.9593L75.4318 63.0327C74.7064 64.6303 74.3141 66.3583 74.2786 68.1117V203.674C74.2786 205.888 75.0589 207.515 76.3651 208.027L76.446 208.065L76.4466 208.064Z" fill="#E6E6E6"/>
<path d="M75.2803 62.6015L81.4825 65.7659L147.859 27.2456L152.291 24.6742L146.167 21.2326L145.992 21.1295V21.1231C145.017 20.5366 143.737 20.5753 142.329 21.3873L79.4991 57.5746C77.6254 58.7972 76.1573 60.5466 75.2803 62.6015Z" fill="#E0E0E0"/>
<path d="M81.4825 66.0813C81.4325 66.0814 81.3831 66.0696 81.3386 66.0468L75.1367 62.8824C75.0639 62.8452 75.0084 62.7814 74.9818 62.7043C74.9552 62.6272 74.9596 62.5428 74.994 62.4689C75.8983 60.3551 77.4112 58.5567 79.341 57.3015L142.171 21.1143C143.625 20.2765 145.04 20.1823 146.155 20.8532C146.172 20.863 146.187 20.8743 146.202 20.8871L146.327 20.9619L152.446 24.3998C152.495 24.427 152.535 24.4665 152.563 24.5144C152.592 24.5622 152.607 24.6167 152.607 24.6723C152.608 24.7278 152.593 24.7825 152.566 24.8307C152.538 24.8789 152.498 24.919 152.45 24.9469L81.6411 66.0385C81.593 66.0667 81.5382 66.0815 81.4825 66.0813ZM75.6983 62.4605L81.4726 65.4071L151.655 24.6788L145.831 21.4006C145.814 21.3909 145.798 21.3795 145.784 21.3667C144.881 20.8501 143.713 20.9542 142.487 21.6605L79.6571 57.8477C77.922 58.9755 76.5479 60.5765 75.6983 62.4605Z" fill="#E0E0E0"/>
<path d="M80.0481 71.5207V206.47C80.0481 208.597 80.7265 210.124 81.8119 210.84L82.1673 211.033C83.1105 211.478 84.2929 211.381 85.5785 210.64L115.95 193.149L148.408 173.66C150.072 172.623 151.45 171.188 152.417 169.485C153.384 167.782 153.909 165.866 153.945 163.909V28.966C153.945 26.9101 153.312 25.4214 152.291 24.6739C152.119 24.544 151.93 24.4378 151.729 24.3581C151.18 24.165 150.593 24.1041 150.016 24.1803C149.439 24.2564 148.888 24.4675 148.408 24.7963L85.5785 61.5935C83.8042 62.5157 82.3697 63.9768 81.4824 65.7656C80.5798 67.5532 80.0897 69.5196 80.0481 71.5207Z" fill="#FAFAFA"/>
<path d="M148.409 173.662C135.48 181.355 101.846 201.379 85.1969 211.383C84.7007 211.68 84.1341 211.842 83.555 211.849C82.976 211.857 82.4052 211.711 81.9012 211.427C81.3972 211.142 80.978 210.729 80.6865 210.23C80.395 209.731 80.2417 209.163 80.2422 208.586V69.8207C80.2422 68.2419 80.6562 66.6906 81.443 65.3207C82.2299 63.9509 83.3623 62.8102 84.7278 62.0119L148.711 24.606C149.208 24.3155 149.773 24.161 150.349 24.1582C150.925 24.1554 151.491 24.3044 151.991 24.59C152.49 24.8757 152.906 25.2879 153.194 25.785C153.483 26.2821 153.635 26.8464 153.635 27.4209V164.478C153.636 166.33 153.154 168.149 152.238 169.759C151.322 171.369 150.002 172.713 148.409 173.662Z" fill="#FAFAFA"/>
<path d="M148.249 173.389C138.099 179.429 127.952 185.473 117.807 191.521C111.801 195.103 105.797 198.686 99.7941 202.273C97.0517 203.912 94.31 205.552 91.5689 207.193C90.37 207.911 89.1714 208.629 87.973 209.348C86.867 210.011 85.6881 210.956 84.4663 211.379C82.4379 212.082 80.6116 210.464 80.5582 208.466C80.5496 208.144 80.5582 207.82 80.5582 207.498V80.2728C80.5582 76.8842 80.5503 73.4954 80.5582 70.1067C80.5348 68.5042 80.9405 66.9245 81.7335 65.5306C82.5264 64.1367 83.678 62.9792 85.0691 62.1775C86.5356 61.3127 88.0088 60.4589 89.4785 59.5997C96.3687 55.5715 103.259 51.5433 110.149 47.5151C118.313 42.7422 126.477 37.9693 134.642 33.1964C139.287 30.4804 143.921 27.744 148.579 25.0484C150.021 24.2136 151.837 24.2954 152.84 25.8019C153.197 26.4023 153.364 27.0967 153.319 27.7936C153.323 29.0028 153.319 30.212 153.319 31.4212V163.949C153.377 165.827 152.94 167.688 152.05 169.345C151.16 171.002 149.849 172.397 148.249 173.389C147.903 173.601 148.22 174.147 148.568 173.934C150.253 172.895 151.636 171.436 152.58 169.699C153.524 167.963 153.997 166.011 153.951 164.036V37.4696C153.951 34.1746 153.986 30.8774 153.951 27.5826C153.964 26.9244 153.796 26.2753 153.468 25.7045C153.139 25.1337 152.661 24.6628 152.084 24.3419C151.508 24.021 150.855 23.8623 150.196 23.8826C149.536 23.9029 148.895 24.1016 148.339 24.4574C146.799 25.3435 145.271 26.2512 143.737 27.148C136.657 31.2871 129.577 35.4262 122.497 39.5652C114.259 44.3813 106.021 49.1974 97.7833 54.0135C93.4134 56.5683 89.0294 59.1008 84.6729 61.6782C83.2108 62.5358 82.0018 63.7635 81.1682 65.2371C80.3347 66.7106 79.9062 68.3777 79.9261 70.0695C79.9228 71.2043 79.9261 72.3391 79.9261 73.4739V207.926C79.9261 208.142 79.9193 208.36 79.9261 208.577C79.9331 209.141 80.072 209.695 80.3318 210.196C80.5915 210.696 80.965 211.13 81.4223 211.461C81.8796 211.792 82.4081 212.012 82.9658 212.104C83.5235 212.195 84.0948 212.155 84.6344 211.987C85.8276 211.589 86.9542 210.695 88.0289 210.05C89.251 209.317 90.4733 208.585 91.696 207.852C94.4286 206.216 97.1621 204.58 99.8964 202.947C111.85 195.802 123.811 188.67 135.778 181.548C140.041 179.009 144.304 176.471 148.568 173.934C148.638 173.89 148.687 173.821 148.707 173.742C148.726 173.662 148.714 173.578 148.672 173.508C148.631 173.437 148.564 173.385 148.485 173.363C148.406 173.341 148.321 173.35 148.249 173.389Z" fill="#EBEBEB"/>
<path d="M84.7278 62.0119L148.711 24.606C149.208 24.3155 149.773 24.161 150.349 24.1582C150.925 24.1554 151.491 24.3044 151.991 24.59C152.49 24.8757 152.906 25.2879 153.194 25.785C153.483 26.2821 153.635 26.8464 153.635 27.4209V33.4412L153.616 33.4424L80.2422 75.7005V69.8206C80.2422 68.2418 80.6562 66.6905 81.4431 65.3207C82.23 63.9508 83.3624 62.8102 84.7278 62.0119Z" fill="#EBEBEB"/>
<path d="M128.688 94.8156C135.177 83.6044 135.177 71.4864 128.688 67.7493C122.199 64.0122 111.679 70.0712 105.19 81.2824C98.7009 92.4936 98.7009 104.612 105.19 108.349C111.678 112.086 122.199 106.027 128.688 94.8156Z" fill="#EE7326"/>
<path opacity="0.5" d="M128.688 94.8156C135.177 83.6044 135.177 71.4864 128.688 67.7493C122.199 64.0122 111.679 70.0712 105.19 81.2824C98.7009 92.4936 98.7009 104.612 105.19 108.349C111.678 112.086 122.199 106.027 128.688 94.8156Z" fill="white"/>
<path d="M113.958 88.1221C113.76 88.1221 113.571 88.0437 113.431 87.9042C113.291 87.7647 113.212 87.5755 113.212 87.3782V82.4766C113.267 81.314 113.601 80.1815 114.184 79.1735C114.767 78.1656 115.584 77.3115 116.566 76.6827C116.978 76.395 117.461 76.2238 117.964 76.1871C118.466 76.1505 118.969 76.2497 119.419 76.4744C119.839 76.7511 120.177 77.1359 120.396 77.588C120.615 78.0402 120.708 78.543 120.665 79.0434V83.945C120.665 84.0427 120.646 84.1395 120.608 84.2297C120.571 84.32 120.516 84.402 120.446 84.4711C120.377 84.5402 120.295 84.595 120.204 84.6324C120.114 84.6698 120.017 84.689 119.919 84.689C119.821 84.689 119.724 84.6698 119.634 84.6324C119.543 84.595 119.461 84.5402 119.392 84.4711C119.322 84.402 119.268 84.32 119.23 84.2297C119.193 84.1395 119.173 84.0427 119.173 83.945V79.0434C119.205 78.8053 119.175 78.5631 119.088 78.3393C119 78.1155 118.858 77.9173 118.673 77.763C118.447 77.6806 118.204 77.6565 117.966 77.6929C117.728 77.7293 117.503 77.825 117.312 77.9712C116.558 78.4704 115.93 79.137 115.478 79.9186C115.025 80.7003 114.76 81.5758 114.704 82.4766V87.3782C114.704 87.5755 114.625 87.7647 114.486 87.9042C114.346 88.0437 114.156 88.1221 113.958 88.1221Z" fill="#37474F"/>
<path d="M122.961 80.7848C122.79 80.7152 122.604 80.6895 122.42 80.7099C122.236 80.7304 122.06 80.7963 121.908 80.9018L111.969 86.6258C111.534 86.9003 111.172 87.2766 110.916 87.7222C110.515 88.365 110.293 89.1027 110.273 89.8594V98.4423C110.25 98.6834 110.283 98.9265 110.369 99.153C110.454 99.3795 110.591 99.5836 110.768 99.7496C110.821 99.7896 110.88 99.823 110.941 99.8493C111.11 99.912 111.292 99.9331 111.471 99.9109C111.65 99.8886 111.821 99.8237 111.969 99.7216L121.908 93.9977C122.425 93.6286 122.847 93.1438 123.142 92.5822C123.436 92.0206 123.595 91.3979 123.605 90.7642V82.1812C123.64 81.9117 123.598 81.6377 123.484 81.3908C123.37 81.1438 123.189 80.9338 122.961 80.7848Z" fill="#EE7326"/>
<path d="M118.069 89.7293L119.026 92.4771L115.659 94.4163L116.502 91.0227L116.621 90.542C116.052 90.5581 115.659 90.1196 115.659 89.3471C115.663 89.0357 115.716 88.7269 115.816 88.4319C116.079 87.6115 116.618 86.9072 117.343 86.4384C118.272 85.9033 119.026 86.3358 119.026 87.408C118.981 88.2642 118.64 89.0784 118.062 89.7132L118.069 89.7293Z" fill="#455A64"/>
<path d="M116.502 91.0225L116.621 90.5417C116.052 90.5579 115.659 90.1193 115.659 89.3469C115.663 89.0355 115.716 88.7266 115.816 88.4316L118.069 89.7291L119.026 92.4769L116.502 91.0225Z" fill="#37474F"/>
<path d="M141.448 119.786L92.4293 148.018C90.4014 149.186 88.7576 147.946 88.7576 145.249V137.841C88.7576 135.144 90.4014 132.011 92.4293 130.843L141.448 102.611C143.476 101.444 145.12 102.683 145.12 105.38V112.788C145.12 115.485 143.476 118.618 141.448 119.786Z" fill="#EE7326"/>
<path d="M101.25 130.176H100.302V138.016H101.25V130.176Z" fill="#FAFAFA"/>
<path d="M103.941 131.726L97.1338 135.646L97.6079 136.465L104.415 132.545L103.941 131.726Z" fill="#FAFAFA"/>
<path d="M98.6064 132.3L98.1323 133.119L102.946 135.891L103.42 135.072L98.6064 132.3Z" fill="#FAFAFA"/>
<path d="M102.772 129.704L97.9583 138.02L98.7792 138.492L103.593 130.177L102.772 129.704Z" fill="#FAFAFA"/>
<path d="M117.413 121.393H116.465V129.233H117.413V121.393Z" fill="#FAFAFA"/>
<path d="M120.105 122.944L113.298 126.865L113.772 127.684L120.579 123.763L120.105 122.944Z" fill="#FAFAFA"/>
<path d="M114.769 123.519L114.295 124.338L119.108 127.11L119.582 126.291L114.769 123.519Z" fill="#FAFAFA"/>
<path d="M118.935 120.923L114.121 129.238L114.942 129.711L119.756 121.395L118.935 120.923Z" fill="#FAFAFA"/>
<path d="M133.575 112.613H132.627V120.454H133.575V112.613Z" fill="#FAFAFA"/>
<path d="M136.269 114.163L129.462 118.084L129.936 118.903L136.743 114.982L136.269 114.163Z" fill="#FAFAFA"/>
<path d="M130.932 114.738L130.458 115.557L135.271 118.329L135.745 117.51L130.932 114.738Z" fill="#FAFAFA"/>
<path d="M135.097 112.139L130.284 120.455L131.105 120.928L135.919 112.612L135.097 112.139Z" fill="#FAFAFA"/>
<path d="M142.906 129.992C143.562 129.992 143.856 130.97 143.856 131.939V139.347C143.856 141.599 142.464 144.304 140.816 145.253L91.7971 173.484C91.5493 173.643 91.2652 173.736 90.9715 173.755C90.3155 173.755 90.0218 172.777 90.0218 171.807V164.4C90.0218 162.147 91.4137 159.442 93.0613 158.494L142.08 130.262C142.328 130.104 142.612 130.011 142.906 129.992ZM142.906 128.73C142.39 128.747 141.887 128.898 141.448 129.17L92.4292 157.401C90.4014 158.569 88.7576 161.702 88.7576 164.4V171.807C88.7576 173.816 89.6688 175.016 90.9715 175.016C91.4877 174.999 91.9904 174.848 92.4292 174.576L141.448 146.345C143.476 145.177 145.12 142.044 145.12 139.347V131.939C145.12 129.931 144.209 128.73 142.906 128.73Z" fill="#EE7326"/>
<path d="M105.689 158.856C105.701 159.72 106.185 159.8 106.745 159.477C107.062 159.299 107.35 159.072 107.597 158.804L107.692 159.211C107.394 159.531 107.049 159.804 106.668 160.02C105.721 160.565 105.155 160.174 105.155 159.105C105.147 158.564 105.275 158.029 105.527 157.551C105.78 157.072 106.148 156.663 106.598 156.362C107.603 155.784 107.869 156.648 107.869 157.299C107.869 157.431 107.856 157.541 107.85 157.611L105.689 158.856ZM107.329 157.45C107.335 157.036 107.183 156.487 106.554 156.849C106.306 157.027 106.1 157.257 105.952 157.524C105.803 157.79 105.716 158.086 105.696 158.391L107.329 157.45Z" fill="#EE7326"/>
<path d="M109.832 155.54C109.832 155.173 109.826 154.877 109.807 154.595L110.303 154.309L110.334 154.877L110.347 154.869C110.537 154.35 110.895 153.91 111.365 153.617C111.791 153.372 112.452 153.284 112.452 154.5V156.616L111.892 156.938V154.895C111.892 154.324 111.708 153.954 111.18 154.258C110.799 154.513 110.531 154.903 110.43 155.349C110.404 155.454 110.391 155.563 110.392 155.671V157.802L109.832 158.124V155.54Z" fill="#EE7326"/>
<path d="M115.278 150.426V151.444L116.08 150.982V151.473L115.278 151.934V153.845C115.278 154.285 115.387 154.471 115.698 154.292C115.814 154.226 115.923 154.149 116.023 154.061L116.048 154.53C115.901 154.676 115.734 154.802 115.552 154.903C115.291 155.053 115.082 155.079 114.948 154.98C114.789 154.881 114.732 154.6 114.732 154.182V152.249L114.255 152.524V152.033L114.732 151.758V150.909L115.278 150.426Z" fill="#EE7326"/>
<path d="M118.253 151.619C118.265 152.483 118.749 152.563 119.308 152.241C119.626 152.063 119.913 151.836 120.16 151.568L120.255 151.974C119.957 152.294 119.613 152.567 119.232 152.783C118.285 153.329 117.719 152.937 117.719 151.868C117.711 151.327 117.839 150.793 118.091 150.314C118.343 149.835 118.711 149.427 119.162 149.126C120.167 148.547 120.433 149.412 120.433 150.063C120.433 150.195 120.42 150.305 120.414 150.375L118.253 151.619ZM119.893 150.214C119.899 149.8 119.747 149.25 119.117 149.613C118.869 149.791 118.663 150.021 118.515 150.288C118.367 150.554 118.279 150.85 118.259 151.154L119.893 150.214Z" fill="#EE7326"/>
<path d="M122.396 148.449C122.396 148.032 122.389 147.677 122.37 147.358L122.86 147.076L122.88 147.761L122.904 147.747C123.017 147.232 123.322 146.779 123.757 146.479C123.806 146.449 123.86 146.426 123.916 146.41V147.018C123.849 147.04 123.785 147.069 123.725 147.106C123.516 147.249 123.341 147.436 123.212 147.654C123.082 147.871 123.002 148.114 122.975 148.365C122.959 148.469 122.951 148.574 122.949 148.68V150.569L122.396 150.888L122.396 148.449Z" fill="#EE7326"/>
<path d="M194.186 124.543C194.186 124.543 198.794 124.234 201.407 130.622C203.032 134.593 205.01 140.73 206.275 144.806C206.659 146.044 206.669 147.367 206.302 148.611C205.936 149.854 205.209 150.962 204.214 151.795L196.18 158.52L193.305 153.305C194.972 151.083 196.806 148.991 198.794 147.048L193.305 130.622L194.186 124.543Z" fill="#FFA8A7"/>
<path d="M196.31 144.05C196.31 144.05 203.629 145.015 205.458 139.383C205.458 139.383 202.322 131.144 200.884 128.406C199.447 125.669 196.505 123.68 194.186 124.544C191.867 125.408 196.31 144.05 196.31 144.05Z" fill="#EE7326"/>
<path opacity="0.4" d="M196.31 144.05C196.31 144.05 203.629 145.015 205.458 139.383C205.458 139.383 202.322 131.144 200.884 128.406C199.447 125.669 196.505 123.68 194.186 124.544C191.867 125.408 196.31 144.05 196.31 144.05Z" fill="white"/>
<path d="M191.427 217.991C191.427 217.991 187.947 215.018 186.597 214.879C185.247 214.74 182.905 217.049 184.883 221.056C185.433 222.171 187.668 223.378 189.065 225.515C190.461 227.651 191.719 229.257 193.86 228.965C196.002 228.673 196.281 227.465 196.142 226.072C195.96 224.796 195.703 223.533 195.373 222.287L191.427 217.991Z" fill="#37474F"/>
<path d="M193.974 228.325C191.767 228.626 190.471 226.971 189.031 224.769C187.592 222.567 185.288 221.322 184.721 220.173C184.491 219.713 184.305 219.233 184.165 218.738C184.269 219.546 184.512 220.33 184.883 221.056C185.433 222.171 187.668 223.378 189.065 225.515C190.461 227.651 191.718 229.257 193.86 228.965C195.501 228.741 196.045 227.979 196.149 227.009C195.865 227.662 195.243 228.152 193.974 228.325Z" fill="#263238"/>
<path d="M189.571 221.809C189.516 221.809 189.461 221.795 189.413 221.769C189.334 221.726 189.275 221.655 189.249 221.57C189.223 221.484 189.232 221.392 189.274 221.313C189.981 220.062 191.158 219.141 192.545 218.755C192.589 218.745 192.634 218.743 192.677 218.751C192.721 218.758 192.763 218.774 192.801 218.798C192.838 218.821 192.871 218.852 192.897 218.888C192.922 218.925 192.94 218.966 192.95 219.009C192.97 219.096 192.954 219.188 192.906 219.263C192.858 219.339 192.782 219.392 192.695 219.412C191.502 219.761 190.49 220.556 189.869 221.631C189.841 221.685 189.798 221.73 189.745 221.761C189.692 221.792 189.632 221.809 189.571 221.809Z" fill="#EBEBEB"/>
<path d="M188.272 220.615C188.216 220.615 188.162 220.601 188.113 220.575C188.034 220.533 187.975 220.462 187.949 220.376C187.923 220.291 187.932 220.199 187.974 220.12C188.682 218.868 189.858 217.948 191.246 217.562C191.289 217.551 191.334 217.55 191.378 217.557C191.422 217.565 191.464 217.581 191.501 217.604C191.539 217.628 191.571 217.659 191.597 217.695C191.623 217.731 191.641 217.772 191.65 217.816C191.66 217.859 191.661 217.903 191.654 217.947C191.646 217.991 191.63 218.032 191.607 218.07C191.583 218.107 191.552 218.14 191.516 218.165C191.48 218.191 191.439 218.209 191.395 218.219C190.202 218.568 189.19 219.363 188.57 220.438C188.541 220.491 188.498 220.536 188.446 220.568C188.393 220.599 188.333 220.615 188.272 220.615Z" fill="#EBEBEB"/>
<path d="M186.787 219.421C186.732 219.421 186.677 219.408 186.629 219.381C186.55 219.339 186.491 219.268 186.465 219.182C186.439 219.097 186.448 219.005 186.49 218.926C187.197 217.675 188.374 216.755 189.761 216.368C189.804 216.358 189.849 216.357 189.893 216.364C189.937 216.371 189.979 216.387 190.016 216.411C190.054 216.435 190.086 216.465 190.112 216.502C190.138 216.538 190.156 216.579 190.165 216.622C190.175 216.665 190.176 216.71 190.169 216.754C190.161 216.797 190.145 216.839 190.121 216.876C190.098 216.914 190.067 216.946 190.031 216.972C189.995 216.997 189.954 217.015 189.91 217.025C188.717 217.374 187.706 218.169 187.086 219.244C187.057 219.298 187.014 219.343 186.961 219.374C186.909 219.405 186.849 219.422 186.787 219.421Z" fill="#EBEBEB"/>
<path d="M172.918 227.733C172.918 227.733 168.257 226.225 166.866 226.641C165.476 227.057 164.115 230.298 167.719 233.444C168.722 234.319 171.426 234.595 173.686 236.132C175.945 237.669 177.849 238.739 179.843 237.573C181.838 236.406 181.675 235.064 181.32 233.609C180.868 231.755 180.505 230.408 180.505 230.408L172.918 227.733Z" fill="#37474F"/>
<path d="M179.692 236.894C177.637 238.096 175.675 236.993 173.346 235.409C171.017 233.825 168.229 233.54 167.196 232.638C166.779 232.278 166.397 231.88 166.055 231.449C166.491 232.205 167.054 232.879 167.719 233.444C168.722 234.319 171.426 234.595 173.686 236.132C175.946 237.669 177.849 238.739 179.843 237.572C181.371 236.679 181.594 235.703 181.297 234.702C181.287 235.464 180.874 236.203 179.692 236.894Z" fill="#263238"/>
<path d="M171.806 232.026C171.795 232.026 171.784 232.025 171.773 232.024C171.684 232.015 171.602 231.972 171.545 231.903C171.488 231.834 171.461 231.746 171.469 231.657C171.651 230.138 172.43 228.753 173.636 227.806C173.709 227.755 173.799 227.734 173.888 227.749C173.976 227.764 174.055 227.813 174.107 227.886C174.159 227.959 174.179 228.049 174.164 228.137C174.149 228.225 174.1 228.304 174.027 228.356C172.987 229.193 172.312 230.399 172.142 231.721C172.134 231.805 172.095 231.882 172.033 231.938C171.971 231.994 171.89 232.025 171.806 232.026Z" fill="#EBEBEB"/>
<path d="M173.731 232.653C173.72 232.653 173.708 232.652 173.697 232.651C173.653 232.647 173.61 232.634 173.571 232.613C173.532 232.593 173.497 232.564 173.469 232.53C173.441 232.496 173.42 232.457 173.407 232.415C173.394 232.372 173.389 232.328 173.394 232.284C173.576 230.765 174.355 229.38 175.56 228.433C175.597 228.408 175.637 228.39 175.681 228.38C175.724 228.37 175.769 228.368 175.812 228.376C175.856 228.383 175.898 228.399 175.936 228.423C175.973 228.446 176.006 228.477 176.031 228.513C176.083 228.586 176.104 228.676 176.089 228.764C176.074 228.852 176.025 228.931 175.952 228.983C174.912 229.821 174.237 231.026 174.066 232.349C174.058 232.432 174.019 232.509 173.957 232.565C173.895 232.621 173.814 232.653 173.731 232.653Z" fill="#EBEBEB"/>
<path d="M170.031 231.379C170.02 231.379 170.008 231.379 169.997 231.378C169.908 231.369 169.826 231.325 169.769 231.257C169.713 231.188 169.685 231.099 169.694 231.01C169.876 229.491 170.655 228.106 171.86 227.16C171.896 227.134 171.937 227.116 171.981 227.106C172.024 227.096 172.069 227.095 172.112 227.102C172.156 227.11 172.198 227.126 172.235 227.149C172.273 227.173 172.306 227.203 172.331 227.239C172.383 227.312 172.404 227.403 172.389 227.491C172.374 227.579 172.325 227.658 172.252 227.709C171.212 228.547 170.536 229.753 170.366 231.075C170.358 231.158 170.319 231.236 170.257 231.292C170.195 231.348 170.114 231.379 170.031 231.379Z" fill="#EBEBEB"/>
<path d="M195.591 218.876C196.008 214.272 196.913 207.058 197.289 203.685C197.8 199.421 197.677 195.106 196.925 190.878C196.73 189.881 196.68 188.862 196.779 187.851C197.693 178.682 198.293 163.821 197.786 160.555L184.883 163.278C184.883 163.278 186.462 184.129 187.155 191.064C187.853 198.045 190.446 218.936 190.446 218.936C191.216 219.429 192.113 219.686 193.028 219.675C193.942 219.665 194.834 219.387 195.591 218.876Z" fill="#455A64"/>
<path d="M193.732 223.609C194.087 223.525 194.42 223.363 194.704 223.133C194.988 222.904 195.217 222.614 195.373 222.285C195.373 221.559 195.458 220.348 195.591 218.875C194.834 219.386 193.942 219.664 193.028 219.674C192.113 219.685 191.216 219.428 190.446 218.935L190.904 222.808C191.283 223.148 191.734 223.396 192.225 223.535C192.715 223.674 193.23 223.699 193.732 223.609Z" fill="#FFA8A7"/>
<path d="M181.075 226.967C181.602 219.999 182.618 206.494 182.754 204.373C182.852 202.028 182.703 199.679 182.309 197.365C182.091 196.114 182.098 194.834 182.33 193.585L188 162.2L172.408 161.973L171.387 194.853C171.374 195.278 171.391 195.703 171.436 196.126L174.743 226.771C174.743 226.771 177.969 229.47 181.075 226.967Z" fill="#455A64"/>
<path d="M178.476 232.722C178.96 232.664 179.422 232.488 179.821 232.208C180.22 231.928 180.543 231.554 180.761 231.119C180.761 231.119 180.887 229.457 181.075 226.967C177.969 229.47 174.743 226.771 174.743 226.771L175.239 231.367C175.239 231.367 175.972 232.956 178.476 232.722Z" fill="#FFA8A7"/>
<path d="M179.613 126.633L175.935 127.887L171.978 146.558L172.169 163.113C172.169 163.113 174.995 165.36 186.034 165.36C192.231 165.36 196.264 163.032 197.786 160.554L196.794 150.552C196.794 150.552 197.786 140.696 197.786 135.824C197.786 130.952 198.004 126.958 194.186 124.543L190.787 124.822L179.613 126.633Z" fill="#EE7326"/>
<path opacity="0.2" d="M179.613 126.633L175.935 127.887L171.978 146.558L172.169 163.113C172.169 163.113 174.995 165.36 186.034 165.36C192.231 165.36 196.264 163.032 197.786 160.554L196.794 150.552C196.794 150.552 197.786 140.696 197.786 135.824C197.786 130.952 198.004 126.958 194.186 124.543L190.787 124.822L179.613 126.633Z" fill="white"/>
<path d="M175.619 110.588L173.776 114.224C173.75 114.277 173.735 114.335 173.732 114.394C173.73 114.453 173.74 114.512 173.763 114.567C173.786 114.622 173.82 114.671 173.863 114.711C173.907 114.752 173.958 114.782 174.015 114.801L176.201 115.527L175.619 110.588Z" fill="#F28F8F"/>
<path d="M178.17 104.488C178.17 104.488 175.376 105.99 175.376 114.604C175.376 119.341 175.702 122.36 178.17 122.175C180.637 121.989 187.737 121.06 187.737 121.06V104.488H178.17Z" fill="#FFA8A7"/>
<path d="M178.17 122.176C179.037 122.11 180.477 121.953 181.979 121.777V120.898C180.624 121.479 179.208 121.907 177.758 122.173C177.895 122.185 178.033 122.186 178.17 122.176Z" fill="#F28F8F"/>
<path d="M181.557 120.53V125.937H188.972V118.34L181.557 120.53Z" fill="#FFA8A7"/>
<path d="M181.557 123.878C181.557 123.878 184.222 124.823 186.364 124.451C188.506 124.08 188.971 122.779 188.971 122.779C188.971 122.779 189.67 122.727 190.787 124.823C190.353 125.608 189.73 126.274 188.974 126.76C188.218 127.246 187.354 127.538 186.457 127.61C184.133 127.762 181.802 127.429 179.613 126.634C179.613 126.634 180.643 123.61 181.557 123.878Z" fill="#EE7326"/>
<path opacity="0.4" d="M181.557 123.878C181.557 123.878 184.222 124.823 186.364 124.451C188.506 124.08 188.971 122.779 188.971 122.779C188.971 122.779 189.67 122.727 190.787 124.823C190.353 125.608 189.73 126.274 188.974 126.76C188.218 127.246 187.354 127.538 186.457 127.61C184.133 127.762 181.802 127.429 179.613 126.634C179.613 126.634 180.643 123.61 181.557 123.878Z" fill="white"/>
<path d="M165.016 139.919L163.025 142.975C163.025 142.975 158.19 140.824 154.792 139.52C152.824 138.788 150.992 137.735 149.368 136.406C149.497 135.09 149.715 133.784 150.022 132.498C150.414 131.177 150.545 130.069 149.368 130.656C148.192 131.242 147.408 133.524 147.343 133.784C147.343 133.784 140.547 126.973 139.698 127.12C138.848 127.266 139.045 128.292 140.874 130.395L142.703 132.498C142.703 132.498 138.534 134.892 139.214 137.5C139.894 140.107 145.383 141.28 145.383 141.28C145.383 141.28 161.454 153.6 165.016 151.384C168.579 149.167 173.611 142.78 173.611 142.78L165.016 139.919Z" fill="#FFA8A7"/>
<path d="M177.394 127.412C177.394 127.412 180.36 129.845 178.427 134.876C176.494 139.907 171.559 145.985 171.559 145.985C171.559 145.985 166.385 144.381 164.389 140.211L170.912 130.03C171.375 129.305 172.003 128.699 172.745 128.261C173.487 127.823 174.322 127.566 175.182 127.509C175.798 127.469 176.529 127.434 177.394 127.412Z" fill="#EE7326"/>
<path opacity="0.4" d="M177.394 127.412C177.394 127.412 180.36 129.845 178.427 134.876C176.494 139.907 171.559 145.985 171.559 145.985C171.559 145.985 166.385 144.381 164.389 140.211L170.912 130.03C171.375 129.305 172.003 128.699 172.745 128.261C173.487 127.823 174.322 127.566 175.182 127.509C175.798 127.469 176.529 127.434 177.394 127.412Z" fill="white"/>
<path d="M177.099 99.4174C177.099 99.4174 174.168 99.0291 173.421 101.043C172.955 102.297 174.445 103.272 174.445 103.272C174.445 103.272 172.555 105.047 175.376 105.595C175.328 105.897 175.356 106.206 175.457 106.495C175.558 106.784 175.729 107.043 175.955 107.25C176.18 107.457 176.454 107.605 176.751 107.681C177.049 107.757 177.36 107.758 177.658 107.684C177.658 107.684 177.332 109.6 179.799 110.268C179.799 110.268 178.552 113.583 180.898 113.629H183.095L182.209 116.184C182.209 116.184 183.85 120.132 188.971 120.132C189.538 118.934 190.176 117.771 190.88 116.648C191.486 115.859 194.652 111.818 194.652 108.613C194.652 105.409 193.416 103.51 191.706 103.089C191.162 101.914 190.315 100.903 189.251 100.16C187.528 98.9994 183.897 97.9639 181.848 99.3873C181.848 99.3873 180.032 97.0117 178.775 97.0117C177.518 97.0117 177.099 98.3027 177.099 99.4174Z" fill="#263238"/>
<path d="M180.898 113.629C180.898 113.629 180.684 110.268 183.524 110.268C186.364 110.268 185.69 116.184 182.209 116.184L180.898 113.629Z" fill="#FFA8A7"/>
</g>
<defs>
<clipPath id="clip0_1998_18972">
<rect width="264" height="266" fill="white"/>
</clipPath>
</defs>
</svg>
