<svg width="40" height="22" viewBox="0 0 40 22" fill="none" xmlns="http://www.w3.org/2000/svg">
<rect width="40" height="22" rx="4" fill="#F35625"/>
<path d="M15.2862 5.11592C15.4425 5.27219 15.5302 5.48411 15.5302 5.70508C15.5302 5.92605 15.4425 6.13798 15.2862 6.29425C14.0358 7.54493 13.3333 9.24109 13.3333 11.0097C13.3333 12.7782 14.0358 14.4744 15.2862 15.7251C15.3658 15.802 15.4293 15.8939 15.473 15.9956C15.5166 16.0972 15.5396 16.2066 15.5406 16.3172C15.5416 16.4279 15.5205 16.5376 15.4786 16.64C15.4367 16.7425 15.3748 16.8355 15.2966 16.9137C15.2183 16.992 15.1253 17.0539 15.0229 17.0958C14.9204 17.1377 14.8107 17.1588 14.7001 17.1578C14.5894 17.1568 14.4801 17.1338 14.3784 17.0902C14.2767 17.0465 14.1848 16.983 14.1079 16.9034C10.8521 13.6484 10.8521 8.37092 14.1079 5.11592C14.2642 4.95969 14.4761 4.87193 14.6971 4.87193C14.918 4.87193 15.13 4.95969 15.2862 5.11592ZM25.8962 5.11592C29.1512 8.37092 29.1512 13.6493 25.8962 16.9034C25.74 17.0598 25.528 17.1477 25.3069 17.1478C25.0859 17.1478 24.8738 17.0601 24.7175 16.9038C24.5611 16.7476 24.4732 16.5356 24.4731 16.3145C24.4731 16.0935 24.5608 15.8815 24.7171 15.7251C25.9675 14.4744 26.67 12.7782 26.67 11.0097C26.67 9.24109 25.9675 7.54493 24.7171 6.29425C24.5608 6.13788 24.4731 5.92585 24.4731 5.70479C24.4732 5.48373 24.5611 5.27176 24.7175 5.1155C24.8738 4.95924 25.0859 4.8715 25.3069 4.87158C25.528 4.87166 25.74 4.95955 25.8962 5.11592ZM17.7587 7.51008C17.915 7.66636 18.0027 7.87828 18.0027 8.09925C18.0027 8.32022 17.915 8.53214 17.7587 8.68842C17.4554 8.99176 17.2147 9.35189 17.0505 9.74824C16.8863 10.1446 16.8018 10.5694 16.8018 10.9984C16.8018 11.4274 16.8863 11.8522 17.0505 12.2486C17.2147 12.6449 17.4554 13.0051 17.7587 13.3084C17.9151 13.4648 18.0029 13.6769 18.0029 13.898C18.0029 14.1191 17.9151 14.3312 17.7587 14.4876C17.6024 14.644 17.3903 14.7318 17.1691 14.7318C16.948 14.7318 16.7359 14.644 16.5796 14.4876C16.1213 14.0295 15.7579 13.4856 15.5099 12.887C15.2619 12.2884 15.1343 11.6468 15.1343 10.9988C15.1343 10.3509 15.2619 9.7093 15.5099 9.1107C15.7579 8.51209 16.1213 7.9682 16.5796 7.51008C16.657 7.4326 16.7489 7.37114 16.85 7.3292C16.9512 7.28726 17.0596 7.26568 17.1691 7.26568C17.2787 7.26568 17.3871 7.28726 17.4883 7.3292C17.5894 7.37114 17.6813 7.4326 17.7587 7.51008ZM23.5571 7.51008C24.0153 7.9682 24.3787 8.51209 24.6267 9.1107C24.8747 9.7093 25.0024 10.3509 25.0024 10.9988C25.0024 11.6468 24.8747 12.2884 24.6267 12.887C24.3787 13.4856 24.0153 14.0295 23.5571 14.4876C23.4007 14.6438 23.1887 14.7316 22.9676 14.7315C22.7465 14.7314 22.5346 14.6435 22.3783 14.4872C22.2221 14.3308 22.1343 14.1188 22.1344 13.8977C22.1345 13.6766 22.2224 13.4647 22.3787 13.3084C22.6821 13.0051 22.9227 12.6449 23.0869 12.2486C23.2511 11.8522 23.3356 11.4274 23.3356 10.9984C23.3356 10.5694 23.2511 10.1446 23.0869 9.74824C22.9227 9.35189 22.6821 8.99176 22.3787 8.68842C22.2269 8.53125 22.1429 8.32075 22.1448 8.10225C22.1467 7.88375 22.2344 7.67474 22.3889 7.52024C22.5434 7.36573 22.7524 7.27809 22.9709 7.27619C23.1894 7.27429 23.3999 7.35829 23.5571 7.51008ZM20.0687 9.81842C20.4002 9.81842 20.7182 9.95011 20.9526 10.1845C21.187 10.419 21.3187 10.7369 21.3187 11.0684C21.3187 11.3999 21.187 11.7179 20.9526 11.9523C20.7182 12.1867 20.4002 12.3184 20.0687 12.3184C19.7372 12.3184 19.4193 12.1867 19.1848 11.9523C18.9504 11.7179 18.8187 11.3999 18.8187 11.0684C18.8187 10.7369 18.9504 10.419 19.1848 10.1845C19.4193 9.95011 19.7372 9.81842 20.0687 9.81842Z" fill="white"/>
</svg>
