<svg width="19" height="24" viewBox="0 0 19 24" fill="none" xmlns="http://www.w3.org/2000/svg">
<g clip-path="url(#clip0_1196_14630)">
<path d="M8.93351 15.3656C9.03417 15.4046 9.08411 15.5178 9.04508 15.6185L6.24481 22.8381C6.19653 22.9625 6.03484 22.9939 5.94357 22.8964L4.73271 21.6035C4.65446 21.52 4.54246 21.4765 4.42836 21.4855C4.42836 21.4855 3.65426 21.553 3.54234 21.5548C3.40402 21.5571 3.2548 21.5451 3.22761 21.5351C3.03783 21.4654 3.32087 21.227 3.40123 21.0199L5.96547 14.4087C6.00167 14.3154 6.10664 14.2691 6.19997 14.3053L8.93351 15.3656ZM13.1008 14.4625L10.6906 15.3974C10.4967 15.4726 10.4004 15.6908 10.4757 15.8848L12.8875 22.1029C12.9396 22.2372 13.114 22.271 13.2124 22.1659L13.7391 21.6035C13.8173 21.5199 13.9293 21.4765 14.0434 21.4854L15.8094 21.6237C15.9425 21.6342 16.0408 21.502 15.9925 21.3775L13.3537 14.5741C13.3147 14.4735 13.2014 14.4235 13.1008 14.4625Z" fill="#AEAEAE"/>
<path d="M3.542 21.5555L2.66202 21.6244C2.52893 21.6348 2.43063 21.5026 2.47891 21.3781L5.84573 12.6978C5.88194 12.6045 5.98691 12.5582 6.08024 12.5943L6.89512 12.9104L3.542 21.5555ZM9.89528 13.5623L8.96322 13.9239C8.86992 13.9601 8.8236 14.065 8.85977 14.1584L12.2266 22.8387C12.2749 22.9632 12.4366 22.9945 12.5278 22.8971L13.2265 22.151L9.89528 13.5623Z" fill="#AEAEAE"/>
<path d="M16.057 11.8962C16.1941 12.1249 16.1988 12.4095 16.0693 12.6427L15.4592 13.7408C15.3956 13.8553 15.3632 13.9846 15.3654 14.1157L15.3861 15.3716C15.3905 15.6383 15.2523 15.8871 15.0236 16.0243L13.9462 16.6702C13.8338 16.7376 13.7411 16.8334 13.6775 16.948L13.0674 18.0461C12.9379 18.2792 12.6938 18.4256 12.4271 18.43L11.1711 18.4507C11.0401 18.4529 10.9119 18.4895 10.7995 18.5569L10.565 18.6975C10.5038 18.7342 10.431 18.7469 10.3613 18.7318C7.00309 18.0018 4.48804 15.0124 4.48804 11.4356C4.48804 9.55048 5.18667 7.82848 6.33914 6.51447C6.4448 6.39399 6.59746 6.32509 6.7577 6.32244L7.30139 6.31349C7.43242 6.31131 7.56058 6.2747 7.67298 6.20732L8.75035 5.56135C8.97909 5.4242 9.26366 5.41949 9.49683 5.54903L10.5949 6.15908C10.7095 6.22273 10.8388 6.25509 10.9698 6.25292L12.2258 6.23219C12.4925 6.2278 12.7413 6.36601 12.8784 6.59475L13.5244 7.67208C13.5918 7.78448 13.6876 7.87716 13.8021 7.94081L14.9002 8.55086C15.1334 8.6804 15.2798 8.92448 15.2841 9.19117L15.3049 10.4472C15.307 10.5782 15.3437 10.7064 15.411 10.8188L16.057 11.8962Z" fill="#505050"/>
<path d="M10.584 18.6865L9.72144 19.2037C9.49266 19.3408 9.20813 19.3455 8.97496 19.216L7.87686 18.6059C7.76229 18.5423 7.633 18.5099 7.50197 18.5121L6.24595 18.5328C5.97925 18.5372 5.73046 18.399 5.59331 18.1703L4.94738 17.0929C4.88 16.9805 4.7842 16.8878 4.66963 16.8241L3.57153 16.2141C3.33836 16.0845 3.19203 15.8405 3.18761 15.5738L3.16688 14.3178C3.16471 14.1867 3.1281 14.0586 3.06072 13.9462L2.41475 12.8688C2.27759 12.64 2.27288 12.3555 2.40242 12.1223L3.01247 11.0242C3.07612 10.9097 3.10849 10.7804 3.10631 10.6493L3.08558 9.39336C3.0812 9.12667 3.2194 8.87788 3.44815 8.74072L4.52551 8.09479C4.63791 8.02741 4.73059 7.93161 4.79424 7.81704L5.40429 6.71894C5.53383 6.48577 5.77791 6.33941 6.04461 6.33502L6.81751 6.32227C5.68055 7.66201 4.99471 9.39662 4.99471 11.2915C4.99482 14.809 7.3584 17.7746 10.584 18.6865Z" fill="#505050"/>
<path d="M13.6757 12.3815C13.6757 14.8337 11.6878 16.8216 9.23563 16.8216C6.78343 16.8216 4.79553 14.8337 4.79553 12.3815C4.79553 9.9293 6.78343 7.94141 9.23563 7.94141C11.6878 7.94141 13.6757 9.9293 13.6757 12.3815Z" fill="white"/>
<path d="M13.2747 13.2375C13.0918 14.0896 12.6436 14.8433 12.0208 15.4078C11.8127 15.5964 10.8131 16.1797 10.5263 16.2718C10.1313 16.3988 9.71006 16.4673 9.27285 16.4673C8.83565 16.4673 8.41446 16.3988 8.01944 16.2718C7.7485 16.1848 6.74506 15.6073 6.5249 15.4078C5.90212 14.8433 5.45393 14.0896 5.27101 13.2375C5.21126 12.9592 5.21126 11.7893 5.27101 11.5111C5.45393 10.659 5.90212 9.90532 6.5249 9.34082C6.72917 9.15566 7.7276 8.57051 8.01944 8.47674C8.41446 8.34979 8.83565 8.28125 9.27285 8.28125C9.71006 8.28125 10.1312 8.34979 10.5263 8.47672C10.8065 8.56679 11.8078 9.14768 12.0208 9.3408C12.6436 9.90531 13.0918 10.6589 13.2747 11.511C13.3344 11.7894 13.3344 12.9592 13.2747 13.2375Z" fill="#A7A7A7"/>
<path d="M9.27473 12.3729L13.2744 11.5109C13.3342 11.7892 13.3656 12.078 13.3656 12.3741C13.3656 12.6702 13.3342 12.959 13.2744 13.2373L9.27473 12.3753L12.0206 15.4076C11.5944 15.7938 11.0866 16.0915 10.526 16.2716L9.2726 12.3766L8.01919 16.2717C7.45862 16.0915 6.95076 15.7938 6.52466 15.4076L9.27049 12.3753L5.27076 13.2373C5.21101 12.959 5.17957 12.6702 5.17957 12.3741C5.17957 12.078 5.21101 11.7892 5.27076 11.5109L9.27048 12.3729L6.52466 9.34064C6.95078 8.95439 7.45864 8.65669 8.01919 8.47656L9.2726 12.3717L10.526 8.47656C11.0866 8.65669 11.5944 8.95439 12.0206 9.34064L9.27473 12.3729Z" fill="white"/>
</g>
<path d="M4.07064 4.21292C3.94453 5.12711 3.79767 5.28608 3.97301 5.41257C4.1485 5.53924 4.26027 5.35087 5.09949 4.9555L6.01229 5.43257C6.04177 5.44798 6.07401 5.4556 6.10612 5.4556C6.14757 5.4556 6.18885 5.44291 6.22375 5.41799C6.28567 5.37375 6.31681 5.29859 6.30408 5.22413L6.13199 4.21788L6.87314 3.50733C6.92801 3.45474 6.94787 3.37594 6.92444 3.30406C6.901 3.23217 6.83832 3.17968 6.76271 3.16862L5.74125 3.01944L5.28652 2.10323C5.25287 2.03542 5.18318 1.99237 5.10676 1.99219C5.10661 1.99219 5.10645 1.99219 5.10628 1.99219C5.03005 1.99219 4.96037 2.03487 4.92647 2.10236L4.46726 3.01637L3.44509 3.16067C3.36943 3.17135 3.30648 3.22355 3.28269 3.29533C3.2589 3.36711 3.27838 3.44601 3.33299 3.49884L4.07064 4.21292ZM4.62853 3.39446C4.69394 3.38523 4.75056 3.34478 4.77993 3.28628L5.10518 2.6389L5.42726 3.28783C5.45637 3.34648 5.5128 3.3872 5.57815 3.39675L6.30163 3.50243L5.77667 4.00568C5.72925 4.05114 5.70751 4.11677 5.71851 4.18116L5.8404 4.89384L5.1939 4.55595C5.16455 4.5406 5.1323 4.53293 5.10006 4.53293C5.06812 4.53293 5.03618 4.54045 5.00707 4.55551L4.35893 4.89028C4.44733 4.24439 4.55518 4.12651 4.427 4.00245L3.90452 3.49669L4.62853 3.39446Z" fill="#505050"/>
<path d="M8.36613 3.2243L8.08886 4.79898C8.07578 4.87337 8.10653 4.94867 8.16825 4.99323C8.22998 5.03777 8.31193 5.04379 8.37964 5.00884L9.81291 4.26849C11.2815 5.02698 11.3034 5.10862 11.454 5.0011C11.5159 4.95686 11.547 4.8817 11.5343 4.80723L11.2648 3.23126L12.4256 2.11839C12.4805 2.0658 12.5003 1.987 12.4769 1.91511C12.4535 1.84323 12.3908 1.79074 12.3152 1.7797L10.7153 1.54602L10.0031 0.111015C9.96948 0.0432307 9.8998 0.000178357 9.82338 0C9.82322 0 9.82307 0 9.82288 0C9.74667 0 9.67699 0.0426785 9.64308 0.110157L8.92385 1.54172L7.32289 1.76772C7.24724 1.7784 7.18429 1.83059 7.16049 1.90235C7.13671 1.97413 7.15621 2.05303 7.21079 2.10588L8.36613 3.2243ZM9.08513 1.9198C9.15054 1.91058 9.20715 1.87014 9.23653 1.81165L9.82179 0.64673L10.4014 1.81443C10.4304 1.87306 10.4869 1.91378 10.5522 1.92332L11.8541 2.11349L10.9095 3.01905C10.8621 3.06452 10.8403 3.13015 10.8513 3.19453L11.0706 4.47694L9.90731 3.86895C9.87796 3.85359 9.84572 3.84592 9.81346 3.84592C9.78154 3.84592 9.74961 3.85343 9.72049 3.86849L8.55418 4.47092L8.77978 3.18958C8.79113 3.12524 8.76969 3.0595 8.72249 3.01381L7.78238 2.10371L9.08513 1.9198Z" fill="#505050"/>
<path d="M13.5 4.21292L13.3229 5.21833C13.3098 5.29272 13.3406 5.36805 13.4023 5.41257C13.4641 5.45712 13.546 5.46316 13.6137 5.42818L14.5288 4.9555L15.4416 5.43257C15.4711 5.44798 15.5033 5.4556 15.5354 5.4556C15.5769 5.4556 15.6182 5.44291 15.6531 5.41799C15.715 5.37375 15.7461 5.29859 15.7334 5.22413L15.5613 4.21788L16.3025 3.50733C16.3573 3.45474 16.3772 3.37594 16.3538 3.30406C16.3303 3.23217 16.2676 3.17968 16.192 3.16862L15.1706 3.01944L14.7158 2.10323C14.6822 2.03542 14.6125 1.99237 14.5361 1.99219C14.5359 1.99219 14.5358 1.99219 14.5356 1.99219C14.4594 1.99219 14.3897 2.03487 14.3558 2.10236L13.8966 3.0164L12.8744 3.16066C12.7988 3.17135 12.7358 3.22354 12.712 3.29532C12.6882 3.36711 12.7077 3.446 12.7623 3.49883L13.5 4.21292ZM14.0579 3.39446C14.1233 3.38523 14.1799 3.34478 14.2093 3.28628L14.5345 2.6389L14.8566 3.28783C14.8857 3.34648 14.9421 3.3872 15.0075 3.39675L15.731 3.50243L15.206 4.00568C15.1586 4.05114 15.1369 4.11677 15.1479 4.18116L15.2697 4.89384L14.6232 4.55595C14.5939 4.5406 14.5617 4.53293 14.5294 4.53293C14.4975 4.53293 14.4655 4.54045 14.4364 4.55551L13.7883 4.89028L13.9136 4.1782C13.925 4.11387 13.9035 4.04813 13.8563 4.00245L13.3338 3.49669L14.0579 3.39446Z" fill="#505050"/>
<defs>
<clipPath id="clip0_1196_14630">
<rect width="18.5455" height="18.5455" fill="white" transform="translate(0.000244141 5.45508)"/>
</clipPath>
</defs>
</svg>
