<svg width="24" height="24" viewBox="0 0 24 24" fill="none" xmlns="http://www.w3.org/2000/svg">
<path d="M18.6038 5.39623C18.0755 4.86792 17.283 4.86792 16.7547 5.39623L12 10.1509L7.24528 5.39623C6.71698 4.86792 5.92453 4.86792 5.39623 5.39623C4.86792 5.92453 4.86792 6.71698 5.39623 7.24528L10.1509 12L5.39623 16.7547C4.86792 17.283 4.86792 18.0755 5.39623 18.6038C5.92453 19.1321 6.71698 19.1321 7.24528 18.6038L12 13.8491L16.7547 18.6038C17.283 19.1321 18.0755 19.1321 18.6038 18.6038C19.1321 18.0755 19.1321 17.283 18.6038 16.7547L13.8491 12L18.6038 7.24528C19.1321 6.71698 19.1321 5.92453 18.6038 5.39623Z" fill="#505050"/>
</svg>
