{
  "configVersion": 2,
  "packages": [
    {
      "name": "after_layout",
      "rootUri": "file:///Users/bonasr/.pub-cache/hosted/pub.dev/after_layout-1.2.0",
      "packageUri": "lib/",
      "languageVersion": "2.17"
    },
    {
      "name": "async",
      "rootUri": "file:///Users/bonasr/.pub-cache/hosted/pub.dev/async-2.10.0",
      "packageUri": "lib/",
      "languageVersion": "2.18"
    },
    {
      "name": "boolean_selector",
      "rootUri": "file:///Users/bonasr/.pub-cache/hosted/pub.dev/boolean_selector-2.1.1",
      "packageUri": "lib/",
      "languageVersion": "2.17"
    },
    {
      "name": "characters",
      "rootUri": "file:///Users/bonasr/.pub-cache/hosted/pub.dev/characters-1.2.1",
      "packageUri": "lib/",
      "languageVersion": "2.12"
    },
    {
      "name": "clock",
      "rootUri": "file:///Users/bonasr/.pub-cache/hosted/pub.dev/clock-1.1.1",
      "packageUri": "lib/",
      "languageVersion": "2.12"
    },
    {
      "name": "collection",
      "rootUri": "file:///Users/bonasr/.pub-cache/hosted/pub.dev/collection-1.17.0",
      "packageUri": "lib/",
      "languageVersion": "2.12"
    },
    {
      "name": "emoji_picker_flutter",
      "rootUri": "file:///Users/bonasr/.pub-cache/hosted/pub.dev/emoji_picker_flutter-1.6.1",
      "packageUri": "lib/",
      "languageVersion": "2.17"
    },
    {
      "name": "event_bus",
      "rootUri": "file:///Users/bonasr/.pub-cache/hosted/pub.dev/event_bus-2.0.0",
      "packageUri": "lib/",
      "languageVersion": "2.12"
    },
    {
      "name": "fake_async",
      "rootUri": "file:///Users/bonasr/.pub-cache/hosted/pub.dev/fake_async-1.3.1",
      "packageUri": "lib/",
      "languageVersion": "2.12"
    },
    {
      "name": "ffi",
      "rootUri": "file:///Users/bonasr/.pub-cache/hosted/pub.dev/ffi-2.0.2",
      "packageUri": "lib/",
      "languageVersion": "2.17"
    },
    {
      "name": "file",
      "rootUri": "file:///Users/bonasr/.pub-cache/hosted/pub.dev/file-6.1.4",
      "packageUri": "lib/",
      "languageVersion": "2.12"
    },
    {
      "name": "flutter",
      "rootUri": "file:///Users/bonasr/Documents/env/flutter/packages/flutter",
      "packageUri": "lib/",
      "languageVersion": "2.17"
    },
    {
      "name": "flutter_linkify",
      "rootUri": "file:///Users/bonasr/.pub-cache/hosted/pub.dev/flutter_linkify-5.0.2",
      "packageUri": "lib/",
      "languageVersion": "2.12"
    },
    {
      "name": "flutter_lints",
      "rootUri": "file:///Users/bonasr/.pub-cache/hosted/pub.dev/flutter_lints-2.0.1",
      "packageUri": "lib/",
      "languageVersion": "2.17"
    },
    {
      "name": "flutter_secure_storage",
      "rootUri": "file:///Users/bonasr/.pub-cache/hosted/pub.dev/flutter_secure_storage-8.0.0",
      "packageUri": "lib/",
      "languageVersion": "2.12"
    },
    {
      "name": "flutter_secure_storage_linux",
      "rootUri": "file:///Users/bonasr/.pub-cache/hosted/pub.dev/flutter_secure_storage_linux-1.1.3",
      "packageUri": "lib/",
      "languageVersion": "2.12"
    },
    {
      "name": "flutter_secure_storage_macos",
      "rootUri": "file:///Users/bonasr/.pub-cache/hosted/pub.dev/flutter_secure_storage_macos-3.0.0",
      "packageUri": "lib/",
      "languageVersion": "2.12"
    },
    {
      "name": "flutter_secure_storage_platform_interface",
      "rootUri": "file:///Users/bonasr/.pub-cache/hosted/pub.dev/flutter_secure_storage_platform_interface-1.0.1",
      "packageUri": "lib/",
      "languageVersion": "2.12"
    },
    {
      "name": "flutter_secure_storage_web",
      "rootUri": "file:///Users/bonasr/.pub-cache/hosted/pub.dev/flutter_secure_storage_web-1.1.1",
      "packageUri": "lib/",
      "languageVersion": "2.12"
    },
    {
      "name": "flutter_secure_storage_windows",
      "rootUri": "file:///Users/bonasr/.pub-cache/hosted/pub.dev/flutter_secure_storage_windows-2.0.0",
      "packageUri": "lib/",
      "languageVersion": "2.12"
    },
    {
      "name": "flutter_svg",
      "rootUri": "file:///Users/bonasr/.pub-cache/hosted/pub.dev/flutter_svg-1.1.6",
      "packageUri": "lib/",
      "languageVersion": "2.17"
    },
    {
      "name": "flutter_test",
      "rootUri": "file:///Users/bonasr/Documents/env/flutter/packages/flutter_test",
      "packageUri": "lib/",
      "languageVersion": "2.17"
    },
    {
      "name": "flutter_web_plugins",
      "rootUri": "file:///Users/bonasr/Documents/env/flutter/packages/flutter_web_plugins",
      "packageUri": "lib/",
      "languageVersion": "2.17"
    },
    {
      "name": "fluttertoast",
      "rootUri": "file:///Users/bonasr/.pub-cache/hosted/pub.dev/fluttertoast-8.2.2",
      "packageUri": "lib/",
      "languageVersion": "2.12"
    },
    {
      "name": "internet_connection_checker",
      "rootUri": "file:///Users/bonasr/.pub-cache/hosted/pub.dev/internet_connection_checker-0.0.1+4",
      "packageUri": "lib/",
      "languageVersion": "2.17"
    },
    {
      "name": "intl",
      "rootUri": "file:///Users/bonasr/.pub-cache/hosted/pub.dev/intl-0.17.0",
      "packageUri": "lib/",
      "languageVersion": "2.12"
    },
    {
      "name": "js",
      "rootUri": "file:///Users/bonasr/.pub-cache/hosted/pub.dev/js-0.6.5",
      "packageUri": "lib/",
      "languageVersion": "2.16"
    },
    {
      "name": "linkify",
      "rootUri": "file:///Users/bonasr/.pub-cache/hosted/pub.dev/linkify-4.1.0",
      "packageUri": "lib/",
      "languageVersion": "2.12"
    },
    {
      "name": "lints",
      "rootUri": "file:///Users/bonasr/.pub-cache/hosted/pub.dev/lints-2.0.1",
      "packageUri": "lib/",
      "languageVersion": "2.17"
    },
    {
      "name": "logging",
      "rootUri": "file:///Users/bonasr/.pub-cache/hosted/pub.dev/logging-1.1.0",
      "packageUri": "lib/",
      "languageVersion": "2.12"
    },
    {
      "name": "matcher",
      "rootUri": "file:///Users/bonasr/.pub-cache/hosted/pub.dev/matcher-0.12.13",
      "packageUri": "lib/",
      "languageVersion": "2.18"
    },
    {
      "name": "material_color_utilities",
      "rootUri": "file:///Users/bonasr/.pub-cache/hosted/pub.dev/material_color_utilities-0.2.0",
      "packageUri": "lib/",
      "languageVersion": "2.13"
    },
    {
      "name": "meta",
      "rootUri": "file:///Users/bonasr/.pub-cache/hosted/pub.dev/meta-1.8.0",
      "packageUri": "lib/",
      "languageVersion": "2.12"
    },
    {
      "name": "path",
      "rootUri": "file:///Users/bonasr/.pub-cache/hosted/pub.dev/path-1.8.2",
      "packageUri": "lib/",
      "languageVersion": "2.12"
    },
    {
      "name": "path_drawing",
      "rootUri": "file:///Users/bonasr/.pub-cache/hosted/pub.dev/path_drawing-1.0.1",
      "packageUri": "lib/",
      "languageVersion": "2.12"
    },
    {
      "name": "path_parsing",
      "rootUri": "file:///Users/bonasr/.pub-cache/hosted/pub.dev/path_parsing-1.0.1",
      "packageUri": "lib/",
      "languageVersion": "2.12"
    },
    {
      "name": "path_provider_linux",
      "rootUri": "file:///Users/bonasr/.pub-cache/hosted/pub.dev/path_provider_linux-2.1.10",
      "packageUri": "lib/",
      "languageVersion": "2.17"
    },
    {
      "name": "path_provider_platform_interface",
      "rootUri": "file:///Users/bonasr/.pub-cache/hosted/pub.dev/path_provider_platform_interface-2.0.6",
      "packageUri": "lib/",
      "languageVersion": "2.12"
    },
    {
      "name": "path_provider_windows",
      "rootUri": "file:///Users/bonasr/.pub-cache/hosted/pub.dev/path_provider_windows-2.1.6",
      "packageUri": "lib/",
      "languageVersion": "2.17"
    },
    {
      "name": "petitparser",
      "rootUri": "file:///Users/bonasr/.pub-cache/hosted/pub.dev/petitparser-5.0.0",
      "packageUri": "lib/",
      "languageVersion": "2.16"
    },
    {
      "name": "platform",
      "rootUri": "file:///Users/bonasr/.pub-cache/hosted/pub.dev/platform-3.1.0",
      "packageUri": "lib/",
      "languageVersion": "2.12"
    },
    {
      "name": "plugin_platform_interface",
      "rootUri": "file:///Users/bonasr/.pub-cache/hosted/pub.dev/plugin_platform_interface-2.1.4",
      "packageUri": "lib/",
      "languageVersion": "2.17"
    },
    {
      "name": "process",
      "rootUri": "file:///Users/bonasr/.pub-cache/hosted/pub.dev/process-4.2.4",
      "packageUri": "lib/",
      "languageVersion": "2.14"
    },
    {
      "name": "shared_preferences",
      "rootUri": "file:///Users/bonasr/.pub-cache/hosted/pub.dev/shared_preferences-2.1.1",
      "packageUri": "lib/",
      "languageVersion": "2.17"
    },
    {
      "name": "shared_preferences_android",
      "rootUri": "file:///Users/bonasr/.pub-cache/hosted/pub.dev/shared_preferences_android-2.1.4",
      "packageUri": "lib/",
      "languageVersion": "2.17"
    },
    {
      "name": "shared_preferences_foundation",
      "rootUri": "file:///Users/bonasr/.pub-cache/hosted/pub.dev/shared_preferences_foundation-2.2.2",
      "packageUri": "lib/",
      "languageVersion": "2.17"
    },
    {
      "name": "shared_preferences_linux",
      "rootUri": "file:///Users/bonasr/.pub-cache/hosted/pub.dev/shared_preferences_linux-2.2.0",
      "packageUri": "lib/",
      "languageVersion": "2.17"
    },
    {
      "name": "shared_preferences_platform_interface",
      "rootUri": "file:///Users/bonasr/.pub-cache/hosted/pub.dev/shared_preferences_platform_interface-2.2.0",
      "packageUri": "lib/",
      "languageVersion": "2.17"
    },
    {
      "name": "shared_preferences_web",
      "rootUri": "file:///Users/bonasr/.pub-cache/hosted/pub.dev/shared_preferences_web-2.1.0",
      "packageUri": "lib/",
      "languageVersion": "2.17"
    },
    {
      "name": "shared_preferences_windows",
      "rootUri": "file:///Users/bonasr/.pub-cache/hosted/pub.dev/shared_preferences_windows-2.2.0",
      "packageUri": "lib/",
      "languageVersion": "2.17"
    },
    {
      "name": "show_up_animation",
      "rootUri": "file:///Users/bonasr/.pub-cache/hosted/pub.dev/show_up_animation-2.0.0",
      "packageUri": "lib/",
      "languageVersion": "2.12"
    },
    {
      "name": "simple_shadow",
      "rootUri": "file:///Users/bonasr/.pub-cache/hosted/pub.dev/simple_shadow-0.3.1",
      "packageUri": "lib/",
      "languageVersion": "2.12"
    },
    {
      "name": "sky_engine",
      "rootUri": "file:///Users/bonasr/Documents/env/flutter/bin/cache/pkg/sky_engine",
      "packageUri": "lib/",
      "languageVersion": "2.12"
    },
    {
      "name": "socket_io_client",
      "rootUri": "file:///Users/bonasr/.pub-cache/hosted/pub.dev/socket_io_client-2.0.2",
      "packageUri": "lib/",
      "languageVersion": "2.12"
    },
    {
      "name": "socket_io_common",
      "rootUri": "file:///Users/bonasr/.pub-cache/hosted/pub.dev/socket_io_common-2.0.3",
      "packageUri": "lib/",
      "languageVersion": "2.12"
    },
    {
      "name": "source_span",
      "rootUri": "file:///Users/bonasr/.pub-cache/hosted/pub.dev/source_span-1.9.1",
      "packageUri": "lib/",
      "languageVersion": "2.14"
    },
    {
      "name": "stack_trace",
      "rootUri": "file:///Users/bonasr/.pub-cache/hosted/pub.dev/stack_trace-1.11.0",
      "packageUri": "lib/",
      "languageVersion": "2.18"
    },
    {
      "name": "stream_channel",
      "rootUri": "file:///Users/bonasr/.pub-cache/hosted/pub.dev/stream_channel-2.1.1",
      "packageUri": "lib/",
      "languageVersion": "2.14"
    },
    {
      "name": "string_scanner",
      "rootUri": "file:///Users/bonasr/.pub-cache/hosted/pub.dev/string_scanner-1.2.0",
      "packageUri": "lib/",
      "languageVersion": "2.18"
    },
    {
      "name": "term_glyph",
      "rootUri": "file:///Users/bonasr/.pub-cache/hosted/pub.dev/term_glyph-1.2.1",
      "packageUri": "lib/",
      "languageVersion": "2.12"
    },
    {
      "name": "test_api",
      "rootUri": "file:///Users/bonasr/.pub-cache/hosted/pub.dev/test_api-0.4.16",
      "packageUri": "lib/",
      "languageVersion": "2.18"
    },
    {
      "name": "timer_count_down",
      "rootUri": "file:///Users/bonasr/.pub-cache/hosted/pub.dev/timer_count_down-2.2.2",
      "packageUri": "lib/",
      "languageVersion": "2.12"
    },
    {
      "name": "url_launcher",
      "rootUri": "file:///Users/bonasr/.pub-cache/hosted/pub.dev/url_launcher-6.1.10",
      "packageUri": "lib/",
      "languageVersion": "2.14"
    },
    {
      "name": "url_launcher_android",
      "rootUri": "file:///Users/bonasr/.pub-cache/hosted/pub.dev/url_launcher_android-6.0.26",
      "packageUri": "lib/",
      "languageVersion": "2.17"
    },
    {
      "name": "url_launcher_ios",
      "rootUri": "file:///Users/bonasr/.pub-cache/hosted/pub.dev/url_launcher_ios-6.0.18",
      "packageUri": "lib/",
      "languageVersion": "2.14"
    },
    {
      "name": "url_launcher_linux",
      "rootUri": "file:///Users/bonasr/.pub-cache/hosted/pub.dev/url_launcher_linux-3.0.5",
      "packageUri": "lib/",
      "languageVersion": "2.17"
    },
    {
      "name": "url_launcher_macos",
      "rootUri": "file:///Users/bonasr/.pub-cache/hosted/pub.dev/url_launcher_macos-3.0.5",
      "packageUri": "lib/",
      "languageVersion": "2.17"
    },
    {
      "name": "url_launcher_platform_interface",
      "rootUri": "file:///Users/bonasr/.pub-cache/hosted/pub.dev/url_launcher_platform_interface-2.1.2",
      "packageUri": "lib/",
      "languageVersion": "2.12"
    },
    {
      "name": "url_launcher_web",
      "rootUri": "file:///Users/bonasr/.pub-cache/hosted/pub.dev/url_launcher_web-2.0.16",
      "packageUri": "lib/",
      "languageVersion": "2.17"
    },
    {
      "name": "url_launcher_windows",
      "rootUri": "file:///Users/bonasr/.pub-cache/hosted/pub.dev/url_launcher_windows-3.0.6",
      "packageUri": "lib/",
      "languageVersion": "2.17"
    },
    {
      "name": "vector_math",
      "rootUri": "file:///Users/bonasr/.pub-cache/hosted/pub.dev/vector_math-2.1.4",
      "packageUri": "lib/",
      "languageVersion": "2.14"
    },
    {
      "name": "win32",
      "rootUri": "file:///Users/bonasr/.pub-cache/hosted/pub.dev/win32-3.1.4",
      "packageUri": "lib/",
      "languageVersion": "2.17"
    },
    {
      "name": "xdg_directories",
      "rootUri": "file:///Users/bonasr/.pub-cache/hosted/pub.dev/xdg_directories-1.0.0",
      "packageUri": "lib/",
      "languageVersion": "2.17"
    },
    {
      "name": "xml",
      "rootUri": "file:///Users/bonasr/.pub-cache/hosted/pub.dev/xml-6.1.0",
      "packageUri": "lib/",
      "languageVersion": "2.17"
    },
    {
      "name": "chatme_ui_sdk",
      "rootUri": "../",
      "packageUri": "lib/",
      "languageVersion": "2.12"
    }
  ],
  "generated": "2023-08-14T08:14:39.340759Z",
  "generator": "pub",
  "generatorVersion": "2.19.6"
}
