{
  "students": [
    {
      "student_id": 0,
      "student_name": "Bulat",
      "student_record_number": 615,
      "student_rating": 4.53,
      "student_attendance": 68,
      "student_login": "solnyshko"
    },
    {
      "student_id": 3,
      "student_name": "Barmaley",
      "student_record_number": 379,
      "student_rating": 2.14,
      "student_attendance": 13,
      "student_login": "zlyden"
    },
    {
       "student_id": 4,
       "student_name": "Aquamen",
       "student_record_number": 734,
       "student_rating": 4.99,
       "student_attendance": 100,
       "student_login": "ash_dva_o"
     }
  ]
}