29U128,Anna,Bessonova,IBM,InternationalRelations
27U256,Sergey,Bessonov,Nutririon,Kithchen
22U512,Andrey,Bessonov,ICS,Microelectronics
18U1337,Robert,Plant,ICS,Computer Science
18U228,Jimmy,Page,ICS,Data Science
22U128,Yaroslav,Logunov,ICS,Microelectronics
22U1234,Ekaterina,Paladusta,SM,AutomobileCars