1234567809,AAAAAAAAAAAAAAAAAAAAA,AAAAAAAAAAAAAAA,-631713040,-631713040
1567980143,Azimov,Robot,2,0
1234567890,James,Terminator,15,13
9666965348,Joel Spolsky,Joel on Software,10,9
5845908914,Kernighan & Ritchie,The C Programming Language,13,12
9999999999,Mike,Monsters,73,72