<?xml version="1.0" encoding="iso-8859-1"?>
<!-- Generator: Adobe Illustrator 19.0.0, SVG Export Plug-In . SVG Version: 6.00 Build 0)  -->
<svg version="1.1" id="Layer_1" xmlns="http://www.w3.org/2000/svg" xmlns:xlink="http://www.w3.org/1999/xlink" x="0px" y="0px"
	 viewBox="0 0 512.001 512.001" style="enable-background:new 0 0 512.001 512.001;" xml:space="preserve">
<path style="fill:#80D0E1;" d="M82.937,141.251C37.206,141.251,0,178.456,0,224.189s37.206,82.938,82.937,82.938
	c45.732,0,82.938-37.206,82.938-82.938S128.669,141.251,82.937,141.251z M82.937,268.499c-24.432,0-44.309-19.878-44.309-44.311
	s19.878-44.311,44.309-44.311s44.311,19.878,44.311,44.311C127.247,248.622,107.37,268.499,82.937,268.499z"/>
<path style="fill:#48AEE2;" d="M82.937,141.251v38.627c24.433,0,44.311,19.878,44.311,44.311s-19.878,44.311-44.311,44.311v38.627
	c45.732,0,82.938-37.206,82.938-82.938S128.669,141.251,82.937,141.251z"/>
<path style="fill:#D1D3D4;" d="M256.001,141.251c-45.732,0-82.936,37.206-82.936,82.938s37.206,82.938,82.936,82.938
	c45.732,0,82.938-37.206,82.938-82.938C338.937,178.456,301.731,141.251,256.001,141.251z M256.001,268.499
	c-24.433,0-44.311-19.878-44.311-44.311s19.878-44.311,44.311-44.311s44.311,19.878,44.311,44.311
	C300.31,248.622,280.432,268.499,256.001,268.499z"/>
<path style="fill:#A7A9AC;" d="M256.001,141.251v38.627c24.433,0,44.311,19.878,44.311,44.311s-19.878,44.311-44.311,44.311v38.627
	c45.732,0,82.938-37.206,82.938-82.938C338.937,178.456,301.731,141.251,256.001,141.251z"/>
<path style="fill:#FF7876;" d="M429.064,141.251c-45.731,0-82.937,37.206-82.937,82.938s37.206,82.938,82.937,82.938
	c45.732,0,82.938-37.206,82.938-82.938C512,178.456,474.794,141.251,429.064,141.251z M429.064,268.499
	c-24.433,0-44.309-19.878-44.309-44.311s19.878-44.311,44.309-44.311c24.433,0,44.311,19.878,44.311,44.311
	C473.373,248.622,453.495,268.499,429.064,268.499z"/>
<path style="fill:#FF5E5B;" d="M429.064,141.251v38.627c24.433,0,44.311,19.878,44.311,44.311s-19.878,44.311-44.311,44.311v38.627
	c45.732,0,82.938-37.206,82.938-82.938C512,178.456,474.794,141.251,429.064,141.251z"/>
<path style="fill:#FFE49C;" d="M169.468,204.875c-45.732,0-82.938,37.206-82.938,82.938s37.206,82.938,82.938,82.938
	s82.938-37.206,82.938-82.938S215.2,204.875,169.468,204.875z M169.468,332.122c-24.433,0-44.311-19.878-44.311-44.311
	c0-24.433,19.878-44.311,44.311-44.311s44.311,19.878,44.311,44.311C213.779,312.244,193.901,332.122,169.468,332.122z"/>
<path style="fill:#FFC72D;" d="M169.468,204.875v38.627c24.433,0,44.311,19.878,44.311,44.311s-19.878,44.311-44.311,44.311v38.627
	c45.732,0,82.938-37.206,82.938-82.938S215.2,204.875,169.468,204.875z"/>
<path style="fill:#5AC2AD;" d="M342.531,204.875c-45.732,0-82.938,37.206-82.938,82.938s37.206,82.938,82.938,82.938
	c45.731,0,82.938-37.206,82.938-82.938C425.467,242.081,388.262,204.875,342.531,204.875z M342.531,332.122
	c-24.433,0-44.311-19.878-44.311-44.311c0-24.433,19.878-44.311,44.311-44.311c24.432,0,44.311,19.878,44.311,44.311
	C386.84,312.244,366.962,332.122,342.531,332.122z"/>
<path style="fill:#1DA49C;" d="M342.531,204.875v38.627c24.433,0,44.311,19.878,44.311,44.311s-19.878,44.311-44.311,44.311v38.627
	c45.732,0,82.938-37.206,82.938-82.938C425.467,242.081,388.262,204.875,342.531,204.875z"/>
<g>
</g>
<g>
</g>
<g>
</g>
<g>
</g>
<g>
</g>
<g>
</g>
<g>
</g>
<g>
</g>
<g>
</g>
<g>
</g>
<g>
</g>
<g>
</g>
<g>
</g>
<g>
</g>
<g>
</g>
</svg>
