<svg width="30" height="30" viewBox="0 0 30 30" fill="none" xmlns="http://www.w3.org/2000/svg">
<path d="M11.25 8.75H13.75V15H20V17.5H11.25V8.75Z" fill="url(#paint0_linear_193_860)"/>
<path fill-rule="evenodd" clip-rule="evenodd" d="M27.5 15C27.5 21.9037 21.9037 27.5 15 27.5C8.09625 27.5 2.5 21.9037 2.5 15C2.5 8.09625 8.09625 2.5 15 2.5C21.9037 2.5 27.5 8.09625 27.5 15ZM25 15C25 17.6522 23.9464 20.1957 22.0711 22.0711C20.1957 23.9464 17.6522 25 15 25C12.3478 25 9.8043 23.9464 7.92893 22.0711C6.05357 20.1957 5 17.6522 5 15C5 12.3478 6.05357 9.8043 7.92893 7.92893C9.8043 6.05357 12.3478 5 15 5C17.6522 5 20.1957 6.05357 22.0711 7.92893C23.9464 9.8043 25 12.3478 25 15Z" fill="url(#paint1_linear_193_860)"/>
<defs>
<linearGradient id="paint0_linear_193_860" x1="11.25" y1="8.75" x2="20.7805" y2="9.7042" gradientUnits="userSpaceOnUse">
<stop stop-color="#5FC653"/>
<stop offset="1" stop-color="#A2D631"/>
</linearGradient>
<linearGradient id="paint1_linear_193_860" x1="2.5" y1="2.5" x2="29.7301" y2="5.22628" gradientUnits="userSpaceOnUse">
<stop stop-color="#5FC653"/>
<stop offset="1" stop-color="#A2D631"/>
</linearGradient>
</defs>
</svg>
