<svg width="30" height="30" viewBox="0 0 30 30" fill="none" xmlns="http://www.w3.org/2000/svg">
<path d="M26.25 12.5C26.25 21.25 15 28.75 15 28.75C15 28.75 3.75 21.25 3.75 12.5C3.75 9.51631 4.93526 6.65483 7.04505 4.54505C9.15483 2.43526 12.0163 1.25 15 1.25C17.9837 1.25 20.8452 2.43526 22.955 4.54505C25.0647 6.65483 26.25 9.51631 26.25 12.5Z" stroke="url(#paint0_linear_156_655)" stroke-width="2" stroke-linecap="round" stroke-linejoin="round"/>
<path d="M15 16.25C17.0711 16.25 18.75 14.5711 18.75 12.5C18.75 10.4289 17.0711 8.75 15 8.75C12.9289 8.75 11.25 10.4289 11.25 12.5C11.25 14.5711 12.9289 16.25 15 16.25Z" stroke="url(#paint1_linear_156_655)" stroke-width="2" stroke-linecap="round" stroke-linejoin="round"/>
<defs>
<linearGradient id="paint0_linear_156_655" x1="3.75" y1="1.25" x2="28.3377" y2="3.26414" gradientUnits="userSpaceOnUse">
<stop stop-color="#5FC653"/>
<stop offset="1" stop-color="#A2D631"/>
</linearGradient>
<linearGradient id="paint1_linear_156_655" x1="11.25" y1="8.75" x2="19.419" y2="9.56788" gradientUnits="userSpaceOnUse">
<stop stop-color="#5FC653"/>
<stop offset="1" stop-color="#A2D631"/>
</linearGradient>
</defs>
</svg>
