<svg width="274" height="287" viewBox="0 0 274 287" fill="none" xmlns="http://www.w3.org/2000/svg">
<g filter="url(#filter0_f_111_86)">
<g filter="url(#filter1_d_111_86)">
<circle cx="133" cy="146" r="61" fill="url(#paint0_linear_111_86)"/>
</g>
<g filter="url(#filter2_f_111_86)">
<circle cx="119.844" cy="119.686" r="19.1373" fill="white" fill-opacity="0.8"/>
</g>
<path d="M109 112L170 146.5L109 181L109 112Z" fill="white"/>
</g>
<defs>
<filter id="filter0_f_111_86" x="67" y="80" width="132" height="132" filterUnits="userSpaceOnUse" color-interpolation-filters="sRGB">
<feFlood flood-opacity="0" result="BackgroundImageFix"/>
<feBlend mode="normal" in="SourceGraphic" in2="BackgroundImageFix" result="shape"/>
<feGaussianBlur stdDeviation="2.5" result="effect1_foregroundBlur_111_86"/>
</filter>
<filter id="filter1_d_111_86" x="32" y="45" width="242" height="242" filterUnits="userSpaceOnUse" color-interpolation-filters="sRGB">
<feFlood flood-opacity="0" result="BackgroundImageFix"/>
<feColorMatrix in="SourceAlpha" type="matrix" values="0 0 0 0 0 0 0 0 0 0 0 0 0 0 0 0 0 0 127 0" result="hardAlpha"/>
<feOffset dx="20" dy="20"/>
<feGaussianBlur stdDeviation="30"/>
<feComposite in2="hardAlpha" operator="out"/>
<feColorMatrix type="matrix" values="0 0 0 0 0 0 0 0 0 0 0 0 0 0 0 0 0 0 0.15 0"/>
<feBlend mode="normal" in2="BackgroundImageFix" result="effect1_dropShadow_111_86"/>
<feBlend mode="normal" in="SourceGraphic" in2="effect1_dropShadow_111_86" result="shape"/>
</filter>
<filter id="filter2_f_111_86" x="0.706909" y="0.54895" width="238.275" height="238.275" filterUnits="userSpaceOnUse" color-interpolation-filters="sRGB">
<feFlood flood-opacity="0" result="BackgroundImageFix"/>
<feBlend mode="normal" in="SourceGraphic" in2="BackgroundImageFix" result="shape"/>
<feGaussianBlur stdDeviation="50" result="effect1_foregroundBlur_111_86"/>
</filter>
<linearGradient id="paint0_linear_111_86" x1="72" y1="85" x2="204.883" y2="98.3043" gradientUnits="userSpaceOnUse">
<stop stop-color="#5FC653"/>
<stop offset="1" stop-color="#A2D631"/>
</linearGradient>
</defs>
</svg>
