{
  "contractName": "ReentrancyGuard",
  "abi": [],
  "metadata": "{\"compiler\":{\"version\":\"0.6.12+commit.27d51765\"},\"language\":\"Solidity\",\"output\":{\"abi\":[],\"devdoc\":{\"details\":\"Contract module that helps prevent reentrant calls to a function. Inheriting from `ReentrancyGuard` will make the {nonReentrant} modifier available, which can be applied to functions to make sure there are no nested (reentrant) calls to them. Note that because there is a single `nonReentrant` guard, functions marked as `nonReentrant` may not call one another. This can be worked around by making those functions `private`, and then adding `external` `nonReentrant` entry points to them. TIP: If you would like to learn more about reentrancy and alternative ways to protect against it, check out our blog post https://blog.openzeppelin.com/reentrancy-after-istanbul/[Reentrancy After Istanbul].\",\"kind\":\"dev\",\"methods\":{},\"version\":1},\"userdoc\":{\"kind\":\"user\",\"methods\":{},\"version\":1}},\"settings\":{\"compilationTarget\":{\"@openzeppelin/contracts/utils/ReentrancyGuard.sol\":\"ReentrancyGuard\"},\"evmVersion\":\"istanbul\",\"libraries\":{},\"metadata\":{\"bytecodeHash\":\"ipfs\"},\"optimizer\":{\"enabled\":false,\"runs\":200},\"remappings\":[]},\"sources\":{\"@openzeppelin/contracts/utils/ReentrancyGuard.sol\":{\"keccak256\":\"0x5cc574fb09fe4a5f96228ee3af85d268aae6e0b91fc0f2f90b08e9b207bfefd5\",\"urls\":[\"bzz-raw://9e043d364d848bedcafab010a00bb8069b4719a447cd5cf41be4f2993d8e9fc5\",\"dweb:/ipfs/QmPdecjvQJvjxcEH8jd2vuKxKhBWbUu9qLft4kfKz96eR3\"]}},\"version\":1}",
  "bytecode": "0x",
  "deployedBytecode": "0x",
  "immutableReferences": {},
  "sourceMap": "",
  "deployedSourceMap": "",
  "source": "pragma solidity ^0.6.0;\n\n/**\n * @dev Contract module that helps prevent reentrant calls to a function.\n *\n * Inheriting from `ReentrancyGuard` will make the {nonReentrant} modifier\n * available, which can be applied to functions to make sure there are no nested\n * (reentrant) calls to them.\n *\n * Note that because there is a single `nonReentrant` guard, functions marked as\n * `nonReentrant` may not call one another. This can be worked around by making\n * those functions `private`, and then adding `external` `nonReentrant` entry\n * points to them.\n *\n * TIP: If you would like to learn more about reentrancy and alternative ways\n * to protect against it, check out our blog post\n * https://blog.openzeppelin.com/reentrancy-after-istanbul/[Reentrancy After Istanbul].\n */\ncontract ReentrancyGuard {\n    bool private _notEntered;\n\n    constructor () internal {\n        // Storing an initial non-zero value makes deployment a bit more\n        // expensive, but in exchange the refund on every call to nonReentrant\n        // will be lower in amount. Since refunds are capped to a percetange of\n        // the total transaction's gas, it is best to keep them low in cases\n        // like this one, to increase the likelihood of the full refund coming\n        // into effect.\n        _notEntered = true;\n    }\n\n    /**\n     * @dev Prevents a contract from calling itself, directly or indirectly.\n     * Calling a `nonReentrant` function from another `nonReentrant`\n     * function is not supported. It is possible to prevent this from happening\n     * by making the `nonReentrant` function external, and make it call a\n     * `private` function that does the actual work.\n     */\n    modifier nonReentrant() {\n        // On the first call to nonReentrant, _notEntered will be true\n        require(_notEntered, \"ReentrancyGuard: reentrant call\");\n\n        // Any calls to nonReentrant after this point will fail\n        _notEntered = false;\n\n        _;\n\n        // By storing the original value once again, a refund is triggered (see\n        // https://eips.ethereum.org/EIPS/eip-2200)\n        _notEntered = true;\n    }\n}\n",
  "sourcePath": "@openzeppelin/contracts/utils/ReentrancyGuard.sol",
  "ast": {
    "absolutePath": "@openzeppelin/contracts/utils/ReentrancyGuard.sol",
    "exportedSymbols": {
      "ReentrancyGuard": [
        1131
      ]
    },
    "id": 1132,
    "license": null,
    "nodeType": "SourceUnit",
    "nodes": [
      {
        "id": 1101,
        "literals": [
          "solidity",
          "^",
          "0.6",
          ".0"
        ],
        "nodeType": "PragmaDirective",
        "src": "0:23:6"
      },
      {
        "abstract": false,
        "baseContracts": [],
        "contractDependencies": [],
        "contractKind": "contract",
        "documentation": {
          "id": 1102,
          "nodeType": "StructuredDocumentation",
          "src": "25:750:6",
          "text": " @dev Contract module that helps prevent reentrant calls to a function.\n Inheriting from `ReentrancyGuard` will make the {nonReentrant} modifier\n available, which can be applied to functions to make sure there are no nested\n (reentrant) calls to them.\n Note that because there is a single `nonReentrant` guard, functions marked as\n `nonReentrant` may not call one another. This can be worked around by making\n those functions `private`, and then adding `external` `nonReentrant` entry\n points to them.\n TIP: If you would like to learn more about reentrancy and alternative ways\n to protect against it, check out our blog post\n https://blog.openzeppelin.com/reentrancy-after-istanbul/[Reentrancy After Istanbul]."
        },
        "fullyImplemented": true,
        "id": 1131,
        "linearizedBaseContracts": [
          1131
        ],
        "name": "ReentrancyGuard",
        "nodeType": "ContractDefinition",
        "nodes": [
          {
            "constant": false,
            "id": 1104,
            "mutability": "mutable",
            "name": "_notEntered",
            "nodeType": "VariableDeclaration",
            "overrides": null,
            "scope": 1131,
            "src": "807:24:6",
            "stateVariable": true,
            "storageLocation": "default",
            "typeDescriptions": {
              "typeIdentifier": "t_bool",
              "typeString": "bool"
            },
            "typeName": {
              "id": 1103,
              "name": "bool",
              "nodeType": "ElementaryTypeName",
              "src": "807:4:6",
              "typeDescriptions": {
                "typeIdentifier": "t_bool",
                "typeString": "bool"
              }
            },
            "value": null,
            "visibility": "private"
          },
          {
            "body": {
              "id": 1111,
              "nodeType": "Block",
              "src": "862:447:6",
              "statements": [
                {
                  "expression": {
                    "argumentTypes": null,
                    "id": 1109,
                    "isConstant": false,
                    "isLValue": false,
                    "isPure": false,
                    "lValueRequested": false,
                    "leftHandSide": {
                      "argumentTypes": null,
                      "id": 1107,
                      "name": "_notEntered",
                      "nodeType": "Identifier",
                      "overloadedDeclarations": [],
                      "referencedDeclaration": 1104,
                      "src": "1284:11:6",
                      "typeDescriptions": {
                        "typeIdentifier": "t_bool",
                        "typeString": "bool"
                      }
                    },
                    "nodeType": "Assignment",
                    "operator": "=",
                    "rightHandSide": {
                      "argumentTypes": null,
                      "hexValue": "74727565",
                      "id": 1108,
                      "isConstant": false,
                      "isLValue": false,
                      "isPure": true,
                      "kind": "bool",
                      "lValueRequested": false,
                      "nodeType": "Literal",
                      "src": "1298:4:6",
                      "subdenomination": null,
                      "typeDescriptions": {
                        "typeIdentifier": "t_bool",
                        "typeString": "bool"
                      },
                      "value": "true"
                    },
                    "src": "1284:18:6",
                    "typeDescriptions": {
                      "typeIdentifier": "t_bool",
                      "typeString": "bool"
                    }
                  },
                  "id": 1110,
                  "nodeType": "ExpressionStatement",
                  "src": "1284:18:6"
                }
              ]
            },
            "documentation": null,
            "id": 1112,
            "implemented": true,
            "kind": "constructor",
            "modifiers": [],
            "name": "",
            "nodeType": "FunctionDefinition",
            "overrides": null,
            "parameters": {
              "id": 1105,
              "nodeType": "ParameterList",
              "parameters": [],
              "src": "850:2:6"
            },
            "returnParameters": {
              "id": 1106,
              "nodeType": "ParameterList",
              "parameters": [],
              "src": "862:0:6"
            },
            "scope": 1131,
            "src": "838:471:6",
            "stateMutability": "nonpayable",
            "virtual": false,
            "visibility": "internal"
          },
          {
            "body": {
              "id": 1129,
              "nodeType": "Block",
              "src": "1708:410:6",
              "statements": [
                {
                  "expression": {
                    "argumentTypes": null,
                    "arguments": [
                      {
                        "argumentTypes": null,
                        "id": 1116,
                        "name": "_notEntered",
                        "nodeType": "Identifier",
                        "overloadedDeclarations": [],
                        "referencedDeclaration": 1104,
                        "src": "1797:11:6",
                        "typeDescriptions": {
                          "typeIdentifier": "t_bool",
                          "typeString": "bool"
                        }
                      },
                      {
                        "argumentTypes": null,
                        "hexValue": "5265656e7472616e637947756172643a207265656e7472616e742063616c6c",
                        "id": 1117,
                        "isConstant": false,
                        "isLValue": false,
                        "isPure": true,
                        "kind": "string",
                        "lValueRequested": false,
                        "nodeType": "Literal",
                        "src": "1810:33:6",
                        "subdenomination": null,
                        "typeDescriptions": {
                          "typeIdentifier": "t_stringliteral_ebf73bba305590e4764d5cb53b69bffd6d4d092d1a67551cb346f8cfcdab8619",
                          "typeString": "literal_string \"ReentrancyGuard: reentrant call\""
                        },
                        "value": "ReentrancyGuard: reentrant call"
                      }
                    ],
                    "expression": {
                      "argumentTypes": [
                        {
                          "typeIdentifier": "t_bool",
                          "typeString": "bool"
                        },
                        {
                          "typeIdentifier": "t_stringliteral_ebf73bba305590e4764d5cb53b69bffd6d4d092d1a67551cb346f8cfcdab8619",
                          "typeString": "literal_string \"ReentrancyGuard: reentrant call\""
                        }
                      ],
                      "id": 1115,
                      "name": "require",
                      "nodeType": "Identifier",
                      "overloadedDeclarations": [
                        -18,
                        -18
                      ],
                      "referencedDeclaration": -18,
                      "src": "1789:7:6",
                      "typeDescriptions": {
                        "typeIdentifier": "t_function_require_pure$_t_bool_$_t_string_memory_ptr_$returns$__$",
                        "typeString": "function (bool,string memory) pure"
                      }
                    },
                    "id": 1118,
                    "isConstant": false,
                    "isLValue": false,
                    "isPure": false,
                    "kind": "functionCall",
                    "lValueRequested": false,
                    "names": [],
                    "nodeType": "FunctionCall",
                    "src": "1789:55:6",
                    "tryCall": false,
                    "typeDescriptions": {
                      "typeIdentifier": "t_tuple$__$",
                      "typeString": "tuple()"
                    }
                  },
                  "id": 1119,
                  "nodeType": "ExpressionStatement",
                  "src": "1789:55:6"
                },
                {
                  "expression": {
                    "argumentTypes": null,
                    "id": 1122,
                    "isConstant": false,
                    "isLValue": false,
                    "isPure": false,
                    "lValueRequested": false,
                    "leftHandSide": {
                      "argumentTypes": null,
                      "id": 1120,
                      "name": "_notEntered",
                      "nodeType": "Identifier",
                      "overloadedDeclarations": [],
                      "referencedDeclaration": 1104,
                      "src": "1919:11:6",
                      "typeDescriptions": {
                        "typeIdentifier": "t_bool",
                        "typeString": "bool"
                      }
                    },
                    "nodeType": "Assignment",
                    "operator": "=",
                    "rightHandSide": {
                      "argumentTypes": null,
                      "hexValue": "66616c7365",
                      "id": 1121,
                      "isConstant": false,
                      "isLValue": false,
                      "isPure": true,
                      "kind": "bool",
                      "lValueRequested": false,
                      "nodeType": "Literal",
                      "src": "1933:5:6",
                      "subdenomination": null,
                      "typeDescriptions": {
                        "typeIdentifier": "t_bool",
                        "typeString": "bool"
                      },
                      "value": "false"
                    },
                    "src": "1919:19:6",
                    "typeDescriptions": {
                      "typeIdentifier": "t_bool",
                      "typeString": "bool"
                    }
                  },
                  "id": 1123,
                  "nodeType": "ExpressionStatement",
                  "src": "1919:19:6"
                },
                {
                  "id": 1124,
                  "nodeType": "PlaceholderStatement",
                  "src": "1949:1:6"
                },
                {
                  "expression": {
                    "argumentTypes": null,
                    "id": 1127,
                    "isConstant": false,
                    "isLValue": false,
                    "isPure": false,
                    "lValueRequested": false,
                    "leftHandSide": {
                      "argumentTypes": null,
                      "id": 1125,
                      "name": "_notEntered",
                      "nodeType": "Identifier",
                      "overloadedDeclarations": [],
                      "referencedDeclaration": 1104,
                      "src": "2093:11:6",
                      "typeDescriptions": {
                        "typeIdentifier": "t_bool",
                        "typeString": "bool"
                      }
                    },
                    "nodeType": "Assignment",
                    "operator": "=",
                    "rightHandSide": {
                      "argumentTypes": null,
                      "hexValue": "74727565",
                      "id": 1126,
                      "isConstant": false,
                      "isLValue": false,
                      "isPure": true,
                      "kind": "bool",
                      "lValueRequested": false,
                      "nodeType": "Literal",
                      "src": "2107:4:6",
                      "subdenomination": null,
                      "typeDescriptions": {
                        "typeIdentifier": "t_bool",
                        "typeString": "bool"
                      },
                      "value": "true"
                    },
                    "src": "2093:18:6",
                    "typeDescriptions": {
                      "typeIdentifier": "t_bool",
                      "typeString": "bool"
                    }
                  },
                  "id": 1128,
                  "nodeType": "ExpressionStatement",
                  "src": "2093:18:6"
                }
              ]
            },
            "documentation": {
              "id": 1113,
              "nodeType": "StructuredDocumentation",
              "src": "1315:364:6",
              "text": " @dev Prevents a contract from calling itself, directly or indirectly.\n Calling a `nonReentrant` function from another `nonReentrant`\n function is not supported. It is possible to prevent this from happening\n by making the `nonReentrant` function external, and make it call a\n `private` function that does the actual work."
            },
            "id": 1130,
            "name": "nonReentrant",
            "nodeType": "ModifierDefinition",
            "overrides": null,
            "parameters": {
              "id": 1114,
              "nodeType": "ParameterList",
              "parameters": [],
              "src": "1705:2:6"
            },
            "src": "1684:434:6",
            "virtual": false,
            "visibility": "internal"
          }
        ],
        "scope": 1132,
        "src": "776:1344:6"
      }
    ],
    "src": "0:2121:6"
  },
  "legacyAST": {
    "attributes": {
      "absolutePath": "@openzeppelin/contracts/utils/ReentrancyGuard.sol",
      "exportedSymbols": {
        "ReentrancyGuard": [
          1131
        ]
      },
      "license": null
    },
    "children": [
      {
        "attributes": {
          "literals": [
            "solidity",
            "^",
            "0.6",
            ".0"
          ]
        },
        "id": 1101,
        "name": "PragmaDirective",
        "src": "0:23:6"
      },
      {
        "attributes": {
          "abstract": false,
          "baseContracts": [
            null
          ],
          "contractDependencies": [
            null
          ],
          "contractKind": "contract",
          "fullyImplemented": true,
          "linearizedBaseContracts": [
            1131
          ],
          "name": "ReentrancyGuard",
          "scope": 1132
        },
        "children": [
          {
            "attributes": {
              "text": " @dev Contract module that helps prevent reentrant calls to a function.\n Inheriting from `ReentrancyGuard` will make the {nonReentrant} modifier\n available, which can be applied to functions to make sure there are no nested\n (reentrant) calls to them.\n Note that because there is a single `nonReentrant` guard, functions marked as\n `nonReentrant` may not call one another. This can be worked around by making\n those functions `private`, and then adding `external` `nonReentrant` entry\n points to them.\n TIP: If you would like to learn more about reentrancy and alternative ways\n to protect against it, check out our blog post\n https://blog.openzeppelin.com/reentrancy-after-istanbul/[Reentrancy After Istanbul]."
            },
            "id": 1102,
            "name": "StructuredDocumentation",
            "src": "25:750:6"
          },
          {
            "attributes": {
              "constant": false,
              "mutability": "mutable",
              "name": "_notEntered",
              "overrides": null,
              "scope": 1131,
              "stateVariable": true,
              "storageLocation": "default",
              "type": "bool",
              "value": null,
              "visibility": "private"
            },
            "children": [
              {
                "attributes": {
                  "name": "bool",
                  "type": "bool"
                },
                "id": 1103,
                "name": "ElementaryTypeName",
                "src": "807:4:6"
              }
            ],
            "id": 1104,
            "name": "VariableDeclaration",
            "src": "807:24:6"
          },
          {
            "attributes": {
              "documentation": null,
              "implemented": true,
              "isConstructor": true,
              "kind": "constructor",
              "modifiers": [
                null
              ],
              "name": "",
              "overrides": null,
              "scope": 1131,
              "stateMutability": "nonpayable",
              "virtual": false,
              "visibility": "internal"
            },
            "children": [
              {
                "attributes": {
                  "parameters": [
                    null
                  ]
                },
                "children": [],
                "id": 1105,
                "name": "ParameterList",
                "src": "850:2:6"
              },
              {
                "attributes": {
                  "parameters": [
                    null
                  ]
                },
                "children": [],
                "id": 1106,
                "name": "ParameterList",
                "src": "862:0:6"
              },
              {
                "children": [
                  {
                    "children": [
                      {
                        "attributes": {
                          "argumentTypes": null,
                          "isConstant": false,
                          "isLValue": false,
                          "isPure": false,
                          "lValueRequested": false,
                          "operator": "=",
                          "type": "bool"
                        },
                        "children": [
                          {
                            "attributes": {
                              "argumentTypes": null,
                              "overloadedDeclarations": [
                                null
                              ],
                              "referencedDeclaration": 1104,
                              "type": "bool",
                              "value": "_notEntered"
                            },
                            "id": 1107,
                            "name": "Identifier",
                            "src": "1284:11:6"
                          },
                          {
                            "attributes": {
                              "argumentTypes": null,
                              "hexvalue": "74727565",
                              "isConstant": false,
                              "isLValue": false,
                              "isPure": true,
                              "lValueRequested": false,
                              "subdenomination": null,
                              "token": "bool",
                              "type": "bool",
                              "value": "true"
                            },
                            "id": 1108,
                            "name": "Literal",
                            "src": "1298:4:6"
                          }
                        ],
                        "id": 1109,
                        "name": "Assignment",
                        "src": "1284:18:6"
                      }
                    ],
                    "id": 1110,
                    "name": "ExpressionStatement",
                    "src": "1284:18:6"
                  }
                ],
                "id": 1111,
                "name": "Block",
                "src": "862:447:6"
              }
            ],
            "id": 1112,
            "name": "FunctionDefinition",
            "src": "838:471:6"
          },
          {
            "attributes": {
              "name": "nonReentrant",
              "overrides": null,
              "virtual": false,
              "visibility": "internal"
            },
            "children": [
              {
                "attributes": {
                  "text": " @dev Prevents a contract from calling itself, directly or indirectly.\n Calling a `nonReentrant` function from another `nonReentrant`\n function is not supported. It is possible to prevent this from happening\n by making the `nonReentrant` function external, and make it call a\n `private` function that does the actual work."
                },
                "id": 1113,
                "name": "StructuredDocumentation",
                "src": "1315:364:6"
              },
              {
                "attributes": {
                  "parameters": [
                    null
                  ]
                },
                "children": [],
                "id": 1114,
                "name": "ParameterList",
                "src": "1705:2:6"
              },
              {
                "children": [
                  {
                    "children": [
                      {
                        "attributes": {
                          "argumentTypes": null,
                          "isConstant": false,
                          "isLValue": false,
                          "isPure": false,
                          "isStructConstructorCall": false,
                          "lValueRequested": false,
                          "names": [
                            null
                          ],
                          "tryCall": false,
                          "type": "tuple()",
                          "type_conversion": false
                        },
                        "children": [
                          {
                            "attributes": {
                              "argumentTypes": [
                                {
                                  "typeIdentifier": "t_bool",
                                  "typeString": "bool"
                                },
                                {
                                  "typeIdentifier": "t_stringliteral_ebf73bba305590e4764d5cb53b69bffd6d4d092d1a67551cb346f8cfcdab8619",
                                  "typeString": "literal_string \"ReentrancyGuard: reentrant call\""
                                }
                              ],
                              "overloadedDeclarations": [
                                -18,
                                -18
                              ],
                              "referencedDeclaration": -18,
                              "type": "function (bool,string memory) pure",
                              "value": "require"
                            },
                            "id": 1115,
                            "name": "Identifier",
                            "src": "1789:7:6"
                          },
                          {
                            "attributes": {
                              "argumentTypes": null,
                              "overloadedDeclarations": [
                                null
                              ],
                              "referencedDeclaration": 1104,
                              "type": "bool",
                              "value": "_notEntered"
                            },
                            "id": 1116,
                            "name": "Identifier",
                            "src": "1797:11:6"
                          },
                          {
                            "attributes": {
                              "argumentTypes": null,
                              "hexvalue": "5265656e7472616e637947756172643a207265656e7472616e742063616c6c",
                              "isConstant": false,
                              "isLValue": false,
                              "isPure": true,
                              "lValueRequested": false,
                              "subdenomination": null,
                              "token": "string",
                              "type": "literal_string \"ReentrancyGuard: reentrant call\"",
                              "value": "ReentrancyGuard: reentrant call"
                            },
                            "id": 1117,
                            "name": "Literal",
                            "src": "1810:33:6"
                          }
                        ],
                        "id": 1118,
                        "name": "FunctionCall",
                        "src": "1789:55:6"
                      }
                    ],
                    "id": 1119,
                    "name": "ExpressionStatement",
                    "src": "1789:55:6"
                  },
                  {
                    "children": [
                      {
                        "attributes": {
                          "argumentTypes": null,
                          "isConstant": false,
                          "isLValue": false,
                          "isPure": false,
                          "lValueRequested": false,
                          "operator": "=",
                          "type": "bool"
                        },
                        "children": [
                          {
                            "attributes": {
                              "argumentTypes": null,
                              "overloadedDeclarations": [
                                null
                              ],
                              "referencedDeclaration": 1104,
                              "type": "bool",
                              "value": "_notEntered"
                            },
                            "id": 1120,
                            "name": "Identifier",
                            "src": "1919:11:6"
                          },
                          {
                            "attributes": {
                              "argumentTypes": null,
                              "hexvalue": "66616c7365",
                              "isConstant": false,
                              "isLValue": false,
                              "isPure": true,
                              "lValueRequested": false,
                              "subdenomination": null,
                              "token": "bool",
                              "type": "bool",
                              "value": "false"
                            },
                            "id": 1121,
                            "name": "Literal",
                            "src": "1933:5:6"
                          }
                        ],
                        "id": 1122,
                        "name": "Assignment",
                        "src": "1919:19:6"
                      }
                    ],
                    "id": 1123,
                    "name": "ExpressionStatement",
                    "src": "1919:19:6"
                  },
                  {
                    "id": 1124,
                    "name": "PlaceholderStatement",
                    "src": "1949:1:6"
                  },
                  {
                    "children": [
                      {
                        "attributes": {
                          "argumentTypes": null,
                          "isConstant": false,
                          "isLValue": false,
                          "isPure": false,
                          "lValueRequested": false,
                          "operator": "=",
                          "type": "bool"
                        },
                        "children": [
                          {
                            "attributes": {
                              "argumentTypes": null,
                              "overloadedDeclarations": [
                                null
                              ],
                              "referencedDeclaration": 1104,
                              "type": "bool",
                              "value": "_notEntered"
                            },
                            "id": 1125,
                            "name": "Identifier",
                            "src": "2093:11:6"
                          },
                          {
                            "attributes": {
                              "argumentTypes": null,
                              "hexvalue": "74727565",
                              "isConstant": false,
                              "isLValue": false,
                              "isPure": true,
                              "lValueRequested": false,
                              "subdenomination": null,
                              "token": "bool",
                              "type": "bool",
                              "value": "true"
                            },
                            "id": 1126,
                            "name": "Literal",
                            "src": "2107:4:6"
                          }
                        ],
                        "id": 1127,
                        "name": "Assignment",
                        "src": "2093:18:6"
                      }
                    ],
                    "id": 1128,
                    "name": "ExpressionStatement",
                    "src": "2093:18:6"
                  }
                ],
                "id": 1129,
                "name": "Block",
                "src": "1708:410:6"
              }
            ],
            "id": 1130,
            "name": "ModifierDefinition",
            "src": "1684:434:6"
          }
        ],
        "id": 1131,
        "name": "ContractDefinition",
        "src": "776:1344:6"
      }
    ],
    "id": 1132,
    "name": "SourceUnit",
    "src": "0:2121:6"
  },
  "compiler": {
    "name": "solc",
    "version": "0.6.12+commit.27d51765.Emscripten.clang"
  },
  "networks": {},
  "schemaVersion": "3.4.1",
  "updatedAt": "2021-07-12T07:30:33.527Z",
  "devdoc": {
    "details": "Contract module that helps prevent reentrant calls to a function. Inheriting from `ReentrancyGuard` will make the {nonReentrant} modifier available, which can be applied to functions to make sure there are no nested (reentrant) calls to them. Note that because there is a single `nonReentrant` guard, functions marked as `nonReentrant` may not call one another. This can be worked around by making those functions `private`, and then adding `external` `nonReentrant` entry points to them. TIP: If you would like to learn more about reentrancy and alternative ways to protect against it, check out our blog post https://blog.openzeppelin.com/reentrancy-after-istanbul/[Reentrancy After Istanbul].",
    "kind": "dev",
    "methods": {},
    "version": 1
  },
  "userdoc": {
    "kind": "user",
    "methods": {},
    "version": 1
  }
}