// Jest Snapshot v1, https://goo.gl/fbAQLP

exports[`SidebarDatePicker renders expected template 1`] = `
<div
  class="block date epic-date"
>
  <collapsedcalendaricon-stub
    class="sidebar-collapsed-icon"
    containerclass=""
    showicon="true"
    text="None"
    tooltiptext=""
  />
   
  <div
    class="title"
  >
    
    Date
    
    <!---->
     
    <div
      class="float-right d-flex"
    >
      <icon-stub
        class="help-icon append-right-5"
        name="question-o"
        size="16"
        tabindex="0"
      />
       
      <glbutton-stub
        class="btn-sidebar-action"
        variant="link"
      >
        
        Edit
      
      </glbutton-stub>
       
      <!---->
    </div>
  </div>
   
  <div
    class="value"
  >
    <div
      class="value-type-fixed text-secondary is-option-selected d-flex"
    >
      <input
        name="datetype_test"
        type="radio"
      />
       
      <span
        class="prepend-left-5"
      >
        Fixed:
      </span>
       
      <span
        class="d-flex value-content prepend-left-2"
      >
        <span
          class="no-value"
        >
           None 
        </span>
      </span>
    </div>
     
    <abbr
      class="value-type-dynamic text-secondary d-flex prepend-top-10"
      data-html="true"
      data-original-title="Select an issue with milestone to set date"
      data-placement="bottom"
      title=""
    >
      <input
        name="datetype_test"
        type="radio"
      />
       
      <span
        class="prepend-left-5"
      >
        From milestones:
      </span>
       
      <span
        class="value-content prepend-left-2"
      >
        None
      </span>
       
      <!---->
    </abbr>
  </div>
</div>
`;
