%time,field.timestamp,field.latitude,field.lat_dir,field.longitude,field.long_dir,field.altitude,field.utmeasting,field.utmnorthing,field.zone,field.letter
1581013104150907411,181825.0,42.3370132446,N,-71.089515686,W,11.5,327863.832023,4689310.16846,19,T
1581013105140740170,181826.0,42.3370399475,N,-71.0894927979,W,11.3999996185,327865.547924,4689312.90403,19,T
1581013106148791827,181827.0,42.3370704651,N,-71.0894851685,W,11.3000001907,327866.17901,4689316.22181,19,T
1581013107150793291,181828.0,42.3371009827,N,-71.0894927979,W,11.1999998093,327865.711638,4689319.56657,19,T
1581013108143210680,181829.0,42.3371276855,N,-71.0895080566,W,11.1999998093,327864.548636,4689322.55807,19,T
1581013109150927045,181830.0,42.337146759,N,-71.0895233154,W,11.1000003815,327863.230137,4689324.81266,19,T
1581013110154110799,181831.0,42.3371582031,N,-71.0895385742,W,11.0,327862.030756,4689326.32359,19,T
1581013111145057710,181832.0,42.3371734619,N,-71.089553833,W,11.1000003815,327860.826828,4689327.64945,19,T
1581013112151995009,181833.0,42.3371810913,N,-71.0895690918,W,11.3999996185,327859.751111,4689328.60179,19,T
1581013113154829388,181834.0,42.3371887207,N,-71.08959198,W,11.6000003815,327858.263474,4689329.56426,19,T
1581013114153443415,181835.0,42.3372001648,N,-71.0896148682,W,11.8000001907,327856.098398,4689330.91374,19,T
1581013115149439395,181836.0,42.3372077942,N,-71.0896530151,W,12.0,327853.233146,4689331.72488,19,T
1581013116159257797,181836.0,42.3372039795,N,-71.0896911621,W,12.3000001907,327849.658619,4689331.62754,19,T
1581013117153800402,181837.0,42.3371925354,N,-71.0897369385,W,12.5,327845.919497,4689330.42315,19,T
1581013118150040132,181838.0,42.3371734619,N,-71.0897750854,W,12.6000003815,327842.702311,4689328.09484,19,T
1581013119156260430,181839.0,42.3371391296,N,-71.089805603,W,12.8000001907,327840.144369,4689324.63924,19,T
1581013120153889036,181840.0,42.3371047974,N,-71.0898208618,W,12.8000001907,327838.808543,4689320.59806,19,T
1581013121155960613,181841.0,42.3370666504,N,-71.0898208618,W,12.8000001907,327838.978546,4689316.33468,19,T
1581013122181670811,181842.0,42.3370285034,N,-71.0897979736,W,12.6999998093,327840.530719,4689312.40771,19,T
1581013123145202706,181843.0,42.3370018005,N,-71.0897674561,W,12.6000003815,327843.066786,4689309.38246,19,T
1581013124157854501,181844.0,42.3369865417,N,-71.0897216797,W,12.3999996185,327846.458536,4689307.63247,19,T
1581013125169018594,181845.0,42.3369827271,N,-71.0896759033,W,12.3000001907,327850.289497,4689306.98278,19,T
1581013126168055373,181846.0,42.3369903564,N,-71.089630127,W,12.1999998093,327854.156843,4689307.81365,19,T
1581013127197473497,181847.0,42.3370094299,N,-71.08959198,W,12.0,327857.497697,4689309.58338,19,T
1581013128171737429,181848.0,42.3370323181,N,-71.0895614624,W,11.8999996185,327860.312059,4689312.29196,19,T
1581013129174834438,181849.0,42.3370666504,N,-71.0895385742,W,11.8000001907,327862.188006,4689315.94951,19,T
1581013130159885177,181850.0,42.3371009827,N,-71.0895309448,W,11.6999998093,327862.832736,4689319.8225,19,T
1581013131163010704,181851.0,42.3371353149,N,-71.0895385742,W,11.8000001907,327862.241702,4689323.72585,19,T
1581013132162042755,181852.0,42.3371658325,N,-71.0895614624,W,11.8000001907,327860.401264,4689327.10436,19,T
1581013133163147804,181853.0,42.3371925354,N,-71.0895996094,W,11.8999996185,327857.448728,4689329.95465,19,T
1581013134164036521,181854.0,42.3372077942,N,-71.0896453857,W,12.0,327853.924228,4689331.89308,19,T
1581013135163468391,181855.0,42.3372116089,N,-71.0896835327,W,12.1999998093,327850.226039,4689332.35433,19,T
1581013136168310509,181856.0,42.3372077942,N,-71.0897293091,W,12.3000001907,327846.642416,4689331.88685,19,T
1581013137163738709,181857.0,42.3371925354,N,-71.0897750854,W,12.3999996185,327843.16881,4689330.30557,19,T
1581013138159724520,181858.0,42.3371658325,N,-71.089805603,W,12.8000001907,327840.212593,4689327.4153,19,T
1581013139163301776,181859.0,42.3371315002,N,-71.0898284912,W,13.0,327838.194781,4689323.57606,19,T
1581013140179369941,181900.0,42.3370933533,N,-71.0898361206,W,13.1000003815,327837.540941,4689319.33293,19,T
1581013141170258939,181901.0,42.3370552063,N,-71.0898284912,W,13.1999998093,327838.127413,4689315.24451,19,T
1581013142187503279,181902.0,42.337020874,N,-71.089805603,W,13.1999998093,327839.958749,4689311.49585,19,T
1581013143163629846,181903.0,42.3369979858,N,-71.0897674561,W,13.1999998093,327842.773978,4689308.64893,19,T
1581013144165233215,181904.0,42.3369789124,N,-71.0897293091,W,13.1000003815,327846.298488,4689306.71049,19,T
1581013145167252508,181905.0,42.3369750977,N,-71.0896759033,W,13.1000003815,327850.266758,4689306.05742,19,T
1581013146171425988,181906.0,42.3369827271,N,-71.089630127,W,12.8999996185,327854.129555,4689306.70323,19,T
1581013147170034638,181907.0,42.3370018005,N,-71.08959198,W,12.6999998093,327857.612265,4689308.65465,19,T
1581013148167270410,181908.0,42.3370285034,N,-71.0895614624,W,12.6000003815,327860.298415,4689311.73675,19,T
1581013149172226907,181909.0,42.3370628357,N,-71.0895385742,W,12.3999996185,327861.904297,4689315.58612,19,T
1581013150193254646,181910.0,42.3371009827,N,-71.0895385742,W,12.3000001907,327862.146201,4689319.83937,19,T
1581013151171979715,181911.0,42.3371353149,N,-71.089553833,W,12.3000001907,327861.005939,4689323.75622,19,T
1581013152201879973,181912.0,42.3371658325,N,-71.0895843506,W,12.1999998093,327858.749032,4689326.95978,19,T
1581013153169646192,181913.0,42.3371887207,N,-71.0896224976,W,12.3000001907,327855.380029,4689329.63512,19,T
1581013154176608337,181914.0,42.3372001648,N,-71.0896682739,W,12.3999996185,327851.425416,4689330.84339,19,T
1581013155175661238,181915.0,42.3371963501,N,-71.0897216797,W,12.5,327847.301662,4689330.75955,19,T
1581013156179414096,181916.0,42.3371810913,N,-71.0897674561,W,12.6000003815,327843.278828,4689329.19177,19,T
1581013157175262540,181917.0,42.3371543884,N,-71.089805603,W,12.6000003815,327840.185303,4689326.30488,19,T
1581013158175728587,181918.0,42.3371200562,N,-71.0898284912,W,12.8000001907,327838.162942,4689322.28057,19,T
1581013159165985097,181919.0,42.3370780945,N,-71.0898361206,W,12.8000001907,327837.641861,4689317.84899,19,T
1581013160181247992,181920.0,42.3370399475,N,-71.0898208618,W,12.8000001907,327838.635707,4689313.56537,19,T
