%time,field.timestamp,field.latitude,field.lat_dir,field.longitude,field.long_dir,field.altitude,field.utmeasting,field.utmnorthing,field.zone,field.letter
1580866452275791763,13412.0,42.337146759,N,-71.0894317627,W,15.6000003815,327871.056636,4689324.62034,19,T
1580866453276281241,13413.0,42.337146759,N,-71.0894317627,W,15.6000003815,327871.056636,4689324.62034,19,T
1580866454273710525,13414.0,42.337146759,N,-71.0894317627,W,15.6000003815,327871.056636,4689324.62034,19,T
1580866455273787262,13415.0,42.337146759,N,-71.0894317627,W,15.6000003815,327871.056636,4689324.62034,19,T
1580866456268314119,13416.0,42.337146759,N,-71.0894317627,W,15.6000003815,327871.056636,4689324.62034,19,T
1580866457277446496,13417.0,42.337146759,N,-71.0894317627,W,15.6000003815,327871.056636,4689324.62034,19,T
1580866458276129152,13418.0,42.337146759,N,-71.0894317627,W,15.6000003815,327871.056636,4689324.62034,19,T
1580866459278523138,13419.0,42.337146759,N,-71.0894317627,W,15.6000003815,327871.056636,4689324.62034,19,T
1580866460276622752,13420.0,42.337146759,N,-71.0894317627,W,15.6000003815,327871.056636,4689324.62034,19,T
1580866461277013253,13421.0,42.337146759,N,-71.0894317627,W,15.6000003815,327871.061184,4689324.80541,19,T
1580866462269173782,13422.0,42.337146759,N,-71.0894317627,W,15.5,327871.061184,4689324.80541,19,T
1580866463273478798,13423.0,42.337146759,N,-71.0894317627,W,15.5,327871.061184,4689324.80541,19,T
1580866464272775298,13424.0,42.3371505737,N,-71.0894317627,W,15.3000001907,327870.795665,4689325.1823,19,T
1580866465269401801,13425.0,42.3371505737,N,-71.0894317627,W,15.3000001907,327870.795665,4689325.1823,19,T
1580866466271207292,13426.0,42.3371505737,N,-71.0894317627,W,15.3000001907,327870.795665,4689325.1823,19,T
1580866467270710594,13427.0,42.3371505737,N,-71.0894317627,W,15.3000001907,327870.795665,4689325.1823,19,T
1580866468277632956,13428.0,42.3371505737,N,-71.0894317627,W,15.3000001907,327870.795665,4689325.1823,19,T
1580866469277149306,13429.0,42.3371505737,N,-71.0894317627,W,15.3000001907,327870.795665,4689325.1823,19,T
1580866470266864354,13430.0,42.3371505737,N,-71.0894317627,W,15.3000001907,327870.795665,4689325.1823,19,T
1580866471274588934,13431.0,42.3371505737,N,-71.0894393921,W,15.3000001907,327870.658358,4689325.18568,19,T
1580866472273023490,13432.0,42.3371505737,N,-71.0894393921,W,15.3000001907,327870.658358,4689325.18568,19,T
1580866473266002312,13433.0,42.3371505737,N,-71.0894393921,W,15.3000001907,327870.658358,4689325.18568,19,T
1580866474269215637,13434.0,42.3371543884,N,-71.0894393921,W,15.0,327870.392839,4689325.56256,19,T
1580866475272926218,13435.0,42.3371620178,N,-71.0894470215,W,14.8000001907,327870.003655,4689326.49804,19,T
1580866476270536109,13436.0,42.3371772766,N,-71.0894546509,W,14.5,327869.216194,4689327.99885,19,T
1580866477267275412,13437.0,42.3371925354,N,-71.0894699097,W,14.3999996185,327868.025907,4689329.87992,19,T
1580866478266518846,13438.0,42.3372116089,N,-71.0894927979,W,14.3999996185,327866.011779,4689331.78123,19,T
1580866479267495579,13439.0,42.3372306824,N,-71.0895385742,W,13.8999996185,327862.359067,4689334.09318,19,T
1580866480276285940,13440.0,42.3372344971,N,-71.08959198,W,13.5,327858.248958,4689334.56454,19,T
1580866481288887056,13441.0,42.3372268677,N,-71.0896453857,W,13.1999998093,327853.841496,4689334.1173,19,T
1580866482267312610,13442.0,42.3372154236,N,-71.0896911621,W,12.8000001907,327849.685907,4689332.73796,19,T
1580866483275753656,13443.0,42.3371925354,N,-71.0897369385,W,12.6000003815,327846.189562,4689330.23133,19,T
1580866484276935320,13444.0,42.3371696472,N,-71.0897598267,W,12.5,327843.79167,4689327.69771,19,T
1580866485275530792,13445.0,42.337146759,N,-71.0897827148,W,12.3000001907,327842.226715,4689325.51398,19,T
1580866486274581835,13446.0,42.3371238708,N,-71.0897903442,W,12.1999998093,327841.339198,4689322.94324,19,T
1580866487274396884,13447.0,42.337097168,N,-71.0897979736,W,11.8999996185,327840.991812,4689319.98885,19,T
1580866488268242774,13448.0,42.3370666504,N,-71.0897827148,W,11.8000001907,327841.733786,4689316.63734,19,T
1580866489271018225,13449.0,42.3370399475,N,-71.0897598267,W,11.8000001907,327843.716075,4689313.44052,19,T
1580866490267595467,13450.0,42.3370132446,N,-71.0897293091,W,11.8000001907,327846.393998,4689310.59697,19,T
1580866491271612112,13451.0,42.3369979858,N,-71.0896911621,W,11.8000001907,327849.502037,4689308.48359,19,T
1580866492267825216,13452.0,42.3369865417,N,-71.0896453857,W,11.5,327853.1775,4689307.09699,19,T
1580866493272921835,13453.0,42.3369827271,N,-71.08959198,W,11.1999998093,327857.154865,4689306.81407,19,T
1580866494265158763,13454.0,42.3370361328,N,-71.0895614624,W,11.0,327860.179299,4689312.4804,19,T
1580866495276823267,13455.0,42.3370704651,N,-71.0895385742,W,10.8999996185,327861.78518,4689316.32977,19,T
1580866496275546782,13456.0,42.3371047974,N,-71.0895385742,W,10.8000001907,327862.292603,4689320.20613,19,T
1580866497276331553,13457.0,42.3371429443,N,-71.089553833,W,10.6999998093,327861.019582,4689324.31143,19,T
1580866498275180477,13458.0,42.3371734619,N,-71.0895767212,W,10.5,327858.909078,4689327.88175,19,T
1580866499272329227,13459.0,42.3371963501,N,-71.0896148682,W,10.3000001907,327855.947448,4689330.3619,19,T
1580866500268662217,13500.0,42.3372039795,N,-71.0896606445,W,10.1000003815,327852.404756,4689331.56006,19,T
1580866501272477530,13501.0,42.3372001648,N,-71.0897064209,W,9.89999961853,327848.821134,4689331.09257,19,T
1580866502265762913,13502.0,42.3371887207,N,-71.0897445679,W,9.69999980927,327845.493931,4689329.87806,19,T
1580866503268693880,13503.0,42.3371658325,N,-71.0897750854,W,9.5,327842.688666,4689327.53963,19,T
1580866504274956075,13504.0,42.3371391296,N,-71.0897979736,W,9.5,327840.55629,4689324.62912,19,T
1580866505267490704,13505.0,42.3371047974,N,-71.0898132324,W,9.39999961853,327839.778789,4689320.94458,19,T
1580866506264835936,13506.0,42.3370742798,N,-71.089805603,W,9.39999961853,327839.962438,4689317.23642,19,T
1580866507265142937,13507.0,42.3370437622,N,-71.0897979736,W,9.39999961853,327840.841719,4689313.88152,19,T
1580866508268644347,13508.0,42.3370132446,N,-71.0897750854,W,9.39999961853,327842.412087,4689310.69483,19,T
1580866509275853812,13509.0,42.3369979858,N,-71.0897369385,W,9.60000038147,327845.799288,4689308.75976,19,T
1580866510276959891,13510.0,42.3369903564,N,-71.0896911621,W,9.5,327849.488393,4689307.92838,19,T
1580866511267163841,13511.0,42.3369941711,N,-71.0896453857,W,9.5,327852.788317,4689308.03247,19,T
1580866512265646162,13512.0,42.3370018005,N,-71.0896148682,W,9.5,327855.831818,4689308.88359,19,T
1580866513266688576,13513.0,42.3370132446,N,-71.0895767212,W,9.60000038147,327858.614346,4689310.29667,19,T
1580866514264575948,13514.0,42.3370361328,N,-71.0895462036,W,9.60000038147,327861.144998,4689312.64186,19,T
1580866515263816055,13515.0,42.3370666504,N,-71.0895309448,W,9.69999980927,327862.869995,4689315.74757,19,T
1580866516264399651,13516.0,42.337097168,N,-71.0895233154,W,9.5,327863.642936,4689319.24704,19,T
1580866517276128108,13517.0,42.3371315002,N,-71.0895233154,W,9.30000019073,327863.321968,4689322.95858,19,T
1580866518266612915,13518.0,42.3371582031,N,-71.0895385742,W,9.10000038147,327862.168063,4689326.32021,19,T
1580866519274634745,13519.0,42.3371887207,N,-71.0895690918,W,9.10000038147,327860.048464,4689329.5204,19,T
1580866520275151713,13520.0,42.3372116089,N,-71.0895996094,W,9.10000038147,327857.228688,4689332.18224,19,T
1580866521274521324,13521.0,42.3372306824,N,-71.0896453857,W,9.19999980927,327853.983351,4689334.299,19,T
1580866522271430685,13522.0,42.3372383118,N,-71.0896835327,W,9.30000019073,327850.440662,4689335.49715,19,T
1580866523273112534,13523.0,42.3372268677,N,-71.0897216797,W,10.5,327847.108914,4689334.09757,19,T
1580866524267032914,13524.0,42.3372001648,N,-71.0897598267,W,10.8000001907,327844.019941,4689331.39575,19,T
1580866525283377692,13525.0,42.3371658325,N,-71.0897750854,W,11.3000001907,327842.546811,4689327.35794,19,T
1580866526278388518,13526.0,42.3371162415,N,-71.0897750854,W,11.3000001907,327842.959593,4689321.79232,19,T
1580866527280672933,13527.0,42.3370628357,N,-71.0897521973,W,10.6000003815,327844.191671,4689316.02139,19,T
1580866528281348550,13528.0,42.3370323181,N,-71.0897216797,W,10.3999996185,327846.988708,4689312.43418,19,T
1580866529271671716,13529.0,42.3370132446,N,-71.0896759033,W,10.6000003815,327850.650524,4689310.49237,19,T
1580866530274813002,13530.0,42.3370132446,N,-71.089630127,W,10.5,327854.49058,4689310.21282,19,T
1580866531267464201,13531.0,42.3370246887,N,-71.0895843506,W,10.5,327858.229711,4689311.41722,19,T
1580866532269645901,13532.0,42.3370475769,N,-71.0895462036,W,10.3999996185,327861.172284,4689313.75228,19,T
1580866533267593297,13533.0,42.3370780945,N,-71.0895233154,W,10.1999998093,327863.176443,4689317.03631,19,T
1580866534266117963,13534.0,42.3371124268,N,-71.089515686,W,10.0,327863.958479,4689320.90593,19,T
1580866535269164272,13535.0,42.3371505737,N,-71.0895309448,W,9.89999961853,327863.101926,4689325.18617,19,T
1580866536274314378,13536.0,42.337184906,N,-71.089553833,W,9.69999980927,327860.86321,4689329.13001,19,T
1580866537271084642,13537.0,42.3372116089,N,-71.08959198,W,9.69999980927,327858.057077,4689332.34707,19,T
1580866538277278868,13538.0,42.3372383118,N,-71.089630127,W,9.69999980927,327854.829931,4689335.20411,19,T
1580866539267671429,13539.0,42.3372306824,N,-71.0896911621,W,9.10000038147,327850.13876,4689334.39348,19,T
1580866540269202798,13540.0,42.3372039795,N,-71.0897369385,W,9.0,327845.809479,4689331.53695,19,T
1580866541277050964,13541.0,42.3371734619,N,-71.0897750854,W,9.19999980927,327842.565004,4689328.09822,19,T
1580866542266061036,13542.0,42.3371353149,N,-71.0897979736,W,9.5,327840.679952,4689324.07053,19,T
1580866543269204523,13543.0,42.337097168,N,-71.089805603,W,9.60000038147,327840.026114,4689319.82741,19,T
1580866544268889945,13544.0,42.3370628357,N,-71.0897979736,W,9.60000038147,327840.617136,4689315.92405,19,T
1580866545270298190,13545.0,42.3370323181,N,-71.0897750854,W,9.69999980927,327842.457569,4689312.54554,19,T
1580866546275488050,13546.0,42.3370094299,N,-71.0897369385,W,10.0,327845.414654,4689309.88031,19,T
1580866547278556186,13547.0,42.3369979858,N,-71.0896987915,W,10.0,327848.815501,4689308.50046,19,T
1580866548267482383,13548.0,42.3369941711,N,-71.0896530151,W,10.0,327852.518251,4689308.22428,19,T
1580866549280824389,13549.0,42.3370056152,N,-71.0896072388,W,10.0,327856.115528,4689309.24698,19,T
1580866550269340225,13550.0,42.337020874,N,-71.0895690918,W,9.89999961853,327859.319074,4689311.02008,19,T
1580866551262254498,13551.0,42.3370399475,N,-71.0895385742,W,9.89999961853,327861.973389,4689312.80668,19,T
1580866552263760002,13552.0,42.3370552063,N,-71.0895080566,W,9.89999961853,327864.215781,4689314.6034,19,T
1580866553262633801,13553.0,42.3370780945,N,-71.0895004272,W,9.80000019073,327865.245145,4689317.35585,19,T
1580866554267534343,13554.0,42.3371238708,N,-71.0895385742,W,9.5,327862.484483,4689322.42361,19,T
1580866555274571827,13555.0,42.3371620178,N,-71.0895614624,W,9.19999980927,327860.113006,4689326.55589,19,T
1580866556277360918,13556.0,42.3371887207,N,-71.0895996094,W,9.0,327857.165019,4689329.59125,19,T
1580866557271090623,13557.0,42.3372039795,N,-71.0896453857,W,8.69999980927,327853.503211,4689331.53306,19,T
1580866558272566122,13558.0,42.3372039795,N,-71.0896987915,W,8.5,327849.521312,4689331.63091,19,T
1580866559269363116,13559.0,42.3371925354,N,-71.0897445679,W,8.19999980927,327845.644883,4689330.4299,19,T
1580866560264543780,13600.0,42.3371734619,N,-71.0897827148,W,8.10000038147,327842.015776,4689328.11172,19,T
1580866561270335768,13601.0,42.3371391296,N,-71.0898132324,W,8.19999980927,327839.732448,4689324.64936,19,T
1580866562263389235,13602.0,42.3371047974,N,-71.0898208618,W,8.19999980927,327838.808543,4689320.59806,19,T
1580866563263114257,13603.0,42.3370666504,N,-71.0898132324,W,8.5,327839.257709,4689316.51301,19,T
1580866564266377822,13604.0,42.3370323181,N,-71.0897903442,W,8.80000019073,327841.226352,4689312.76098,19,T
1580866565275678747,13605.0,42.3370094299,N,-71.0897521973,W,8.89999961853,327844.183437,4689310.09575,19,T
1580866566266127799,13606.0,42.3369979858,N,-71.0897064209,W,8.89999961853,327847.858898,4689308.70915,19,T
1580866567266415469,13607.0,42.3369941711,N,-71.0896606445,W,8.80000019073,327851.827166,4689308.05608,19,T
1580866568265967778,13608.0,42.3369941711,N,-71.0896072388,W,8.80000019073,327855.946386,4689307.95486,19,T
1580866569266044565,13609.0,42.337020874,N,-71.0895690918,W,9.0,327859.593688,4689311.01333,19,T
1580866570262211446,13610.0,42.3370666504,N,-71.0895385742,W,9.10000038147,327861.908844,4689315.77119,19,T
1580866571272351289,13611.0,42.3371124268,N,-71.0895385742,W,8.89999961853,327862.448101,4689320.94304,19,T
1580866572262337536,13612.0,42.3371582031,N,-71.0895385742,W,8.80000019073,327862.163515,4689326.13514,19,T
1580866573262342911,13613.0,42.3372039795,N,-71.089553833,W,8.69999980927,327861.050542,4689331.16242,19,T
1580866574266951879,13614.0,42.3372459412,N,-71.0895767212,W,9.0,327859.65386,4689335.8263,19,T
1580866575267654120,13615.0,42.3372879028,N,-71.08959198,W,9.0,327858.399036,4689340.67187,19,T
1580866576273488782,13616.0,42.3373336792,N,-71.0896072388,W,9.0,327857.011455,4689345.7059,19,T
1580866577276312201,13617.0,42.3373756409,N,-71.0896224976,W,9.0,327855.752086,4689350.3664,19,T
1580866578265052621,13618.0,42.3374099731,N,-71.0896377563,W,9.19999980927,327854.886447,4689354.27651,19,T
1580866579267398623,13619.0,42.337436676,N,-71.0896453857,W,9.10000038147,327854.130828,4689357.07281,19,T
1580866580268639463,13620.0,42.3374519348,N,-71.0896530151,W,9.19999980927,327853.627082,4689358.93701,19,T
1580866581267313894,13621.0,42.3374633789,N,-71.0896606445,W,9.5,327853.105145,4689360.06093,19,T
1580866582271211214,13622.0,42.3374710083,N,-71.0896606445,W,9.39999961853,327852.85782,4689361.17811,19,T
1580866583268276553,13623.0,42.3374786377,N,-71.0896682739,W,9.30000019073,327852.605948,4689362.11021,19,T
1580866584259067233,13624.0,42.3374862671,N,-71.0896682739,W,9.10000038147,327852.486833,4689362.85387,19,T
1580866585263845091,13625.0,42.3374900818,N,-71.0896682739,W,9.39999961853,327852.363171,4689363.41245,19,T
1580866586264684933,13626.0,42.3374977112,N,-71.0896682739,W,9.60000038147,327852.244057,4689364.15611,19,T
1580866587266001401,13627.0,42.33751297,N,-71.0896759033,W,9.80000019073,327851.868523,4689365.6468,19,T
1580866588265042697,13628.0,42.3375358582,N,-71.0896835327,W,10.0,327851.245664,4689368.25466,19,T
1580866589260577422,13629.0,42.3375701904,N,-71.0896987915,W,10.3000001907,327850.238177,4689371.98306,19,T
1580866590265392729,13630.0,42.3376083374,N,-71.0897140503,W,10.1999998093,327849.116125,4689376.6402,19,T
1580866591264859370,13631.0,42.3376617432,N,-71.0897293091,W,10.1999998093,327847.742204,4689382.22944,19,T
1580866592263701580,13632.0,42.3377151489,N,-71.0897521973,W,10.0,327846.10277,4689388.19556,19,T
1580866593269135417,13633.0,42.3377723694,N,-71.0897750854,W,9.80000019073,327844.339679,4689394.72028,19,T
1580866594264127919,13634.0,42.3378295898,N,-71.0897979736,W,9.60000038147,327842.709348,4689401.05655,19,T
1580866595267682492,13635.0,42.3378829956,N,-71.0898208618,W,9.5,327841.069924,4689407.02268,19,T
1580866596267694600,13636.0,42.3379325867,N,-71.0898361206,W,9.69999980927,327839.970628,4689412.60517,19,T
1580866597269634528,13637.0,42.3379859924,N,-71.0898513794,W,10.3000001907,327839.017736,4689418.55442,19,T
1580866598267690470,13638.0,42.3380355835,N,-71.0898590088,W,11.0,327838.472213,4689424.30849,19,T
1580866599282414534,13639.0,42.338092804,N,-71.0898590088,W,11.6000003815,327838.214946,4689430.61101,19,T
1580866600267977793,13640.0,42.3381538391,N,-71.0898666382,W,12.1999998093,327837.696716,4689437.4755,19,T
1580866601262373505,13641.0,42.3382148743,N,-71.089881897,W,13.1000003815,327837.036634,4689444.15829,19,T
1580866602268078035,13642.0,42.3382797241,N,-71.0898971558,W,13.6999998093,327835.978286,4689451.40642,19,T
1580866603257944102,13643.0,42.3383407593,N,-71.0899124146,W,14.1999998093,327834.498931,4689458.29453,19,T
1580866604257157600,13644.0,42.3384017944,N,-71.0899505615,W,14.1000003815,327831.912047,4689464.8395,19,T
1580866605263148510,13645.0,42.3384552002,N,-71.0899810791,W,14.0,327829.316071,4689471.01432,19,T
1580866606254533639,13646.0,42.3385124207,N,-71.0900115967,W,13.8999996185,327826.861953,4689477.37085,19,T
1580866607258644037,13647.0,42.3385734558,N,-71.0900497437,W,13.8999996185,327824.146879,4689484.28933,19,T
1580866608256569264,13648.0,42.3386497498,N,-71.0900802612,W,13.8999996185,327821.610055,4689492.87008,19,T
1580866609257136846,13649.0,42.3387069702,N,-71.0901184082,W,14.3999996185,327819.023199,4689499.41506,19,T
1580866610257050620,13650.0,42.3387680054,N,-71.0901412964,W,14.8000001907,327816.852807,4689506.13497,19,T
1580866611254770280,13651.0,42.3388328552,N,-71.090171814,W,14.6999998093,327814.828822,4689513.22166,19,T
1580866612255227760,13652.0,42.3388900757,N,-71.0901947021,W,14.5,327813.198554,4689519.55794,19,T
1580866613251893060,13653.0,42.3389358521,N,-71.0902099609,W,14.5,327811.957452,4689524.95874,19,T
1580866614253999042,13654.0,42.3389854431,N,-71.0902252197,W,14.3999996185,327810.716352,4689530.35954,19,T
1580866615256169570,13655.0,42.3390312195,N,-71.0902404785,W,14.3000001907,327809.466156,4689535.3902,19,T
1580866616255235146,13656.0,42.3390769958,N,-71.0902633667,W,14.1999998093,327807.808602,4689540.61606,19,T
1580866617251078566,13657.0,42.3391113281,N,-71.0902786255,W,14.1000003815,327806.526564,4689544.35123,19,T
1580866618256693169,13658.0,42.3391342163,N,-71.0902938843,W,14.1000003815,327805.633688,4689547.15091,19,T
1580866619255457830,13659.0,42.3391532898,N,-71.0903015137,W,14.5,327804.864466,4689549.39201,19,T
1580866620255172091,13700.0,42.3391838074,N,-71.0903091431,W,14.6999998093,327804.117993,4689552.55847,19,T
1580866621265396688,13701.0,42.3392066956,N,-71.0903244019,W,14.8000001907,327803.357871,4689555.16971,19,T
1580866622255742671,13702.0,42.3392333984,N,-71.0903320312,W,14.8000001907,327802.327695,4689557.97277,19,T
1580866623259527913,13703.0,42.3392562866,N,-71.0903549194,W,14.3999996185,327801.022916,4689560.78259,19,T
1580866624257233680,13704.0,42.3392868042,N,-71.0903701782,W,14.1999998093,327799.736336,4689564.33268,19,T
1580866625258617171,13705.0,42.3393173218,N,-71.090385437,W,14.1999998093,327798.719812,4689567.69096,19,T
1580866626258642000,13706.0,42.33934021,N,-71.0903930664,W,14.1999998093,327797.822393,4689570.30558,19,T
1580866627260977289,13707.0,42.3393554688,N,-71.0904006958,W,14.1000003815,327797.176829,4689571.98809,19,T
1580866628258415397,13708.0,42.3393630981,N,-71.0904083252,W,14.1000003815,327796.64582,4689572.74188,19,T
1580866629263246097,13709.0,42.3393669128,N,-71.0904083252,W,14.1000003815,327796.380315,4689573.11877,19,T
1580866630261112061,13710.0,42.3393707275,N,-71.0904159546,W,14.1000003815,327796.11936,4689573.68073,19,T
1580866631268742372,13711.0,42.3393783569,N,-71.090423584,W,14.0,327795.583801,4689574.24944,19,T
1580866632263092763,13712.0,42.3393859863,N,-71.0904312134,W,14.0,327794.645435,4689575.19843,19,T
1580866633260908497,13713.0,42.3393936157,N,-71.0904541016,W,14.1999998093,327793.020559,4689576.16429,19,T
1580866634261642337,13714.0,42.3394012451,N,-71.0904769897,W,14.3999996185,327790.846475,4689577.14365,19,T
1580866635263293010,13715.0,42.3394165039,N,-71.0905075073,W,14.6000003815,327788.420537,4689579.05512,19,T
1580866636256899055,13716.0,42.3394432068,N,-71.0905227661,W,14.6999998093,327787.25307,4689581.86156,19,T
1580866637257089185,13717.0,42.3394775391,N,-71.0905303955,W,14.8000001907,327786.794863,4689585.57647,19,T
1580866638254768430,13718.0,42.339515686,N,-71.0905075073,W,14.3999996185,327789.100894,4689589.96416,19,T
1580866639256432503,13719.0,42.3395996094,N,-71.0904541016,W,14.8999996185,327793.584746,4689599.11305,19,T
1580866640251266655,13720.0,42.3396682739,N,-71.0904083252,W,14.8999996185,327797.615735,4689606.60644,19,T
1580866641252605344,13721.0,42.3397331238,N,-71.09034729,W,13.6999998093,327802.740576,4689613.88775,19,T
1580866642256014339,13722.0,42.3397865295,N,-71.0902709961,W,12.8999996185,327809.197474,4689619.46968,19,T
