%time,field.timestamp,field.latitude,field.lat_dir,field.longitude,field.long_dir,field.altitude,field.utmeasting,field.utmnorthing,field.zone,field.letter,field.fix_quality
1582826216652798662,175656.59375,42.3372192383,N,-71.0868682861,W,-2.68300008774,328082.427536,4689327.36174,19,T,5.0
1582826220457506588,175700.40625,42.3371887207,N,-71.0868530273,W,-6.38500022888,328083.760578,4689323.8776,19,T,5.0
1582826220654650203,175700.59375,42.337184906,N,-71.0868453979,W,-6.36000013351,328083.980174,4689323.50444,19,T,5.0
1582826220863900216,175700.796875,42.3371810913,N,-71.0868453979,W,-6.31199979782,328084.191596,4689323.15648,19,T,5.0
1582826221061413677,175701.0,42.3371772766,N,-71.0868453979,W,-6.09299993515,328084.427474,4689322.74699,19,T,5.0
1582826225070281593,175705.0,42.3371315002,N,-71.0867996216,W,-3.90499997139,328087.995028,4689317.47712,19,T,5.0
1582826227064432085,175707.0,42.3371429443,N,-71.086769104,W,-2.60899996758,328090.437547,4689318.70901,19,T,5.0
1582826227876122760,175707.796875,42.337146759,N,-71.0867538452,W,-2.84999990463,328091.376101,4689319.39949,19,T,5.0
1582826229068239923,175709.0,42.3371620178,N,-71.0867385864,W,-2.68300008774,328092.694933,4689320.8395,19,T,5.0
1582826229462674962,175709.40625,42.3371658325,N,-71.0867385864,W,-2.90100002289,328093.224058,4689321.14337,19,T,5.0
1582826230473961693,175710.40625,42.3371734619,N,-71.0867233276,W,-2.72199988365,328094.567565,4689322.16686,19,T,5.0
1582826231066741215,175711.0,42.3371810913,N,-71.0867080688,W,-3.04999995232,328095.310311,4689323.04658,19,T,1.0
1582826231662558523,175711.59375,42.337184906,N,-71.0867004395,W,-2.70000004768,328096.133529,4689323.53285,19,T,5.0
1582826232458297216,175712.40625,42.3371810913,N,-71.0866851807,W,-4.19500017166,328097.56758,4689322.71453,19,T,1.0
1582826233260929860,175713.203125,42.3371925354,N,-71.0866394043,W,1.96399998665,328101.504258,4689323.87013,19,T,5.0
1582826233661987358,175713.59375,42.337184906,N,-71.0866241455,W,0.00600000005215,328102.160717,4689323.28273,19,T,5.0
1582826234658218387,175714.59375,42.3372077942,N,-71.0866165161,W,2.40499997139,328103.032037,4689325.77409,19,T,5.0
1582826235064350673,175715.0,42.3372154236,N,-71.0866165161,W,2.72799992561,328103.433579,4689326.35441,19,T,1.0
1582826235656004676,175715.59375,42.3372154236,N,-71.0866012573,W,2.39899992943,328104.224654,4689326.63944,19,T,5.0
1582826236256590276,175716.203125,42.337223053,N,-71.0865936279,W,2.41400003433,328104.935392,4689327.21143,19,T,5.0
1582826236654261486,175716.59375,42.3372268677,N,-71.0865936279,W,2.70600008965,328105.370796,4689327.72722,19,T,5.0
1582826237074138847,175717.0,42.3372344971,N,-71.0865859985,W,3.27300000191,328105.67937,4689328.50537,19,T,5.0
1582826237848251787,175717.796875,42.3372421265,N,-71.0865783691,W,3.44099998474,328106.416804,4689329.65022,19,T,5.0
1582826238455727124,175718.40625,42.3372459412,N,-71.0865707397,W,3.17300009727,328107.222463,4689329.71212,19,T,1.0
1582826239069792720,175719.0,42.3374099731,N,-71.0866394043,W,10.3020000458,328102.10117,4689348.11711,19,T,1.0
1582826239447542738,175719.40625,42.3375396729,N,-71.0866928101,W,15.7899999619,328097.969157,4689362.79548,19,T,1.0
1582826240067319702,175720.0,42.3378219604,N,-71.0868148804,W,28.0690002441,328088.455073,4689394.31787,19,T,1.0
1582826241067465607,175721.0,42.3384971619,N,-71.0871047974,W,61.1430015564,328066.699581,4689469.69669,19,T,1.0
1582826241451704955,175721.40625,42.3388404846,N,-71.0872497559,W,77.6890029907,328055.379028,4689508.0856,19,T,1.0
1582826242061880943,175722.0,42.3373527527,N,-71.0865478516,W,8.81299972534,328109.217563,4689341.57944,19,T,1.0
1582826242662870935,175722.59375,42.3374862671,N,-71.0866470337,W,6.57299995422,328101.520165,4689356.6727,19,T,5.0
1582826243264154463,175723.203125,42.3374557495,N,-71.0866317749,W,4.4310002327,328102.347479,4689353.22209,19,T,5.0
1582826243740783465,175723.59375,42.3374252319,N,-71.0866241455,W,2.55999994278,328103.056895,4689350.07862,19,T,5.0
1582826244342330140,175724.203125,42.3375053406,N,-71.0866851807,W,0.754999995232,328098.096173,4689358.98557,19,T,5.0
1582826244943075591,175724.796875,42.3375740051,N,-71.0867538452,W,-2.94600009918,328093.029915,4689366.46903,19,T,5.0
1582826245557483756,175725.40625,42.3375930786,N,-71.0867614746,W,-1.34000003338,328092.14544,4689368.777,19,T,5.0
1582826246465169924,175726.40625,42.3376083374,N,-71.0867614746,W,4.39900016785,328092.190498,4689370.34994,19,T,5.0
1582826247360034267,175727.203125,42.3376426697,N,-71.0867538452,W,-1.68400001526,328093.148058,4689374.43526,19,T,5.0
1582826247669575020,175727.59375,42.3376502991,N,-71.0867538452,W,-3.36800003052,328093.136905,4689375.20126,19,T,5.0
1582826248335032302,175728.203125,42.3376502991,N,-71.0867767334,W,2.7990000248,328090.948785,4689375.2544,19,T,5.0
1582826249871115772,175729.796875,42.3376541138,N,-71.0867996216,W,1.31200003624,328089.540085,4689375.50971,19,T,5.0
1582826250870264139,175730.796875,42.3376426697,N,-71.0867996216,W,1.39600002766,328089.253912,4689374.4799,19,T,5.0
1582826251473898502,175731.40625,42.3376235962,N,-71.0867919922,W,1.42999994755,328089.902062,4689372.27773,19,T,5.0
1582826251871854192,175731.796875,42.3376121521,N,-71.0867919922,W,2.23699998856,328089.87552,4689370.95544,19,T,1.0
1582826253273296798,175733.203125,42.3375701904,N,-71.0867843628,W,-0.68900001049,328090.439204,4689366.49261,19,T,5.0
1582826253875731060,175733.796875,42.3375587463,N,-71.0867767334,W,-2.3789999485,328090.599331,4689364.94463,19,T,5.0
1582826254480636000,175734.40625,42.3375473022,N,-71.0867843628,W,-2.85700011253,328090.297511,4689363.56836,19,T,5.0
1582826254880850706,175734.796875,42.3375396729,N,-71.0867843628,W,-3.94899988174,328090.142665,4689362.71143,19,T,5.0
1582826255482343289,175735.40625,42.3375282288,N,-71.0867919922,W,-4.85400009155,328089.623165,4689361.52883,19,T,5.0
1582826256277505799,175736.203125,42.3375205994,N,-71.0867996216,W,-5.26200008392,328088.943096,4689360.82368,19,T,5.0
1582826256679483892,175736.59375,42.33751297,N,-71.0867996216,W,-7.15199995041,328088.805533,4689359.79207,19,T,5.0
1582826257083686824,175737.0,42.3375053406,N,-71.086807251,W,-7.46000003815,328088.448402,4689358.99474,19,T,5.0
1582826257887510444,175737.796875,42.3374900818,N,-71.0868148804,W,-8.83199977875,328087.834652,4689357.44261,19,T,5.0
1582826258490290408,175738.40625,42.3374786377,N,-71.0868148804,W,-9.66699981689,328087.519395,4689356.12907,19,T,5.0
1582826260685180993,175740.59375,42.3374404907,N,-71.0868377686,W,-12.2600002289,328085.686937,4689352.13892,19,T,5.0
1582826261291412664,175741.203125,42.3374328613,N,-71.0868453979,W,-12.3179998398,328085.145005,4689351.17316,19,T,5.0
1582826261895257044,175741.796875,42.3374252319,N,-71.0868530273,W,-12.6260004044,328084.511345,4689350.14781,19,T,5.0
1582826262500753982,175742.40625,42.3374099731,N,-71.0868530273,W,-11.3959999084,328084.091346,4689348.59703,19,T,5.0
1582826263106697455,175743.0,42.3373985291,N,-71.0868606567,W,-10.6599998474,328083.440495,4689347.49821,19,T,5.0
1582826263301546184,175743.203125,42.3373947144,N,-71.0868606567,W,-10.3140001297,328083.298828,4689347.08317,19,T,5.0
1582826264099428811,175744.0,42.3373832703,N,-71.0868682861,W,-8.97999954224,328082.58725,4689345.50844,19,T,5.0
1582826264302301467,175744.203125,42.3373756409,N,-71.0868759155,W,-8.49300003052,328082.441614,4689345.04924,19,T,5.0
1582826265315703795,175745.203125,42.3373603821,N,-71.0868835449,W,-7.61999988556,328081.579749,4689343.2345,19,T,5.0
1582826266511871577,175746.40625,42.3373413086,N,-71.0868911743,W,-6.49800014496,328080.635981,4689341.07751,19,T,5.0
1582826267114278482,175747.0,42.3373336792,N,-71.0868988037,W,-7.07999992371,328080.111223,4689340.45892,19,T,5.0
