%time,field.timestamp,field.latitude,field.lat_dir,field.longitude,field.long_dir,field.altitude,field.utmeasting,field.utmnorthing,field.zone,field.letter
1580255946277628079,235906.0,42.3373222351,N,-71.0865097046,W,16.5,328112.369901,4689338.13919,19,T
1580255947277027088,235907.0,42.3373222351,N,-71.0865097046,W,16.5,328112.369901,4689338.13919,19,T
1580255948277975077,235908.0,42.3373222351,N,-71.0865097046,W,16.5,328112.369901,4689338.13919,19,T
1580255949277296352,235909.0,42.3373222351,N,-71.0865097046,W,16.5,328112.369901,4689338.13919,19,T
1580255950279266166,235910.0,42.3373222351,N,-71.0865097046,W,16.5,328112.369901,4689338.13919,19,T
1580255951276584104,235911.0,42.3373222351,N,-71.0865097046,W,16.5,328112.369901,4689338.13919,19,T
1580255952278119303,235912.0,42.3373222351,N,-71.0865097046,W,16.5,328112.369901,4689338.13919,19,T
1580255953277483735,235913.0,42.3373222351,N,-71.0865097046,W,16.5,328112.369901,4689338.13919,19,T
1580255954277570787,235914.0,42.3373222351,N,-71.0865097046,W,16.3999996185,328112.507207,4689338.13582,19,T
1580255955280628235,235915.0,42.3373222351,N,-71.0865020752,W,16.3999996185,328112.919127,4689338.12571,19,T
1580255956278131634,235916.0,42.3373260498,N,-71.0864944458,W,16.3999996185,328113.614742,4689338.47901,19,T
1580255957277350365,235917.0,42.3373298645,N,-71.0864868164,W,16.3999996185,328114.310357,4689338.8323,19,T
1580255958278393534,235918.0,42.3373298645,N,-71.0864715576,W,16.3999996185,328115.143279,4689339.18223,19,T
1580255959278858129,235919.0,42.3373374939,N,-71.0864639282,W,16.5,328115.980741,4689339.71723,19,T
1580255960277042065,235920.0,42.3373413086,N,-71.0864562988,W,16.6000003815,328116.95551,4689340.24885,19,T
1580255961276982933,235921.0,42.3373451233,N,-71.08644104,W,16.7000007629,328117.930279,4689340.78048,19,T
1580255962278090093,235922.0,42.3373527527,N,-71.0864334106,W,16.7000007629,328118.905048,4689341.31211,19,T
1580255963278964739,235923.0,42.3373565674,N,-71.0864181519,W,16.7999992371,328119.879816,4689341.84374,19,T
1580255964278095639,235924.0,42.3373603821,N,-71.0864028931,W,16.5,328120.854584,4689342.37537,19,T
1580255965278046522,235925.0,42.3373680115,N,-71.0863952637,W,16.5,328121.833893,4689343.09207,19,T
1580255966277281712,235926.0,42.3373756409,N,-71.0863800049,W,16.2999992371,328122.813202,4689343.80877,19,T
1580255967277588234,235927.0,42.3373832703,N,-71.0863723755,W,16.2000007629,328123.792511,4689344.52547,19,T
1580255968277180393,235928.0,42.3373908997,N,-71.0863647461,W,16.1000003815,328124.639053,4689345.43061,19,T
1580255969275874927,235929.0,42.3373985291,N,-71.0863494873,W,16.1000003815,328125.618361,4689346.14731,19,T
1580255970276634515,235930.0,42.3374023438,N,-71.0863418579,W,16.0,328126.460363,4689346.86738,19,T
1580255971277576562,235931.0,42.3374099731,N,-71.0863342285,W,15.8999996185,328127.169599,4689347.77589,19,T
1580255972276556354,235932.0,42.3374176025,N,-71.0863189697,W,15.8000001907,328128.0116,4689348.49596,19,T
1580255973313128296,235933.0,42.3374252319,N,-71.0863113403,W,15.8999996185,328128.995448,4689349.39773,19,T
1580255974314549964,235934.0,42.3374328613,N,-71.0862960815,W,15.8000001907,328129.974755,4689350.11443,19,T
1580255975315540937,235935.0,42.3374404907,N,-71.0862884521,W,15.8999996185,328130.954062,4689350.83113,19,T
1580255976314634314,235936.0,42.3374481201,N,-71.0862731934,W,15.8999996185,328131.796063,4689351.5512,19,T
1580255977275375625,235937.0,42.3374519348,N,-71.086265564,W,15.8999996185,328132.775369,4689352.2679,19,T
1580255978276015592,235938.0,42.3374595642,N,-71.0862579346,W,16.1000003815,328133.617369,4689352.98797,19,T
1580255979276268983,235939.0,42.3374633789,N,-71.0862426758,W,16.2999992371,328134.587594,4689353.33453,19,T
1580255980315992464,235940.0,42.3374671936,N,-71.0862350464,W,16.3999996185,328135.56236,4689353.86616,19,T
1580255981274632489,235941.0,42.337474823,N,-71.0862197876,W,16.6000003815,328136.537125,4689354.3978,19,T
1580255982275428742,235942.0,42.3374786377,N,-71.0862045288,W,16.7000007629,328137.516431,4689355.1145,19,T
1580255983276727130,235943.0,42.3374862671,N,-71.0861968994,W,16.8999996185,328138.35389,4689355.6495,19,T
1580255984276002752,235944.0,42.3374900818,N,-71.0861816406,W,17.5,328139.607807,4689356.35946,19,T
1580255985289187263,235945.0,42.3374977112,N,-71.0861663818,W,17.8999996185,328140.724419,4689357.0728,19,T
1580255986280600894,235946.0,42.3375053406,N,-71.0861587524,W,18.0,328141.566417,4689357.79287,19,T
1580255987278329173,235947.0,42.3375091553,N,-71.0861434937,W,18.0,328142.94856,4689358.12932,19,T
1580255988278150273,235948.0,42.33751297,N,-71.0861206055,W,18.2999992371,328144.609855,4689358.64411,19,T
1580255989277403313,235949.0,42.3375167847,N,-71.0861053467,W,18.6000003815,328145.996537,4689359.16564,19,T
1580255990276944160,235950.0,42.3375244141,N,-71.0860900879,W,19.0,328147.113148,4689359.87897,19,T
1580255991279389365,235951.0,42.3375320435,N,-71.0860824585,W,19.2000007629,328148.096992,4689360.78075,19,T
1580255992279417818,235952.0,42.3375396729,N,-71.0860671997,W,19.5,328149.076295,4689361.49745,19,T
1580255993278281710,235953.0,42.3375473022,N,-71.0860595703,W,19.7000007629,328150.060139,4689362.39923,19,T
1580255994283875620,235954.0,42.3375549316,N,-71.0860443115,W,20.0,328151.181288,4689363.29763,19,T
1580255995279476549,235955.0,42.3375663757,N,-71.0860366821,W,20.2999992371,328152.165131,4689364.19941,19,T
1580255996278309990,235956.0,42.3375740051,N,-71.0860214233,W,20.7000007629,328153.148974,4689365.10118,19,T
1580255997276739767,235957.0,42.3375778198,N,-71.0860137939,W,20.8999996185,328153.98643,4689365.63618,19,T
1580255998277836664,235958.0,42.3375854492,N,-71.0859985352,W,21.2000007629,328154.970272,4689366.53796,19,T
1580255999278143553,235959.0,42.3375930786,N,-71.0859909058,W,21.1000003815,328155.949574,4689367.25466,19,T
1580256000279112056,0.0,42.337600708,N,-71.085975647,W,20.7999992371,328156.79611,4689368.15981,19,T
1580256001277139203,1.0,42.3376121521,N,-71.0859680176,W,20.7000007629,328157.647186,4689369.25002,19,T
1580256002277906477,2.0,42.3376197815,N,-71.0859603882,W,20.6000003815,328158.631027,4689370.1518,19,T
1580256003278018999,3.0,42.3376274109,N,-71.0859451294,W,20.5,328159.614868,4689371.05357,19,T
1580256004277449596,4.0,42.337638855,N,-71.0859375,W,20.5,328160.465943,4689372.14379,19,T
1580256005276858507,5.0,42.3376464844,N,-71.0859222412,W,20.5,328161.449784,4689373.04556,19,T
1580256006278208491,6.0,42.3376541138,N,-71.0859146118,W,20.3999996185,328162.433624,4689373.94734,19,T
1580256007278735186,7.0,42.3376617432,N,-71.085899353,W,20.3999996185,328163.417464,4689374.84911,19,T
1580256008278244348,8.0,42.3376731873,N,-71.0858917236,W,20.3999996185,328164.401304,4689375.75089,19,T
1580256009277276727,9.0,42.3376808167,N,-71.0858764648,W,20.3999996185,328165.110532,4689376.6594,19,T
1580256010280226375,10.0,42.337688446,N,-71.0858688354,W,20.5,328165.961605,4689377.74962,19,T
1580256011280684488,11.0,42.3376998901,N,-71.0858612061,W,20.6000003815,328166.808139,4689378.65476,19,T
1580256012281192357,12.0,42.3377075195,N,-71.0858535767,W,20.7999992371,328167.654672,4689379.55991,19,T
1580256013278941852,13.0,42.3377151489,N,-71.0858383179,W,21.1000003815,328168.501205,4689380.46505,19,T
1580256014279016343,14.0,42.3377227783,N,-71.0858306885,W,21.3999996185,328169.347737,4689381.3702,19,T
1580256015280112840,15.0,42.3377304077,N,-71.0858154297,W,21.3999996185,328170.327036,4689382.0869,19,T
1580256016279527020,16.0,42.3377380371,N,-71.0858078003,W,21.5,328171.173568,4689382.99205,19,T
1580256017278659222,17.0,42.3377456665,N,-71.0858001709,W,21.6000003815,328172.152866,4689383.70875,19,T
1580256018280073034,18.0,42.3377532959,N,-71.0857849121,W,21.6000003815,328172.999398,4689384.6139,19,T
1580256019280019151,19.0,42.3377609253,N,-71.0857772827,W,21.7999992371,328173.978696,4689385.33061,19,T
1580256020279646635,20.0,42.3377685547,N,-71.0857620239,W,22.1000003815,328174.962533,4689386.23238,19,T
1580256021279414967,21.0,42.3377761841,N,-71.0857543945,W,22.2000007629,328175.809064,4689387.13753,19,T
1580256022276168013,22.0,42.3377876282,N,-71.0857391357,W,22.3999996185,328176.79744,4689388.22438,19,T
1580256023276984234,23.0,42.3377952576,N,-71.0857315063,W,22.5,328177.781276,4689389.12616,19,T
1580256024279787016,24.0,42.337802887,N,-71.0857162476,W,22.7999992371,328178.765112,4689390.02793,19,T
1580256025279801522,25.0,42.3378143311,N,-71.0857086182,W,23.3999996185,328179.478877,4689391.12152,19,T
1580256026279782399,26.0,42.3378181458,N,-71.0856933594,W,23.5,328180.595478,4689391.83486,19,T
1580256027281151536,27.0,42.3378219604,N,-71.0856781006,W,23.2000007629,328181.840306,4689392.17469,19,T
1580256028277928779,28.0,42.3378219604,N,-71.0856628418,W,24.5,328183.208822,4689391.95594,19,T
1580256029278889296,29.0,42.3378219604,N,-71.0856552124,W,24.8999996185,328184.1745,4689392.11744,19,T
1580256030295923425,30.0,42.3378257751,N,-71.0856399536,W,24.7999992371,328185.144717,4689392.464,19,T
1580256031279581927,31.0,42.3378334045,N,-71.0856323242,W,24.5,328186.124012,4689393.18071,19,T
1580256032279358040,32.0,42.3378372192,N,-71.0856170654,W,24.2999992371,328186.961462,4689393.71572,19,T
1580256033279550134,33.0,42.3378410339,N,-71.0856170654,W,23.7999992371,328187.382457,4689394.07576,19,T
1580256034279324064,34.0,42.3378448486,N,-71.085609436,W,23.1000003815,328187.945297,4689394.6175,19,T
1580256035280626020,35.0,42.337852478,N,-71.0856018066,W,23.2000007629,328188.787286,4689395.33757,19,T
1580256036280396026,36.0,42.3378562927,N,-71.0855865479,W,23.0,328189.482891,4689395.69088,19,T
1580256037279177184,37.0,42.3378639221,N,-71.0855789185,W,22.2999992371,328190.32488,4689396.41095,19,T
1580256038282304457,38.0,42.3378715515,N,-71.0855712891,W,22.1000003815,328191.029564,4689397.1344,19,T
1580256039280077927,39.0,42.3378753662,N,-71.0855636597,W,22.0,328191.867014,4689397.6694,19,T
1580256040279568950,40.0,42.3378829956,N,-71.0855484009,W,21.7999992371,328192.846307,4689398.38611,19,T
1580256041280012145,41.0,42.3378868103,N,-71.0855407715,W,21.7999992371,328193.688296,4689399.10619,19,T
1580256042280654799,42.0,42.3378944397,N,-71.0855255127,W,21.6000003815,328194.667589,4689399.8229,19,T
1580256043281426622,43.0,42.3379020691,N,-71.0855178833,W,21.6000003815,328195.514116,4689400.72805,19,T
1580256044279145672,44.0,42.3379096985,N,-71.0855102539,W,21.5,328196.356104,4689401.44813,19,T
1580256045279273447,45.0,42.3379173279,N,-71.0854949951,W,21.2999992371,328197.335397,4689402.16484,19,T
1580256046280100609,46.0,42.3379211426,N,-71.0854873657,W,21.1000003815,328198.172846,4689402.69984,19,T
1580256047279664603,47.0,42.3379249573,N,-71.0854797363,W,21.1000003815,328199.005755,4689403.04978,19,T
1580256048301813131,48.0,42.3379325867,N,-71.0854644775,W,21.1000003815,328199.847742,4689403.76986,19,T
1580256049279543961,49.0,42.3379364014,N,-71.0854568481,W,20.7999992371,328200.547885,4689404.30823,19,T
1580256050280663282,50.0,42.3379402161,N,-71.0854492188,W,20.7000007629,328201.385333,4689404.84324,19,T
1580256051280228319,51.0,42.3379478455,N,-71.0854415894,W,20.6000003815,328202.085476,4689405.38161,19,T
1580256052280458940,52.0,42.3379516602,N,-71.0854263306,W,20.3999996185,328202.927462,4689406.10169,19,T
1580256053278579319,53.0,42.3379592896,N,-71.0854187012,W,20.2000007629,328203.906754,4689406.8184,19,T
1580256054279989139,54.0,42.3379669189,N,-71.0854110718,W,20.2000007629,328204.753279,4689407.72355,19,T
1580256055281211840,55.0,42.3379745483,N,-71.085395813,W,20.2999992371,328205.590726,4689408.25856,19,T
1580256056280194244,56.0,42.337978363,N,-71.0853881836,W,20.2999992371,328206.423635,4689408.6085,19,T
1580256057278928670,57.0,42.337978363,N,-71.0853805542,W,20.2999992371,328207.119238,4689408.9618,19,T
1580256058279549250,58.0,42.3379859924,N,-71.0853729248,W,20.3999996185,328207.956685,4689409.49681,19,T
1580256059279529111,59.0,42.3379898071,N,-71.0853652954,W,20.7000007629,328208.656827,4689410.03519,19,T
1580256060280872882,100.0,42.3379936218,N,-71.0853500366,W,21.1000003815,328209.356968,4689410.57356,19,T
1580256061279471432,101.0,42.3380012512,N,-71.0853424072,W,21.6000003815,328210.061648,4689411.29701,19,T
1580256062278982372,102.0,42.3380088806,N,-71.0853347778,W,21.8999996185,328210.908172,4689412.20216,19,T
1580256063280101217,103.0,42.33801651,N,-71.085319519,W,22.3999996185,328211.887462,4689412.91887,19,T
1580256064275665132,104.0,42.3380241394,N,-71.0853118896,W,23.1000003815,328212.729446,4689413.63895,19,T
1580256065278458464,105.0,42.3380317688,N,-71.0853042603,W,23.5,328213.571431,4689414.35903,19,T
1580256066279662516,106.0,42.3380355835,N,-71.0852966309,W,24.2999992371,328214.134267,4689414.90077,19,T
1580256067278732238,107.0,42.3380508423,N,-71.0852813721,W,24.6000003815,328215.690007,4689416.71444,19,T
1580256068279077160,108.0,42.3380622864,N,-71.0852584839,W,25.2000007629,328217.090288,4689417.79119,19,T
1580256069279725285,109.0,42.3380699158,N,-71.0852432251,W,25.7000007629,328218.344186,4689418.50117,19,T
1580256070279495122,110.0,42.3380813599,N,-71.0852279663,W,25.8999996185,328219.611699,4689419.76636,19,T
1580256071279624864,111.0,42.3380889893,N,-71.0852203369,W,26.0,328220.732831,4689420.66478,19,T
1580256072281023924,112.0,42.3380966187,N,-71.0852050781,W,26.1000003815,328221.716657,4689421.56656,19,T
1580256073280166085,113.0,42.338104248,N,-71.0851974487,W,26.1000003815,328222.563178,4689422.47171,19,T
1580256074280437048,114.0,42.3381118774,N,-71.0851821899,W,26.1000003815,328223.537927,4689423.00335,19,T
1580256075279155917,115.0,42.3381195068,N,-71.0851745605,W,26.1000003815,328224.521752,4689423.90514,19,T
1580256076278722163,116.0,42.3381271362,N,-71.0851593018,W,25.8999996185,328225.505577,4689424.80692,19,T
1580256077278000925,117.0,42.3381347656,N,-71.0851516724,W,25.6000003815,328226.489402,4689425.70871,19,T
1580256078279524337,118.0,42.3381462097,N,-71.0851364136,W,25.1000003815,328227.477765,4689426.79556,19,T
1580256079279067360,119.0,42.3381538391,N,-71.0851287842,W,24.7000007629,328228.466127,4689427.88242,19,T
1580256080279706135,120.0,42.3381652832,N,-71.0851135254,W,24.5,328229.317185,4689428.97264,19,T
1580256081278236843,121.0,42.3381767273,N,-71.085105896,W,24.2999992371,328230.168242,4689430.06286,19,T
1580256082278907173,122.0,42.3381843567,N,-71.0850982666,W,24.2000007629,328231.014761,4689430.96801,19,T
1580256083278888511,123.0,42.3381919861,N,-71.0850830078,W,24.2000007629,328231.86128,4689431.87317,19,T
1580256084279207605,124.0,42.3381958008,N,-71.0850753784,W,24.5,328232.973331,4689432.40144,19,T
1580256085276889126,125.0,42.3381996155,N,-71.0850601196,W,24.6000003815,328234.080845,4689432.74465,19,T
1580256086277431054,126.0,42.3382034302,N,-71.0850524902,W,24.7999992371,328234.918287,4689433.27966,19,T
1580256087278311554,127.0,42.3382110596,N,-71.0850372314,W,24.7999992371,328235.893033,4689433.81131,19,T
1580256088277986622,128.0,42.3382148743,N,-71.0850296021,W,24.8999996185,328236.86778,4689434.34295,19,T
1580256089277418292,129.0,42.338218689,N,-71.0850143433,W,24.8999996185,328237.705221,4689434.87796,19,T
1580256090279289842,130.0,42.3382225037,N,-71.0850067139,W,25.0,328238.675429,4689435.22454,19,T
1580256091279361143,131.0,42.3382301331,N,-71.0849914551,W,25.0,328239.654713,4689435.94125,19,T
1580256092278181100,132.0,42.3382339478,N,-71.0849761963,W,25.2999992371,328241.178677,4689436.45943,19,T
1580256093277444165,133.0,42.3382415771,N,-71.0849609375,W,25.2000007629,328242.157961,4689437.17615,19,T
1580256094277868093,134.0,42.3382453918,N,-71.0849533081,W,25.2999992371,328243.270011,4689437.70443,19,T
1580256095279002633,135.0,42.3382530212,N,-71.0849380493,W,25.1000003815,328244.523903,4689438.41441,19,T
1580256096280007333,136.0,42.3382606506,N,-71.0849227905,W,25.1000003815,328245.64049,4689439.12776,19,T
1580256097279702425,137.0,42.33826828,N,-71.0849075317,W,24.8999996185,328246.619773,4689439.84448,19,T
1580256098278319362,138.0,42.3382720947,N,-71.0848999023,W,24.2000007629,328247.594517,4689440.37612,19,T
1580256099278888196,139.0,42.3382797241,N,-71.0848846436,W,23.7999992371,328248.711104,4689441.08947,19,T
1580256100278915539,140.0,42.3382835388,N,-71.0848693848,W,23.6000003815,328249.827691,4689441.80282,19,T
1580256101278169962,141.0,42.3382949829,N,-71.084854126,W,23.3999996185,328251.227961,4689442.87958,19,T
1580256102280604366,142.0,42.338306427,N,-71.0848388672,W,23.2000007629,328252.490926,4689443.95971,19,T
1580256103279724772,143.0,42.3383140564,N,-71.0848312378,W,23.0,328253.474745,4689444.8615,19,T
1580256104280144410,144.0,42.3383216858,N,-71.084815979,W,22.8999996185,328254.600405,4689445.94499,19,T
1580256105278748504,145.0,42.3383331299,N,-71.0848007202,W,22.7999992371,328255.721528,4689446.84341,19,T
1580256106279571652,146.0,42.3383407593,N,-71.0847854614,W,22.6000003815,328256.84265,4689447.74183,19,T
1580256107279401259,147.0,42.3383483887,N,-71.0847702026,W,22.5,328258.101077,4689448.63689,19,T
1580256108279799450,148.0,42.3383598328,N,-71.0847625732,W,22.3999996185,328259.089431,4689449.72375,19,T
1580256109278502112,149.0,42.3383674622,N,-71.0847473145,W,22.2999992371,328260.077786,4689450.81061,19,T
1580256110278357524,150.0,42.3383750916,N,-71.0847396851,W,22.2000007629,328261.061602,4689451.7124,19,T
1580256111279145335,151.0,42.3383865356,N,-71.0847244263,W,22.1000003815,328262.045419,4689452.61419,19,T
1580256112279022852,152.0,42.3383903503,N,-71.0847167969,W,22.0,328263.020161,4689453.14583,19,T
1580256113278903965,153.0,42.338394165,N,-71.0847015381,W,21.8999996185,328263.857598,4689453.68085,19,T
1580256114279864690,154.0,42.3384017944,N,-71.0846939087,W,21.7999992371,328264.699572,4689454.40093,19,T
1580256115279409900,155.0,42.3384094238,N,-71.0846862793,W,21.6000003815,328265.678851,4689455.11765,19,T
1580256116279370821,156.0,42.3384208679,N,-71.0846710205,W,21.5,328266.809045,4689456.38622,19,T
1580256117278050438,157.0,42.3384284973,N,-71.0846557617,W,20.8999996185,328267.797397,4689457.47308,19,T
1580256118279816517,158.0,42.3384399414,N,-71.0846481323,W,20.5,328268.648445,4689458.56331,19,T
1580256119280387299,159.0,42.3384513855,N,-71.0846328735,W,20.2000007629,328269.636797,4689459.65017,19,T
1580256120297035333,200.0,42.3384552002,N,-71.0846328735,W,19.8999996185,328270.204162,4689460.37698,19,T
1580256121279336335,201.0,42.3384666443,N,-71.0846252441,W,19.5,328270.917905,4689461.47058,19,T
1580256122279854884,202.0,42.3384742737,N,-71.0846099854,W,19.7999992371,328271.901719,4689462.37237,19,T
1580256123280545483,203.0,42.3384819031,N,-71.0845947266,W,19.5,328272.885533,4689463.27416,19,T
1580256124279824941,204.0,42.3384933472,N,-71.0845870972,W,19.2999992371,328273.869346,4689464.17595,19,T
1580256125278017492,205.0,42.3384971619,N,-71.0845718384,W,19.0,328274.848622,4689464.89267,19,T
1580256126280780358,206.0,42.3385047913,N,-71.084564209,W,19.0,328275.832435,4689465.79446,19,T
1580256127280568039,207.0,42.3385162354,N,-71.0845489502,W,19.0,328276.816248,4689466.69625,19,T
1580256128280987659,208.0,42.33852005,N,-71.0845413208,W,19.3999996185,328277.932827,4689467.40961,19,T
1580256129279294908,209.0,42.3385276794,N,-71.084526062,W,20.0,328278.774799,4689468.12969,19,T
1580256130280113695,210.0,42.3385353088,N,-71.0845184326,W,20.1000003815,328279.754074,4689468.84642,19,T
1580256131280250843,211.0,42.3385429382,N,-71.0845031738,W,20.2000007629,328280.737886,4689469.74821,19,T
1580256132280814990,212.0,42.3385505676,N,-71.084487915,W,20.3999996185,328281.854464,4689470.46156,19,T
1580256133280168839,213.0,42.338558197,N,-71.0844802856,W,20.3999996185,328282.833739,4689471.17828,19,T
1580256134281033160,214.0,42.3385620117,N,-71.0844726562,W,20.6000003815,328283.671172,4689471.7133,19,T
1580256135279218789,215.0,42.3385696411,N,-71.0844573975,W,20.7999992371,328284.517679,4689472.61846,19,T
1580256136278516318,216.0,42.3385772705,N,-71.0844497681,W,20.7999992371,328285.496953,4689473.33518,19,T
1580256137277800416,217.0,42.3385848999,N,-71.0844345093,W,20.6000003815,328286.480764,4689474.23697,19,T
1580256138279449833,218.0,42.3385925293,N,-71.0844268799,W,20.5,328287.322733,4689474.95706,19,T
1580256139279839655,219.0,42.3386001587,N,-71.0844116211,W,20.7999992371,328288.31108,4689476.04393,19,T
1580256140279464643,220.0,42.3386116028,N,-71.0844039917,W,20.7999992371,328289.157586,4689476.94908,19,T
1580256141278875804,221.0,42.3386116028,N,-71.0843887329,W,21.2999992371,328290.402393,4689477.28893,19,T
1580256142279600284,222.0,42.3386230469,N,-71.0843811035,W,21.2000007629,328291.386202,4689478.19073,19,T
1580256143279723478,223.0,42.3386268616,N,-71.0843658447,W,21.2000007629,328292.365475,4689478.90745,19,T
1580256144278882592,224.0,42.338634491,N,-71.0843505859,W,21.2999992371,328293.48205,4689479.62081,19,T
1580256145281184454,225.0,42.3386421204,N,-71.0843429565,W,21.2000007629,328294.328555,4689480.52597,19,T
1580256146280151708,226.0,42.3386535645,N,-71.0843353271,W,21.0,328295.312364,4689481.42776,19,T
1580256147279285386,227.0,42.3386573792,N,-71.0843200684,W,21.2000007629,328296.291635,4689482.14448,19,T
1580256148275329802,228.0,42.3386650085,N,-71.0843048096,W,21.2999992371,328297.270906,4689482.86121,19,T
1580256149278927691,229.0,42.3386726379,N,-71.0842971802,W,21.3999996185,328298.250178,4689483.57793,19,T
1580256150280157065,230.0,42.3386764526,N,-71.0842819214,W,21.3999996185,328299.229449,4689484.29465,19,T
1580256151279258980,231.0,42.338684082,N,-71.084274292,W,21.3999996185,328300.208719,4689485.01138,19,T
1580256152278630980,232.0,42.3386917114,N,-71.0842590332,W,21.8999996185,328301.18799,4689485.7281,19,T
1580256153278178741,233.0,42.3386993408,N,-71.0842514038,W,21.8999996185,328302.16726,4689486.44483,19,T
1580256154278954587,234.0,42.3387031555,N,-71.0842437744,W,22.2999992371,328303.004691,4689486.97984,19,T
1580256155279570340,235.0,42.3387107849,N,-71.0842285156,W,22.3999996185,328303.983961,4689487.69657,19,T
1580256156279524545,236.0,42.3387184143,N,-71.0842132568,W,22.3999996185,328304.96323,4689488.41329,19,T
1580256157277961659,237.0,42.338722229,N,-71.0842056274,W,21.8999996185,328305.80066,4689488.94831,19,T
1580256158278721678,238.0,42.3387260437,N,-71.084197998,W,21.8999996185,328306.500786,4689489.4867,19,T
1580256159278627701,239.0,42.3387298584,N,-71.0841903687,W,21.5,328307.200912,4689490.02508,19,T
1580256160278231010,240.0,42.3387374878,N,-71.0841827393,W,21.1000003815,328307.901038,4689490.56347,19,T
1580256161277781805,241.0,42.3387451172,N,-71.0841751099,W,20.7000007629,328308.743004,4689491.28356,19,T
1580256162280707263,242.0,42.3387489319,N,-71.0841598511,W,20.3999996185,328309.447666,4689492.00701,19,T
1580256163280059217,243.0,42.3387565613,N,-71.0841522217,W,20.1000003815,328310.152328,4689492.73047,19,T
1580256164280039808,244.0,42.3387641907,N,-71.0841445923,W,19.7999992371,328310.856989,4689493.45392,19,T
1580256165279348179,245.0,42.3387718201,N,-71.0841369629,W,19.7999992371,328311.566187,4689494.36245,19,T
1580256166278765831,246.0,42.3387794495,N,-71.0841217041,W,20.2999992371,328312.682758,4689495.07581,19,T
1580256167279870842,247.0,42.3387832642,N,-71.0841140747,W,20.7000007629,328313.520187,4689495.61083,19,T
1580256168281250736,248.0,42.3387908936,N,-71.0841064453,W,20.7000007629,328314.362151,4689496.33092,19,T
1580256169289493401,249.0,42.3387985229,N,-71.0840911865,W,21.1000003815,328315.341418,4689497.04765,19,T
1580256170276378582,250.0,42.3388061523,N,-71.0840835571,W,21.2000007629,328316.050615,4689497.95618,19,T
1580256171276659594,251.0,42.338809967,N,-71.0840759277,W,21.1000003815,328316.892579,4689498.67627,19,T
1580256172278062317,252.0,42.3388214111,N,-71.0840682983,W,21.2999992371,328317.601775,4689499.58479,19,T
1580256173276751644,253.0,42.3388252258,N,-71.0840530396,W,21.2999992371,328318.443738,4689500.30489,19,T
1580256174277942893,254.0,42.3388366699,N,-71.0840454102,W,21.5,328319.290238,4689501.21005,19,T
1580256175277965322,255.0,42.3388442993,N,-71.0840377808,W,21.5,328320.141272,4689502.30028,19,T
1580256176276266907,256.0,42.3388557434,N,-71.0840301514,W,21.7000007629,328320.992307,4689503.39051,19,T
1580256177276765508,257.0,42.3388633728,N,-71.0840148926,W,22.1000003815,328321.701502,4689504.29904,19,T
1580256178275809813,258.0,42.3388748169,N,-71.0840072632,W,22.3999996185,328322.552536,4689505.38927,19,T
1580256179278553737,259.0,42.3388824463,N,-71.0839996338,W,22.3999996185,328323.261731,4689506.2978,19,T
1580256180278737644,300.0,42.3388900757,N,-71.0839920044,W,22.0,328323.975461,4689507.3914,19,T
1580256181276261542,301.0,42.3389015198,N,-71.083984375,W,21.7000007629,328324.551889,4689508.48836,19,T
1580256182277634293,302.0,42.3389091492,N,-71.0839767456,W,21.2999992371,328325.261083,4689509.39689,19,T
1580256183277604203,303.0,42.3389167786,N,-71.0839691162,W,21.1000003815,328325.832974,4689510.30878,19,T
1580256184277430220,304.0,42.3389282227,N,-71.0839614868,W,21.0,328326.542168,4689511.21731,19,T
1580256185276995199,305.0,42.3389358521,N,-71.0839538574,W,20.7999992371,328327.388665,4689512.12248,19,T
1580256186278388758,306.0,42.3389434814,N,-71.0839385986,W,20.6000003815,328328.235161,4689513.02764,19,T
1580256187278392111,307.0,42.3389511108,N,-71.0839309692,W,20.6000003815,328329.218961,4689513.92944,19,T
1580256188278441255,308.0,42.3389587402,N,-71.0839233398,W,20.5,328330.065457,4689514.8346,19,T
1580256189275880251,309.0,42.3389701843,N,-71.0839080811,W,20.2999992371,328330.911953,4689515.73976,19,T
1580256190277012154,310.0,42.3389778137,N,-71.0839004517,W,20.1000003815,328331.758449,4689516.64493,19,T
1580256191277788822,311.0,42.3389854431,N,-71.0838928223,W,20.0,328332.604944,4689517.55009,19,T
1580256192277942086,312.0,42.3389930725,N,-71.0838775635,W,19.8999996185,328333.446904,4689518.27018,19,T
1580256193275487515,313.0,42.3390007019,N,-71.0838699341,W,19.8999996185,328334.293399,4689519.17535,19,T
1580256194275027643,314.0,42.3390083313,N,-71.0838623047,W,19.8999996185,328335.135358,4689519.89544,19,T
1580256195278106020,315.0,42.339012146,N,-71.0838470459,W,19.7999992371,328335.977318,4689520.61554,19,T
1580256196276806329,316.0,42.3390197754,N,-71.0838394165,W,19.7000007629,328336.823812,4689521.5207,19,T
1580256197275669890,317.0,42.3390312195,N,-71.0838317871,W,19.7000007629,328337.670307,4689522.42586,19,T
1580256198277112002,318.0,42.3390350342,N,-71.0838241577,W,19.7000007629,328338.374962,4689523.14932,19,T
1580256199276576975,319.0,42.3390426636,N,-71.0838165283,W,19.6000003815,328339.079618,4689523.87278,19,T
1580256200277319239,320.0,42.339050293,N,-71.0838012695,W,19.5,328339.921576,4689524.59287,19,T
1580256201276557116,321.0,42.3390579224,N,-71.0837936401,W,19.5,328340.763535,4689525.31297,19,T
1580256202278347689,322.0,42.3390655518,N,-71.0837860107,W,19.6000003815,328341.610028,4689526.21813,19,T
1580256203279494395,323.0,42.3390731812,N,-71.083770752,W,19.7000007629,328342.456521,4689527.1233,19,T
1580256204278371211,324.0,42.3390808105,N,-71.0837631226,W,20.1000003815,328343.023873,4689527.85012,19,T
1580256205277876165,325.0,42.3390884399,N,-71.0837554932,W,20.2000007629,328343.865831,4689528.57022,19,T
1580256206276072369,326.0,42.3390922546,N,-71.0837478638,W,20.2000007629,328344.845091,4689529.28695,19,T
1580256207277472587,327.0,42.339099884,N,-71.083732605,W,20.6000003815,328345.691583,4689530.19211,19,T
1580256208278494681,328.0,42.3391075134,N,-71.0837249756,W,20.5,328346.53354,4689530.91221,19,T
1580256209277769956,329.0,42.3391151428,N,-71.0837173462,W,20.7000007629,328347.375497,4689531.6323,19,T
1580256210293508257,330.0,42.3391227722,N,-71.0837020874,W,20.7000007629,328348.221989,4689532.53747,19,T
1580256211278994681,331.0,42.3391342163,N,-71.083694458,W,20.6000003815,328349.210318,4689533.62434,19,T
1580256212278143604,332.0,42.3391418457,N,-71.0836868286,W,20.7000007629,328350.056809,4689534.5295,19,T
1580256213277691776,333.0,42.3391494751,N,-71.0836715698,W,20.7000007629,328351.040603,4689535.4313,19,T
1580256214277339405,334.0,42.3391571045,N,-71.0836639404,W,20.7000007629,328351.749791,4689536.33983,19,T
1580256215277609782,335.0,42.3391685486,N,-71.083656311,W,20.5,328352.596282,4689537.245,19,T
1580256216279095935,336.0,42.339176178,N,-71.0836486816,W,20.3999996185,328353.310005,4689538.3386,19,T
1580256217278074467,337.0,42.3391838074,N,-71.0836334229,W,20.6000003815,328354.019192,4689539.24713,19,T
1580256218279195886,338.0,42.3391914368,N,-71.0836257935,W,20.7999992371,328354.865682,4689540.1523,19,T
1580256219279122339,339.0,42.3392028809,N,-71.0836181641,W,20.8999996185,328355.57487,4689541.06083,19,T
1580256220277786022,340.0,42.3392105103,N,-71.0836105347,W,21.2000007629,328356.425894,4689542.15107,19,T
1580256221276675523,341.0,42.3392181396,N,-71.0835952759,W,21.1000003815,328357.405151,4689542.8678,19,T
1580256222277946746,342.0,42.339225769,N,-71.0835876465,W,21.2000007629,328358.388943,4689543.7696,19,T
1580256223278025187,343.0,42.3392333984,N,-71.0835723877,W,21.2999992371,328359.230897,4689544.4897,19,T
1580256224278063284,344.0,42.3392410278,N,-71.0835647583,W,21.1000003815,328359.935548,4689545.21316,19,T
1580256225277748380,345.0,42.3392486572,N,-71.0835571289,W,20.8999996185,328360.782037,4689546.11832,19,T
1580256226276332665,346.0,42.3392562866,N,-71.0835494995,W,20.8999996185,328361.62399,4689546.83842,19,T
1580256227276653308,347.0,42.339263916,N,-71.0835418701,W,21.1000003815,328362.333176,4689547.74695,19,T
1580256228292432288,348.0,42.3392715454,N,-71.0835266113,W,21.2999992371,328363.179664,4689548.65212,19,T
1580256229277354457,349.0,42.3392829895,N,-71.0835189819,W,21.5,328364.030687,4689549.74236,19,T
1580256230277010040,350.0,42.3392906189,N,-71.0835113525,W,21.3999996185,328364.744407,4689550.83596,19,T
1580256231274065249,351.0,42.3392982483,N,-71.0835037231,W,21.2999992371,328365.590894,4689551.74113,19,T
1580256232278323548,352.0,42.3393096924,N,-71.0834884644,W,21.6000003815,328366.441916,4689552.83136,19,T
1580256233276173226,353.0,42.3393173218,N,-71.083480835,W,21.7999992371,328367.288403,4689553.73653,19,T
1580256234277835365,354.0,42.3393249512,N,-71.0834732056,W,21.6000003815,328368.130355,4689554.45663,19,T
1580256235276903827,355.0,42.3393325806,N,-71.0834579468,W,21.7000007629,328368.976841,4689555.3618,19,T
1580256236276306694,356.0,42.33934021,N,-71.0834503174,W,21.7999992371,328369.818793,4689556.08189,19,T
1580256237275246959,357.0,42.3393440247,N,-71.0834350586,W,21.5,328370.793511,4689556.61356,19,T
1580256238276200695,358.0,42.3393516541,N,-71.0834274292,W,21.0,328371.498161,4689557.33702,19,T
1580256239272792073,359.0,42.3393592834,N,-71.0834197998,W,20.2000007629,328372.20281,4689558.06048,19,T
1580256240277382578,400.0,42.3393669128,N,-71.0834121704,W,20.0,328373.186597,4689558.96228,19,T
1580256241275754938,401.0,42.3393745422,N,-71.0833969116,W,19.8999996185,328374.170384,4689559.86409,19,T
1580256242275676494,402.0,42.3393821716,N,-71.0833892822,W,19.7000007629,328375.012335,4689560.58419,19,T
1580256243276309231,403.0,42.339389801,N,-71.0833816528,W,19.5,328375.854285,4689561.30428,19,T
1580256244277283682,404.0,42.3393936157,N,-71.083366394,W,19.2999992371,328376.558933,4689562.02775,19,T
1580256245276798596,405.0,42.3394050598,N,-71.0833587646,W,19.0,328377.405418,4689562.93292,19,T
1580256246277226713,406.0,42.3394126892,N,-71.0833511353,W,18.6000003815,328378.1146,4689563.84145,19,T
1580256247277528826,407.0,42.3394203186,N,-71.0833435059,W,18.2000007629,328378.828317,4689564.93505,19,T
1580256248276878117,408.0,42.3394317627,N,-71.0833358765,W,17.8999996185,328379.404731,4689566.03202,19,T
1580256249277844606,409.0,42.3394432068,N,-71.0833282471,W,17.6000003815,328380.118447,4689567.12562,19,T
1580256250276566131,410.0,42.3394508362,N,-71.0833206177,W,17.2999992371,328380.96493,4689568.03079,19,T
1580256251277271956,411.0,42.3394546509,N,-71.0833129883,W,17.1000003815,328381.665043,4689568.56919,19,T
1580256252279253493,412.0,42.3394622803,N,-71.0833053589,W,16.8999996185,328382.36969,4689569.29265,19,T
1580256253277301574,413.0,42.3394699097,N,-71.0832977295,W,16.7000007629,328382.804267,4689570.20791,19,T
1580256254277116217,414.0,42.3394775391,N,-71.0832901001,W,16.6000003815,328383.376146,4689571.11981,19,T
1580256255276164420,415.0,42.3394851685,N,-71.0832824707,W,16.5,328384.218094,4689571.83991,19,T
1580256256276395705,416.0,42.3394927979,N,-71.0832748413,W,16.3999996185,328384.927275,4689572.74844,19,T
1580256257275060418,417.0,42.3395004272,N,-71.0832595825,W,16.2000007629,328385.769222,4689573.46854,19,T
1580256258277166471,418.0,42.3395080566,N,-71.0832519531,W,16.2000007629,328386.615704,4689574.37371,19,T
1580256259277279974,419.0,42.339515686,N,-71.0832443237,W,16.0,328387.32035,4689575.09717,19,T
1580256260279214338,420.0,42.3395233154,N,-71.0832366943,W,15.8999996185,328388.162298,4689575.81727,19,T
1580256261275507832,421.0,42.3395309448,N,-71.0832214355,W,15.8999996185,328389.146081,4689576.71908,19,T
1580256262276043689,422.0,42.3395347595,N,-71.0832138062,W,15.8000001907,328389.988028,4689577.43918,19,T
1580256263276126050,423.0,42.3395462036,N,-71.0831985474,W,15.6999998093,328390.97181,4689578.34098,19,T
1580256264276540397,424.0,42.3395500183,N,-71.083190918,W,15.6999998093,328391.951059,4689579.05772,19,T
1580256265275469394,425.0,42.3395614624,N,-71.0831832886,W,15.6000003815,328392.660237,4689579.96625,19,T
1580256266276105789,426.0,42.3395690918,N,-71.0831680298,W,15.6000003815,328393.506718,4689580.87142,19,T
1580256267275738304,427.0,42.3395767212,N,-71.0831604004,W,15.6000003815,328394.353198,4689581.77659,19,T
1580256268275691424,428.0,42.3395843506,N,-71.083152771,W,15.6000003815,328395.195144,4689582.4967,19,T
1580256269274574559,429.0,42.3395881653,N,-71.0831451416,W,15.6999998093,328395.895254,4689583.03509,19,T
1580256270275414893,430.0,42.3395957947,N,-71.0831298828,W,15.8999996185,328396.604432,4689583.94362,19,T
1580256271276582070,431.0,42.3396034241,N,-71.0831222534,W,16.3999996185,328397.446377,4689584.66372,19,T
1580256272275392079,432.0,42.3396072388,N,-71.083114624,W,16.7999992371,328398.283788,4689585.19875,19,T
1580256273277314061,433.0,42.3396110535,N,-71.0830993652,W,17.2000007629,328399.391269,4689585.54199,19,T
1580256274277133456,434.0,42.3396148682,N,-71.0830841064,W,18.2000007629,328400.636051,4689585.88185,19,T
1580256275276685258,435.0,42.3396186829,N,-71.0830764771,W,18.2999992371,328401.33616,4689586.42025,19,T
1580256276278114209,436.0,42.3396263123,N,-71.0830688477,W,18.2999992371,328402.178104,4689587.14035,19,T
1580256277276712018,437.0,42.3396377563,N,-71.0830612183,W,18.1000003815,328402.891815,4689588.23396,19,T
1580256278276797073,438.0,42.3396453857,N,-71.0830459595,W,17.8999996185,328403.875594,4689589.13576,19,T
1580256279277929638,439.0,42.3396568298,N,-71.0830383301,W,17.7000007629,328404.726606,4689590.22601,19,T
1580256280277803000,440.0,42.3396644592,N,-71.0830230713,W,17.7000007629,328405.573083,4689591.13118,19,T
1580256281277561838,441.0,42.3396682739,N,-71.0830154419,W,17.7999992371,328406.415027,4689591.85128,19,T
1580256282278006114,442.0,42.339679718,N,-71.0830078125,W,17.6000003815,328407.128736,4689592.94489,19,T
1580256283278506931,443.0,42.3396873474,N,-71.0830001831,W,17.5,328407.97068,4689593.66499,19,T
1580256284277861307,444.0,42.3396949768,N,-71.0829925537,W,17.3999996185,328408.675321,4689594.38845,19,T
1580256285276156424,445.0,42.3396987915,N,-71.0829849243,W,17.3999996185,328409.379963,4689595.11192,19,T
1580256286270736295,446.0,42.3397102356,N,-71.0829696655,W,17.2000007629,328410.36374,4689596.01373,19,T
1580256287275121310,447.0,42.339717865,N,-71.0829620361,W,17.2000007629,328411.210217,4689596.9189,19,T
1580256288276027129,448.0,42.3397254944,N,-71.0829467773,W,17.2000007629,328412.193994,4689597.82071,19,T
1580256289275279240,449.0,42.3397331238,N,-71.0829391479,W,17.1000003815,328413.040469,4689598.72588,19,T
1580256290276220521,450.0,42.3397407532,N,-71.0829315186,W,17.1000003815,328413.886945,4689599.63106,19,T
1580256291276139186,451.0,42.3397483826,N,-71.0829162598,W,17.2000007629,328414.728887,4689600.35116,19,T
1580256292275860509,452.0,42.3397598267,N,-71.0829086304,W,16.7000007629,328415.584429,4689601.62647,19,T
1580256293275626699,453.0,42.3397712708,N,-71.082901001,W,16.3999996185,328416.435437,4689602.71672,19,T
1580256294276570798,454.0,42.3397789001,N,-71.0828857422,W,16.2000007629,328417.419213,4689603.61853,19,T
1580256295276583620,455.0,42.3397865295,N,-71.0828781128,W,16.2999992371,328418.261154,4689604.33863,19,T
1580256296277962641,456.0,42.3397941589,N,-71.082862854,W,16.2999992371,328419.107628,4689605.2438,19,T
1580256297275767964,457.0,42.3398017883,N,-71.0828552246,W,16.3999996185,328419.949568,4689605.96391,19,T
1580256298276118309,458.0,42.3398094177,N,-71.0828475952,W,16.5,328420.658741,4689606.87244,19,T
1580256299276933850,459.0,42.3398170471,N,-71.0828399658,W,16.6000003815,328421.505214,4689607.77762,19,T
1580256300276403647,500.0,42.3398284912,N,-71.0828323364,W,16.7000007629,328422.21892,4689608.87122,19,T
1580256301275020439,501.0,42.3398361206,N,-71.0828170776,W,16.7999992371,328423.065393,4689609.7764,19,T
1580256302277110618,502.0,42.33984375,N,-71.0828094482,W,17.7999992371,328424.186468,4689610.67485,19,T
1580256303277181221,503.0,42.3398513794,N,-71.0827941895,W,18.7999992371,328425.44031,4689611.38486,19,T
1580256304275012884,504.0,42.3398590088,N,-71.0827865601,W,19.2000007629,328426.149482,4689612.2934,19,T
1580256305273787264,505.0,42.3398666382,N,-71.0827713013,W,19.7000007629,328426.858653,4689613.20194,19,T
1580256306275834637,506.0,42.3398742676,N,-71.0827636719,W,20.1000003815,328427.705125,4689614.10711,19,T
1580256307272888752,507.0,42.339881897,N,-71.0827560425,W,20.7000007629,328428.684364,4689614.82385,19,T
1580256308275935539,508.0,42.3398895264,N,-71.0827407837,W,21.2000007629,328429.530836,4689615.72903,19,T
1580256309275894010,509.0,42.3398971558,N,-71.0827331543,W,21.5,328430.235473,4689616.45249,19,T
1580256310275734856,510.0,42.3399047852,N,-71.0827255249,W,21.7999992371,328430.802809,4689617.17932,19,T
1580256311275618429,511.0,42.3399085999,N,-71.0827178955,W,22.1000003815,328431.502913,4689617.71772,19,T
1580256312275730078,512.0,42.3399162292,N,-71.0827102661,W,22.3999996185,328432.20755,4689618.44119,19,T
1580256313274866545,513.0,42.3399200439,N,-71.0827026367,W,23.0,328432.907654,4689618.97958,19,T
1580256314276302527,514.0,42.3399238586,N,-71.0826950073,W,23.7000007629,328433.603224,4689619.33291,19,T
1580256315275815388,515.0,42.339931488,N,-71.0826873779,W,24.1000003815,328434.307861,4689620.05638,19,T
1580256316275064348,516.0,42.3399353027,N,-71.0826797485,W,24.3999996185,328435.149798,4689620.77648,19,T
1580256317275396400,517.0,42.3399429321,N,-71.0826644897,W,24.7000007629,328435.987202,4689621.31152,19,T
1580256318276868216,518.0,42.3399467468,N,-71.0826568604,W,24.8999996185,328436.820073,4689621.66148,19,T
1580256319276259229,519.0,42.3399467468,N,-71.082649231,W,25.2000007629,328437.515643,4689622.01481,19,T
1580256320274877750,520.0,42.3399543762,N,-71.0826339722,W,25.3999996185,328438.494881,4689622.73155,19,T
1580256321275339153,521.0,42.3399734497,N,-71.0826263428,W,24.2999992371,328439.505848,4689624.74379,19,T
1580256322307617868,522.0,42.3399848938,N,-71.0826187134,W,24.0,328440.35685,4689625.83403,19,T
1580256323275480772,523.0,42.3399925232,N,-71.0826034546,W,23.8999996185,328441.070551,4689626.92764,19,T
1580256324275584647,524.0,42.3400001526,N,-71.0825958252,W,23.5,328441.917019,4689627.83282,19,T
1580256325274936818,525.0,42.3400115967,N,-71.0825881958,W,22.7999992371,328442.772553,4689629.10814,19,T
1580256326275647030,526.0,42.3400230408,N,-71.082572937,W,22.2999992371,328443.623554,4689630.19838,19,T
1580256327276479328,527.0,42.3400344849,N,-71.0825653076,W,22.2000007629,328444.611855,4689631.28527,19,T
1580256328275785596,528.0,42.3400421143,N,-71.0825576782,W,21.8999996185,328445.458323,4689632.19045,19,T
1580256329273959437,529.0,42.3400535583,N,-71.0825500488,W,21.6000003815,328446.172022,4689633.28406,19,T
1580256330274932613,530.0,42.3400650024,N,-71.08253479,W,21.2000007629,328446.890254,4689634.56274,19,T
1580256331272112360,531.0,42.3400726318,N,-71.0825271606,W,20.7999992371,328447.603953,4689635.65635,19,T
1580256332292772216,532.0,42.3400840759,N,-71.0825195312,W,20.5,328448.454953,4689636.74659,19,T
1580256333275402447,533.0,42.3400917053,N,-71.0825119019,W,20.1000003815,328449.168651,4689637.8402,19,T
1580256334279779517,534.0,42.3401031494,N,-71.0825042725,W,19.7000007629,328450.015118,4689638.74538,19,T
1580256335278337061,535.0,42.3401107788,N,-71.0824966431,W,19.3999996185,328450.724283,4689639.65392,19,T
1580256336277990663,536.0,42.3401184082,N,-71.0824890137,W,18.8999996185,328451.300681,4689640.7509,19,T
1580256337276305184,537.0,42.3401298523,N,-71.0824813843,W,18.6000003815,328452.009846,4689641.65944,19,T
1580256338277132913,538.0,42.3401374817,N,-71.0824737549,W,18.5,328452.58171,4689642.57134,19,T
1580256339277128727,539.0,42.3401451111,N,-71.0824584961,W,18.5,328453.428176,4689643.47652,19,T
1580256340276485345,540.0,42.3401527405,N,-71.0824508667,W,18.6000003815,328454.132808,4689644.19999,19,T
1580256341275389413,541.0,42.3401565552,N,-71.0824432373,W,18.6000003815,328454.83744,4689644.92345,19,T
1580256342275622778,542.0,42.3401679993,N,-71.0824356079,W,18.7000007629,328455.683904,4689645.82863,19,T
1580256343277165817,543.0,42.340171814,N,-71.0824279785,W,18.8999996185,328456.388536,4689646.5521,19,T
1580256344276634115,544.0,42.3401832581,N,-71.0824203491,W,19.0,328457.0977,4689647.46064,19,T
1580256345276683388,545.0,42.3401908875,N,-71.0824127197,W,19.0,328457.806864,4689648.36918,19,T
1580256346277116600,546.0,42.3401985168,N,-71.0824050903,W,18.7999992371,328458.52056,4689649.46279,19,T
1580256347277407865,547.0,42.3402099609,N,-71.0823898315,W,18.7000007629,328459.508856,4689650.54968,19,T
1580256348277796812,548.0,42.3402175903,N,-71.0823822021,W,18.6000003815,328460.35532,4689651.45486,19,T
1580256349273223205,549.0,42.3402290344,N,-71.0823745728,W,18.2000007629,328460.936247,4689652.7369,19,T
1580256350277052489,550.0,42.3402404785,N,-71.0823669434,W,17.8999996185,328461.649942,4689653.83052,19,T
1580256351276390446,551.0,42.3402481079,N,-71.0823516846,W,17.6000003815,328462.500937,4689654.92076,19,T
1580256352276880136,552.0,42.340259552,N,-71.0823440552,W,17.2999992371,328463.3474,4689655.82594,19,T
1580256353275048651,553.0,42.3402671814,N,-71.0823364258,W,17.3999996185,328464.335695,4689656.91283,19,T
1580256354276774082,554.0,42.3402748108,N,-71.082321167,W,17.5,328465.452225,4689657.62621,19,T
1580256355276553703,555.0,42.3402824402,N,-71.0823059082,W,17.8999996185,328466.847887,4689658.51794,19,T
1580256356279879775,556.0,42.3402900696,N,-71.0822906494,W,17.6000003815,328467.831648,4689659.41976,19,T
1580256357277816566,557.0,42.3403015137,N,-71.08228302,W,17.3999996185,328468.67811,4689660.32494,19,T
1580256358279146862,558.0,42.3403091431,N,-71.0822753906,W,17.2000007629,328469.387271,4689661.23348,19,T
1580256359276047025,559.0,42.3403167725,N,-71.0822601318,W,17.0,328470.2292,4689661.95359,19,T
1580256360280173896,600.0,42.3403244019,N,-71.0822525024,W,17.0,328471.080192,4689663.04384,19,T
1580256361279408541,601.0,42.3403320312,N,-71.082244873,W,16.7999992371,328471.789353,4689663.95238,19,T
1580256362279021370,602.0,42.3403434753,N,-71.0822372437,W,16.3999996185,328472.635813,4689664.85756,19,T
1580256363278338177,603.0,42.34034729,N,-71.0822219849,W,16.2000007629,328473.477741,4689665.57767,19,T
1580256364278163572,604.0,42.3403549194,N,-71.0822143555,W,16.0,328474.324201,4689666.48285,19,T
1580256365277561085,605.0,42.3403663635,N,-71.0821990967,W,16.2999992371,328475.445261,4689667.38131,19,T
1580256366279572018,606.0,42.3403739929,N,-71.0821914673,W,16.1000003815,328476.42902,4689668.28312,19,T
1580256367278433552,607.0,42.3403816223,N,-71.0821762085,W,16.0,328477.545547,4689668.99651,19,T
1580256368279979094,608.0,42.340385437,N,-71.0821609497,W,16.0,328478.662074,4689669.7099,19,T
1580256369275959896,609.0,42.3403968811,N,-71.0821456909,W,16.3999996185,328479.924964,4689670.79006,19,T
1580256370277818774,610.0,42.3404045105,N,-71.0821380615,W,16.3999996185,328480.908722,4689671.69188,19,T
1580256371278401679,611.0,42.3404159546,N,-71.0821304321,W,16.2000007629,328481.622412,4689672.78549,19,T
1580256372275114730,612.0,42.3404197693,N,-71.0821151733,W,16.3999996185,328483.004474,4689673.12201,19,T
1580256373280844673,613.0,42.3404273987,N,-71.0820999146,W,16.3999996185,328483.988232,4689674.02383,19,T
1580256374281023478,614.0,42.3404350281,N,-71.0820846558,W,16.8999996185,328485.104757,4689674.73722,19,T
1580256375280556153,615.0,42.3404388428,N,-71.0820770264,W,16.7999992371,328486.07945,4689675.2689,19,T
1580256376279604134,616.0,42.3404464722,N,-71.0820617676,W,16.6000003815,328486.925908,4689676.17408,19,T
1580256377278500446,617.0,42.3404579163,N,-71.0820541382,W,16.3999996185,328487.639596,4689677.26769,19,T
1580256378282578717,618.0,42.3404655457,N,-71.0820465088,W,16.2000007629,328488.348753,4689678.17624,19,T
1580256379278915887,619.0,42.340473175,N,-71.0820388794,W,16.1000003815,328489.053378,4689678.89971,19,T
1580256380275861566,620.0,42.3404808044,N,-71.08203125,W,16.0,328489.762535,4689679.80825,19,T
1580256381280402639,621.0,42.3404884338,N,-71.0820236206,W,15.8999996185,328490.476223,4689680.90187,19,T
1580256382279689079,622.0,42.3404998779,N,-71.0820159912,W,15.8999996185,328491.322679,4689681.80705,19,T
1580256383280034840,623.0,42.3405075073,N,-71.0820007324,W,15.8999996185,328492.169135,4689682.71223,19,T
1580256384276690002,624.0,42.3405151367,N,-71.081993103,W,15.8000001907,328493.01559,4689683.61741,19,T
1580256385280373512,625.0,42.3405265808,N,-71.0819854736,W,15.8999996185,328493.729277,4689684.71103,19,T
1580256386275990200,626.0,42.3405342102,N,-71.0819778442,W,15.8000001907,328494.305665,4689685.808,19,T
1580256387279528299,627.0,42.3405418396,N,-71.0819702148,W,15.8000001907,328495.01482,4689686.71655,19,T
1580256388280235599,628.0,42.340549469,N,-71.0819625854,W,15.8999996185,328495.719444,4689687.44002,19,T
1580256389280658123,629.0,42.3405570984,N,-71.0819549561,W,15.8000001907,328496.291299,4689688.35193,19,T
1580256390279808911,630.0,42.3405647278,N,-71.0819473267,W,15.8000001907,328496.858623,4689689.07876,19,T
1580256391280637025,631.0,42.3405723572,N,-71.0819396973,W,15.6999998093,328497.288647,4689689.80896,19,T
1580256392281273025,632.0,42.3405799866,N,-71.0819396973,W,15.6999998093,328497.581372,4689690.54252,19,T
1580256393280455832,633.0,42.3405838013,N,-71.0819396973,W,15.6000003815,328497.869565,4689691.09101,19,T
1580256394277708179,634.0,42.3405838013,N,-71.0819396973,W,15.5,328497.732266,4689691.09437,19,T
1580256395277865081,635.0,42.3405838013,N,-71.0819396973,W,15.5,328497.732266,4689691.09437,19,T
