<svg xmlns="http://www.w3.org/2000/svg" width="24" height="24" viewBox="0 0 24 24">
    <defs>
        <filter id="prefix__a">
            <feColorMatrix in="SourceGraphic" values="0 0 0 0 0.745098 0 0 0 0 0.764706 0 0 0 0 0.819608 0 0 0 1.000000 0"/>
        </filter>
    </defs>
    <g fill="none" fill-rule="evenodd" filter="url(#prefix__a)" transform="translate(-500 -552)">
        <g>
            <path d="M0 0L24 0 24 24 0 24z" transform="translate(500 552)"/>
            <path fill="#000" fill-rule="nonzero" d="M7.291 20.824L2 22l1.176-5.291C2.402 15.26 1.998 13.643 2 12 2 6.477 6.477 2 12 2s10 4.477 10 10-4.477 10-10 10c-1.643.002-3.26-.402-4.709-1.176z" transform="translate(500 552)"/>
        </g>
    </g>
</svg>
