<svg xmlns="http://www.w3.org/2000/svg" width="24" height="24" viewBox="0 0 24 24">
    <defs>
        <filter id="prefix__a">
            <feColorMatrix in="SourceGraphic" values="0 0 0 0 0.745098 0 0 0 0 0.764706 0 0 0 0 0.819608 0 0 0 1.000000 0"/>
        </filter>
    </defs>
    <g fill="none" fill-rule="evenodd" filter="url(#prefix__a)" transform="translate(-100 -8)">
        <g>
            <path d="M0 0L24 0 24 24 0 24z" transform="translate(100 8)"/>
            <path fill="#000" fill-rule="nonzero" d="M20 17h2v2H2v-2h2v-7c0-4.418 3.582-8 8-8s8 3.582 8 8v7zM9 21h6v2H9v-2z" transform="translate(100 8)"/>
        </g>
    </g>
</svg>
