<svg xmlns="http://www.w3.org/2000/svg" width="32" height="32" viewBox="0 0 32 32">
    <g fill="#F68634" fill-rule="evenodd">
        <path fill-rule="nonzero" d="M9.796 17.44l3.587 3.463c.734.708.734 1.857 0 2.566-.734.708-1.924.708-2.657 0l-3.527-3.403-3.523 3.403c-.367.354-.849.53-1.33.53-.48 0-.961-.176-1.329-.53-.734-.709-.734-1.858 0-2.566l3.586-3.463c-1.305-.287-2.565-.786-3.725-1.489C0 15.417-.264 14.297.289 13.449c.552-.85 1.712-1.105 2.592-.57 2.626 1.594 6.01 1.595 8.638 0 .88-.535 2.04-.28 2.592.57.553.847.289 1.968-.59 2.502-1.16.703-2.42 1.202-3.725 1.49z" transform="translate(9 4)"/>
        <path d="M7.184 0C10.723 0 13.6 2.778 13.6 6.194c0 3.414-2.877 6.191-6.416 6.191-3.539 0-6.416-2.777-6.416-6.191C.768 2.778 3.645 0 7.184 0zm0 3.63c-1.464 0-2.657 1.15-2.657 2.564 0 1.413 1.193 2.563 2.657 2.563 1.465 0 2.656-1.15 2.656-2.563C9.84 4.78 8.65 3.63 7.184 3.63z" transform="translate(9 4)"/>
    </g>
</svg>
