<?xml version="1.0" encoding="UTF-8"?>
<svg xmlns="http://www.w3.org/2000/svg" xmlns:xlink="http://www.w3.org/1999/xlink" width="163pt" height="77pt" viewBox="0 0 163 77" version="1.1">
<g id="surface1">
<path style=" stroke:none;fill-rule:nonzero;fill:rgb(100%,100%,100%);fill-opacity:1;" d="M 38.386719 44.984375 C 40.878906 44.984375 42.230469 43.328125 42.230469 41.007812 L 42.230469 29.164062 L 47.53125 29.164062 L 47.53125 41.273438 C 47.480469 46.601562 43.210938 48.695312 38.386719 48.695312 C 33.558594 48.695312 29.292969 46.601562 29.238281 41.273438 L 29.238281 29.164062 L 34.539062 29.164062 L 34.539062 41.007812 C 34.539062 43.328125 35.894531 44.984375 38.386719 44.984375 "/>
<path style=" stroke:none;fill-rule:nonzero;fill:rgb(100%,100%,100%);fill-opacity:1;" d="M 82.917969 42.125 L 82.917969 40.875 C 82.917969 37.191406 80.832031 34.59375 77.058594 34.59375 C 72.84375 34.59375 70.882812 37.855469 70.882812 41.75 C 70.882812 45.675781 72.582031 48.695312 76.847656 48.695312 C 80.03125 48.695312 82.363281 47.1875 82.761719 44.164062 L 80.109375 44.164062 C 79.816406 46.097656 78.835938 46.867188 76.875 46.867188 C 74.300781 46.867188 73.449219 44.578125 73.449219 42.125 Z M 73.503906 40.375 C 73.523438 38.296875 74.78125 36.421875 76.875 36.421875 C 79.3125 36.421875 80.265625 38.09375 80.265625 40.375 L 73.503906 40.375 "/>
<path style=" stroke:none;fill-rule:nonzero;fill:rgb(100%,100%,100%);fill-opacity:1;" d="M 85.972656 48.300781 L 88.492188 48.300781 L 88.492188 29.164062 L 85.972656 29.164062 Z M 85.972656 48.300781 "/>
<path style=" stroke:none;fill-rule:nonzero;fill:rgb(100%,100%,100%);fill-opacity:1;" d="M 15.503906 48.300781 L 20.804688 48.300781 L 20.804688 32.878906 L 26.746094 32.878906 L 26.746094 29.167969 L 9.566406 29.167969 L 9.566406 32.878906 L 15.503906 32.878906 L 15.503906 48.300781 "/>
<path style=" stroke:none;fill-rule:nonzero;fill:rgb(100%,100%,100%);fill-opacity:1;" d="M 28.238281 19.847656 C 26.945312 20.253906 25.613281 19.929688 25.617188 18.199219 C 25.617188 15.566406 31.808594 13.355469 32.667969 11.050781 C 32.878906 10.476562 32.890625 10.003906 32.617188 10.019531 C 32.421875 10.03125 32.574219 10.316406 32.140625 10.75 C 29.578125 13.316406 25.28125 13.3125 21.984375 14.789062 C 19.820312 15.761719 13.484375 18.742188 14.945312 25.390625 C 15.011719 25.707031 15.203125 26.765625 15.394531 26.765625 C 15.621094 26.765625 15.617188 26.136719 15.613281 25.375 C 15.5625 21.414062 20.253906 20.308594 21.777344 17.722656 C 21.960938 17.414062 22.277344 16.980469 22.351562 17.179688 C 22.386719 17.277344 22.363281 17.421875 22.300781 17.695312 C 21.824219 19.824219 19.601562 21.1875 20.230469 22.707031 C 21.046875 24.679688 23.40625 23.207031 24.128906 21.941406 C 24.324219 21.589844 24.429688 21.367188 24.5625 21.414062 C 24.660156 21.449219 24.65625 21.847656 24.59375 22.207031 C 24.207031 24.496094 23.679688 25.78125 22.007812 27.082031 C 21.472656 27.5 20.628906 27.585938 20.738281 27.90625 C 20.765625 27.992188 21.128906 27.980469 21.417969 27.953125 C 25.878906 27.667969 29.609375 22.410156 30.597656 18.976562 C 30.699219 18.734375 30.730469 18.507812 30.621094 18.421875 C 30.488281 18.316406 30.292969 18.554688 30.09375 18.734375 C 29.582031 19.179688 28.882812 19.648438 28.238281 19.847656 "/>
<path style=" stroke:none;fill-rule:nonzero;fill:rgb(100%,100%,100%);fill-opacity:1;" d="M 116.253906 33.714844 C 117.648438 33.714844 118.21875 32.898438 118.21875 31.648438 C 118.21875 30.183594 117.359375 29.535156 115.949219 29.578125 L 115.25 29.578125 L 115.25 33.714844 Z M 116.144531 29.164062 C 117.773438 29.164062 118.699219 30.003906 118.699219 31.648438 C 118.699219 33.289062 117.773438 34.125 116.144531 34.125 L 114.804688 34.125 L 114.804688 29.164062 L 116.144531 29.164062 "/>
<path style=" stroke:none;fill-rule:nonzero;fill:rgb(100%,100%,100%);fill-opacity:1;" d="M 121.949219 32.121094 C 121.902344 31.453125 121.542969 30.953125 120.828125 30.953125 C 120.15625 30.953125 119.796875 31.515625 119.742188 32.121094 Z M 119.730469 32.5 C 119.742188 33.234375 120.078125 33.851562 120.925781 33.851562 C 121.414062 33.851562 121.816406 33.503906 121.921875 33.027344 L 122.355469 33.027344 C 122.140625 33.851562 121.625 34.230469 120.792969 34.230469 C 119.765625 34.230469 119.28125 33.34375 119.28125 32.402344 C 119.28125 31.46875 119.796875 30.574219 120.820312 30.574219 C 121.976562 30.574219 122.394531 31.417969 122.394531 32.5 L 119.730469 32.5 "/>
<path style=" stroke:none;fill-rule:nonzero;fill:rgb(100%,100%,100%);fill-opacity:1;" d="M 123.136719 34.125 L 123.546875 34.125 L 123.546875 29.164062 L 123.136719 29.164062 Z M 123.136719 34.125 "/>
<path style=" stroke:none;fill-rule:nonzero;fill:rgb(100%,100%,100%);fill-opacity:1;" d="M 124.867188 34.125 L 124.867188 31.054688 L 124.171875 31.054688 L 124.171875 30.675781 L 124.867188 30.675781 L 124.867188 29.941406 C 124.867188 29.351562 125.105469 29.082031 125.699219 29.082031 C 125.828125 29.082031 125.964844 29.132812 126.089844 29.15625 L 126.089844 29.488281 C 126.007812 29.472656 125.917969 29.460938 125.835938 29.460938 C 125.273438 29.460938 125.257812 29.742188 125.277344 30.234375 L 125.277344 30.675781 L 126.0625 30.675781 L 126.0625 31.054688 L 125.277344 31.054688 L 125.277344 34.125 L 124.867188 34.125 "/>
<path style=" stroke:none;fill-rule:nonzero;fill:rgb(100%,100%,100%);fill-opacity:1;" d="M 127.03125 31.054688 L 126.347656 31.054688 L 126.347656 30.675781 L 127.03125 30.675781 L 127.03125 29.941406 L 127.445312 29.761719 L 127.445312 30.675781 L 128.230469 30.675781 L 128.230469 31.054688 L 127.445312 31.054688 L 127.445312 33.363281 C 127.4375 33.679688 127.601562 33.851562 127.917969 33.851562 C 128.042969 33.851562 128.167969 33.84375 128.277344 33.808594 L 128.277344 34.167969 C 128.144531 34.203125 127.996094 34.226562 127.859375 34.226562 C 126.984375 34.226562 127.03125 33.671875 127.03125 33.203125 L 127.03125 31.054688 "/>
<path style=" stroke:none;fill-rule:nonzero;fill:rgb(100%,100%,100%);fill-opacity:1;" d="M 115.25 36.253906 L 115.25 39.460938 C 115.285156 40.359375 115.800781 40.902344 116.617188 40.902344 C 117.433594 40.902344 117.949219 40.359375 117.984375 39.460938 L 117.984375 36.253906 L 118.429688 36.253906 L 118.429688 39.46875 C 118.417969 40.53125 117.820312 41.316406 116.617188 41.316406 C 115.414062 41.316406 114.816406 40.53125 114.804688 39.46875 L 114.804688 36.253906 L 115.25 36.253906 "/>
<path style=" stroke:none;fill-rule:nonzero;fill:rgb(100%,100%,100%);fill-opacity:1;" d="M 119.722656 41.214844 L 119.308594 41.214844 L 119.308594 38.539062 C 119.308594 38.273438 119.289062 37.996094 119.277344 37.765625 L 119.699219 37.765625 L 119.722656 38.273438 L 119.734375 38.285156 C 119.976562 37.859375 120.367188 37.660156 120.816406 37.660156 C 121.941406 37.660156 122.03125 38.65625 122.03125 39.054688 L 122.03125 41.214844 L 121.617188 41.214844 L 121.617188 38.988281 C 121.617188 38.390625 121.273438 38.039062 120.710938 38.039062 C 120.03125 38.039062 119.722656 38.609375 119.722656 39.226562 L 119.722656 41.214844 "/>
<path style=" stroke:none;fill-rule:nonzero;fill:rgb(100%,100%,100%);fill-opacity:1;" d="M 123.371094 37.765625 L 123.371094 41.214844 L 122.957031 41.214844 L 122.957031 37.765625 Z M 123.40625 36.765625 L 122.921875 36.765625 L 122.921875 36.253906 L 123.40625 36.253906 L 123.40625 36.765625 "/>
<path style=" stroke:none;fill-rule:nonzero;fill:rgb(100%,100%,100%);fill-opacity:1;" d="M 124.476562 37.765625 L 125.664062 40.644531 L 126.8125 37.765625 L 127.265625 37.765625 L 125.898438 41.214844 L 125.433594 41.214844 L 124.023438 37.765625 L 124.476562 37.765625 "/>
<path style=" stroke:none;fill-rule:nonzero;fill:rgb(100%,100%,100%);fill-opacity:1;" d="M 130.199219 39.207031 C 130.152344 38.539062 129.792969 38.039062 129.078125 38.039062 C 128.40625 38.039062 128.050781 38.601562 127.992188 39.207031 Z M 127.980469 39.585938 C 127.992188 40.320312 128.332031 40.9375 129.175781 40.9375 C 129.664062 40.9375 130.070312 40.589844 130.171875 40.113281 L 130.605469 40.113281 C 130.394531 40.9375 129.878906 41.316406 129.046875 41.316406 C 128.015625 41.316406 127.535156 40.429688 127.535156 39.488281 C 127.535156 38.554688 128.050781 37.660156 129.070312 37.660156 C 130.226562 37.660156 130.644531 38.507812 130.644531 39.585938 L 127.980469 39.585938 "/>
<path style=" stroke:none;fill-rule:nonzero;fill:rgb(100%,100%,100%);fill-opacity:1;" d="M 131.835938 41.214844 L 131.421875 41.214844 L 131.421875 38.539062 C 131.429688 38.273438 131.402344 37.996094 131.386719 37.765625 L 131.8125 37.765625 L 131.835938 38.273438 L 131.847656 38.273438 C 131.972656 37.921875 132.28125 37.675781 132.625 37.660156 C 132.761719 37.652344 132.898438 37.660156 133.039062 37.667969 L 133.039062 38.066406 C 132.953125 38.058594 132.867188 38.039062 132.78125 38.039062 C 132.171875 38.039062 131.847656 38.476562 131.835938 39.136719 L 131.835938 41.214844 "/>
<path style=" stroke:none;fill-rule:nonzero;fill:rgb(100%,100%,100%);fill-opacity:1;" d="M 134.722656 37.660156 C 135.375 37.660156 135.921875 37.886719 135.980469 38.617188 L 135.53125 38.617188 C 135.488281 38.183594 135.105469 38.039062 134.679688 38.039062 C 134.292969 38.039062 133.902344 38.191406 133.902344 38.59375 C 133.902344 39.105469 134.570312 39.054688 135.503906 39.386719 C 135.859375 39.507812 136.089844 39.820312 136.089844 40.191406 C 136.089844 40.964844 135.367188 41.316406 134.636719 41.316406 C 134.039062 41.316406 133.351562 41.035156 133.339844 40.273438 L 133.785156 40.273438 C 133.820312 40.785156 134.273438 40.9375 134.742188 40.9375 C 135.179688 40.9375 135.640625 40.730469 135.640625 40.25 C 135.640625 39.757812 135.097656 39.671875 134.550781 39.550781 C 134.007812 39.417969 133.457031 39.261719 133.457031 38.621094 C 133.457031 37.90625 134.113281 37.660156 134.722656 37.660156 "/>
<path style=" stroke:none;fill-rule:nonzero;fill:rgb(100%,100%,100%);fill-opacity:1;" d="M 137.296875 37.765625 L 137.296875 41.214844 L 136.886719 41.214844 L 136.886719 37.765625 Z M 137.332031 36.765625 L 136.851562 36.765625 L 136.851562 36.253906 L 137.332031 36.253906 L 137.332031 36.765625 "/>
<path style=" stroke:none;fill-rule:nonzero;fill:rgb(100%,100%,100%);fill-opacity:1;" d="M 138.703125 38.140625 L 138.015625 38.140625 L 138.015625 37.765625 L 138.703125 37.765625 L 138.703125 37.027344 L 139.117188 36.847656 L 139.117188 37.765625 L 139.898438 37.765625 L 139.898438 38.140625 L 139.117188 38.140625 L 139.117188 40.449219 C 139.109375 40.765625 139.273438 40.9375 139.589844 40.9375 C 139.714844 40.9375 139.839844 40.929688 139.949219 40.898438 L 139.949219 41.253906 C 139.816406 41.289062 139.667969 41.316406 139.527344 41.316406 C 138.65625 41.316406 138.703125 40.757812 138.703125 40.292969 L 138.703125 38.140625 "/>
<path style=" stroke:none;fill-rule:nonzero;fill:rgb(100%,100%,100%);fill-opacity:1;" d="M 140.902344 37.765625 L 142.0625 40.648438 L 143.21875 37.765625 L 143.664062 37.765625 L 141.761719 42.53125 L 141.308594 42.53125 L 141.828125 41.214844 L 140.402344 37.765625 L 140.902344 37.765625 "/>
<path style=" stroke:none;fill-rule:nonzero;fill:rgb(100%,100%,100%);fill-opacity:1;" d="M 147.546875 38.039062 C 146.714844 38.039062 146.386719 38.847656 146.386719 39.488281 C 146.386719 40.128906 146.714844 40.9375 147.546875 40.9375 C 148.378906 40.9375 148.707031 40.128906 148.707031 39.488281 C 148.707031 38.847656 148.378906 38.039062 147.546875 38.039062 Z M 149.152344 39.488281 C 149.152344 40.394531 148.644531 41.316406 147.546875 41.316406 C 146.445312 41.316406 145.9375 40.394531 145.9375 39.488281 C 145.9375 38.582031 146.445312 37.660156 147.546875 37.660156 C 148.644531 37.660156 149.152344 38.582031 149.152344 39.488281 "/>
<path style=" stroke:none;fill-rule:nonzero;fill:rgb(100%,100%,100%);fill-opacity:1;" d="M 150.113281 41.214844 L 150.113281 38.140625 L 149.421875 38.140625 L 149.421875 37.765625 L 150.113281 37.765625 L 150.113281 37.027344 C 150.113281 36.4375 150.355469 36.167969 150.945312 36.167969 C 151.078125 36.167969 151.214844 36.21875 151.335938 36.246094 L 151.335938 36.574219 C 151.257812 36.5625 151.167969 36.546875 151.085938 36.546875 C 150.519531 36.546875 150.507812 36.828125 150.527344 37.324219 L 150.527344 37.765625 L 151.3125 37.765625 L 151.3125 38.140625 L 150.527344 38.140625 L 150.527344 41.214844 L 150.113281 41.214844 "/>
<path style=" stroke:none;fill-rule:nonzero;fill:rgb(100%,100%,100%);fill-opacity:1;" d="M 116.40625 43.75 L 114.804688 43.75 L 114.804688 43.339844 L 118.429688 43.339844 L 118.429688 43.75 L 116.855469 43.75 L 116.855469 48.300781 L 116.40625 48.300781 L 116.40625 43.75 "/>
<path style=" stroke:none;fill-rule:nonzero;fill:rgb(100%,100%,100%);fill-opacity:1;" d="M 120.609375 46.292969 C 120.5625 45.625 120.203125 45.125 119.492188 45.125 C 118.816406 45.125 118.460938 45.6875 118.402344 46.292969 Z M 118.390625 46.671875 C 118.402344 47.40625 118.742188 48.023438 119.585938 48.023438 C 120.074219 48.023438 120.480469 47.675781 120.582031 47.199219 L 121.015625 47.199219 C 120.804688 48.023438 120.289062 48.402344 119.457031 48.402344 C 118.425781 48.402344 117.945312 47.515625 117.945312 46.574219 C 117.945312 45.640625 118.460938 44.746094 119.484375 44.746094 C 120.636719 44.746094 121.058594 45.59375 121.058594 46.671875 L 118.390625 46.671875 "/>
<path style=" stroke:none;fill-rule:nonzero;fill:rgb(100%,100%,100%);fill-opacity:1;" d="M 124.074219 45.910156 C 124.039062 45.378906 123.703125 45.125 123.132812 45.125 C 122.5 45.125 122.105469 45.785156 122.105469 46.570312 C 122.105469 47.359375 122.5 48.023438 123.132812 48.023438 C 123.667969 48.023438 124.039062 47.695312 124.074219 47.222656 L 124.519531 47.222656 C 124.410156 48.011719 123.957031 48.402344 123.171875 48.402344 C 122.140625 48.402344 121.660156 47.515625 121.660156 46.574219 C 121.660156 45.640625 122.175781 44.746094 123.199219 44.746094 C 123.90625 44.746094 124.484375 45.171875 124.519531 45.910156 L 124.074219 45.910156 "/>
<path style=" stroke:none;fill-rule:nonzero;fill:rgb(100%,100%,100%);fill-opacity:1;" d="M 125.613281 45.371094 L 125.625 45.371094 C 125.867188 44.945312 126.257812 44.746094 126.703125 44.746094 C 127.832031 44.746094 127.921875 45.742188 127.921875 46.144531 L 127.921875 48.300781 L 127.507812 48.300781 L 127.507812 46.074219 C 127.507812 45.476562 127.164062 45.125 126.601562 45.125 C 125.921875 45.125 125.613281 45.695312 125.613281 46.3125 L 125.613281 48.300781 L 125.199219 48.300781 L 125.199219 43.339844 L 125.613281 43.339844 L 125.613281 45.371094 "/>
<path style=" stroke:none;fill-rule:nonzero;fill:rgb(100%,100%,100%);fill-opacity:1;" d="M 129.148438 48.300781 L 128.738281 48.300781 L 128.738281 45.625 C 128.738281 45.359375 128.71875 45.085938 128.703125 44.851562 L 129.128906 44.851562 L 129.148438 45.359375 L 129.164062 45.371094 C 129.402344 44.945312 129.796875 44.746094 130.242188 44.746094 C 131.367188 44.746094 131.457031 45.742188 131.457031 46.144531 L 131.457031 48.300781 L 131.046875 48.300781 L 131.046875 46.074219 C 131.046875 45.476562 130.703125 45.125 130.140625 45.125 C 129.460938 45.125 129.148438 45.695312 129.148438 46.3125 L 129.148438 48.300781 "/>
<path style=" stroke:none;fill-rule:nonzero;fill:rgb(100%,100%,100%);fill-opacity:1;" d="M 133.828125 45.125 C 132.996094 45.125 132.667969 45.9375 132.667969 46.574219 C 132.667969 47.214844 132.996094 48.023438 133.828125 48.023438 C 134.660156 48.023438 134.988281 47.214844 134.988281 46.574219 C 134.988281 45.9375 134.660156 45.125 133.828125 45.125 Z M 135.4375 46.574219 C 135.4375 47.480469 134.929688 48.402344 133.828125 48.402344 C 132.730469 48.402344 132.222656 47.480469 132.222656 46.574219 C 132.222656 45.667969 132.730469 44.746094 133.828125 44.746094 C 134.929688 44.746094 135.4375 45.667969 135.4375 46.574219 "/>
<path style=" stroke:none;fill-rule:nonzero;fill:rgb(100%,100%,100%);fill-opacity:1;" d="M 136.140625 48.300781 L 136.554688 48.300781 L 136.554688 43.339844 L 136.140625 43.339844 Z M 136.140625 48.300781 "/>
<path style=" stroke:none;fill-rule:nonzero;fill:rgb(100%,100%,100%);fill-opacity:1;" d="M 138.882812 45.125 C 138.050781 45.125 137.722656 45.9375 137.722656 46.574219 C 137.722656 47.214844 138.050781 48.023438 138.882812 48.023438 C 139.714844 48.023438 140.042969 47.214844 140.042969 46.574219 C 140.042969 45.9375 139.714844 45.125 138.882812 45.125 Z M 140.492188 46.574219 C 140.492188 47.480469 139.984375 48.402344 138.882812 48.402344 C 137.785156 48.402344 137.277344 47.480469 137.277344 46.574219 C 137.277344 45.667969 137.785156 44.746094 138.882812 44.746094 C 139.984375 44.746094 140.492188 45.667969 140.492188 46.574219 "/>
<path style=" stroke:none;fill-rule:nonzero;fill:rgb(100%,100%,100%);fill-opacity:1;" d="M 142.605469 45.125 C 141.855469 45.125 141.539062 45.882812 141.539062 46.515625 C 141.539062 47.144531 141.863281 47.910156 142.617188 47.910156 C 143.40625 47.910156 143.710938 47.171875 143.710938 46.5 C 143.710938 45.839844 143.347656 45.125 142.605469 45.125 Z M 143.730469 44.851562 L 144.15625 44.851562 C 144.144531 45.085938 144.125 45.359375 144.125 45.625 L 144.125 47.695312 C 144.125 48.382812 144.15625 49.101562 143.394531 49.460938 C 143.121094 49.59375 142.933594 49.617188 142.609375 49.617188 C 141.988281 49.617188 141.246094 49.40625 141.246094 48.691406 L 141.691406 48.691406 C 141.738281 49.101562 142.226562 49.242188 142.667969 49.242188 C 143.203125 49.242188 143.699219 48.863281 143.710938 48.285156 L 143.710938 47.640625 L 143.699219 47.640625 C 143.496094 48.046875 143.023438 48.285156 142.578125 48.285156 C 141.539062 48.285156 141.09375 47.496094 141.09375 46.546875 C 141.09375 45.613281 141.511719 44.746094 142.5625 44.746094 C 143.066406 44.746094 143.421875 44.988281 143.699219 45.386719 L 143.710938 45.359375 L 143.730469 44.851562 "/>
<path style=" stroke:none;fill-rule:nonzero;fill:rgb(100%,100%,100%);fill-opacity:1;" d="M 145.175781 44.851562 L 146.335938 47.734375 L 147.488281 44.851562 L 147.9375 44.851562 L 146.03125 49.617188 L 145.578125 49.617188 L 146.101562 48.300781 L 144.671875 44.851562 L 145.175781 44.851562 "/>
<path style=" stroke:none;fill-rule:nonzero;fill:rgb(100%,100%,100%);fill-opacity:1;" d="M 96.386719 48.300781 L 96.386719 36.75 L 99.460938 36.75 L 99.460938 34.996094 L 96.386719 34.996094 L 96.386719 32.847656 C 96.386719 31.308594 97.128906 31.046875 98.5625 31.046875 C 98.984375 31.046875 99.410156 31.101562 99.832031 31.125 L 99.832031 29.035156 C 99.242188 28.898438 98.640625 28.769531 98.03125 28.769531 C 95.644531 28.769531 93.867188 29.964844 93.867188 32.511719 L 93.867188 34.996094 L 91.273438 34.996094 L 91.273438 36.75 L 93.867188 36.75 L 93.867188 48.300781 L 96.386719 48.300781 "/>
<path style=" stroke:none;fill-rule:nonzero;fill:rgb(100%,100%,100%);fill-opacity:1;" d="M 100.90625 34.996094 L 100.90625 36.75 L 103.1875 36.75 L 103.1875 45.226562 C 103.1875 46.996094 103.214844 48.695312 106.953125 48.695312 C 107.535156 48.695312 108.082031 48.640625 108.675781 48.539062 L 108.675781 46.605469 C 108.265625 46.703125 107.75 46.761719 107.351562 46.761719 C 106.449219 46.761719 105.707031 46.308594 105.707031 45.359375 L 105.707031 36.75 L 108.78125 36.75 L 108.78125 34.996094 L 105.707031 34.996094 L 105.707031 31.367188 L 103.1875 32.160156 L 103.1875 35 L 100.90625 34.996094 "/>
<path style=" stroke:none;fill-rule:nonzero;fill:rgb(100%,100%,100%);fill-opacity:1;" d="M 55.488281 31.445312 L 59.40625 31.445312 C 63.828125 31.445312 65.664062 34.78125 65.664062 38.734375 C 65.664062 42.6875 63.828125 46.023438 59.40625 46.023438 L 55.488281 46.023438 Z M 52.832031 48.300781 L 59.40625 48.300781 C 67.589844 48.300781 68.449219 41.371094 68.449219 38.734375 C 68.449219 36.09375 67.589844 29.164062 59.40625 29.164062 L 52.832031 29.164062 L 52.832031 48.300781 "/>
</g>
</svg>
