{
  "images" : [
    {
      "idiom" : "universal",
      "scale" : "1x",
      "filename" : "bg.PNG"
    },
    {
      "idiom" : "universal",
      "scale" : "2x",
      "filename" : "bg@2x.PNG"
    },
    {
      "idiom" : "universal",
      "scale" : "3x",
      "filename" : "bg@3x.PNG"
    }
  ],
  "info" : {
    "version" : 1,
    "author" : "xcode"
  }
}