[
    {   "title": "Business Development & Sales",
        "location": "Bangalore",
        "overview": "We are looking for business development executive to work closely with our marketing team to generate the sales. Your job is to identify or follow up with the leads to on board clients. To be successful in this role, you should have previous experience developing leads from marketing campaigns and meeting sales quotas. ",
        "responsibilities": [
            "Qualify leads from marketing campaigns as sales opportunities",
            "Creating sales pitch and presentations for on boarding the clients",
            "Seek new business opportunities and doing the market research",
            "Contacting the clients through calls or emails and build a long term relationship"
        ],
        "skills": [
            "2+ years of work experience as a Business Development Representative, Sales Account Executive or similar role",
            "Hands on experience with the CRM software, email follow ups and calls",
            "Excellent communication and negotiation skills",
            "BSc degree in Marketing, Business Administration or relevant field"
        ]
    },
    {   "title": "Full Stack Developer",
        "location": "Bangalore",
        "overview": "We are looking for a Full Stack Developer to create websites and mobile applications. As a Full Stack Developer, you should be comfortable around both front-end and back-end coding languages, development frameworks and third-party libraries. You’ll be part of a team that’s responsible for the full product development which includes web, app and data management.",
        "responsibilities": [
            "Work with development teams and product manager to design websites or applications",
            "Developing user side and client side dashboards",
            "Write effective API's and Technical documentations",
            "Build features and applications with a mobile responsive design"
        ],
        "skills": [
            "2+ years of proven experience as a Full Stack Developer or similar role",
            "Knowledge of multiple front-end languages and libraries (e.g. HTML/ CSS, JavaScript, XML, jQuery)",
            "Knowledge of multiple back-end languages (e.g. C#, Java, Python) and JavaScript frameworks (e.g. Angular, React, Node.js)",
            "Familiarity with databases (e.g. MySQL, MongoDB), web servers (e.g. Apache) and UI/UX design"
        ]
    },
    {   "title": "Graphic Designer",
        "location": "Bangalore",
        "overview": "We are looking for a Graphic Designer to create engaging and on-brand graphics for a variety of media. You will be responsible for the creative images, UI and UX works on all of our products. The person should have skills to develop the overall layout and production design for applications such as advertisements, web layours, infographics, and reports.",
        "responsibilities": [
            "Use digital illustration, photo editing software, and layout software to create designs",
            "Working as per the requirements of the team",
            "Must cover UI & UX changes whenever is necessary",
            "Should be creative in planning and executing social media campaigns"
        ],
        "skills": [
            "1+ years of proven experience as a graphic designer or UI UX designer",
            "Hand on experience with Adobe photoshop, XD and other related tools"
        ]
    },