[
    {
        "img": "https://picsum.photos/id/1011/475/500",
        "type": "small",
        "side": "top",
        "shortAddress": "Lady on the boat"
    },
    {
        "img": "https://picsum.photos/id/1015/670/630",
        "type": "big",
        "side": "left",
        "shortAddress": "Mountains and rivers"
    },
    {
        "img": "https://picsum.photos/id/1006/475/500",
        "type": "small",
        "side": "right",
        "shortAddress": "Mountain cliff"
    },
    {
        "img": "https://picsum.photos/id/1010/670/630",
        "type": "big",
        "side": "left",
        "shortAddress": "Holy Bible!"
    }
]