{
    "title": "Website Terms and Conditions of Use",
    "terms": [
        {
            "name": "Terms",
            "content": "By accessing this Website, accessible from https://fairpe.com/, you are agreeing to be bound by these Website Terms and Conditions of Use and agree that you are responsible for the agreement with any applicable local laws. If you disagree with any of these terms, you are prohibited from accessing this site. The materials contained in this Website are protected by copyright and trade mark law. These Terms of Service has been created with the help of the Terms of Service Generator and the Terms & Conditions Example."
        },
        {
            "name": "Use License",
            "subtitle": "Permission is granted to temporarily download one copy of the materials on FairPe's Website for personal, non-commercial transitory viewing only. This is the grant of a license, not a transfer of title, and under this license you may not:",
            "licenceItems": [
                "modify or copy the materials;",
                "use the materials for any commercial purpose or for any public display;",
                "attempt to reverse engineer any software contained on FairPe's Website;",
                "remove any copyright or other proprietary notations from the materials; or",
                "transferring the materials to another person or 'mirror' the materials on any other server."
            ],
            "termination": "This will let FairPe to terminate upon violations of any of these restrictions. Upon termination, your viewing right will also be terminated and you should destroy any downloaded materials in your possession whether it is printed or electronic format."
        },
        {
            "name": "Disclaimer",
            "content": "All the materials on FairPe’s Website are provided 'as is'. FairPe makes no warranties, may it be expressed or implied, therefore negates all other warranties. Furthermore, FairPe does not make any representations concerning the accuracy or reliability of the use of the materials on its Website or otherwise relating to such materials or any sites linked to this Website."
        },
        {
            "name":"Limitations",
            "content": "FairPe or its suppliers will not be hold accountable for any damages that will arise with the use or inability to use the materials on FairPe’s Website, even if FairPe or an authorize representative of this Website has been notified, orally or written, of the possibility of such damage. Some jurisdiction does not allow limitations on implied warranties or limitations of liability for incidental damages, these limitations may not apply to you."
        },
        {
            "name": "Revisions and Errata",
            "content": "The materials appearing on FairPe’s Website may include technical, typographical, or photographic errors. FairPe will not promise that any of the materials in this Website are accurate, complete, or current. FairPe may change the materials contained on its Website at any time without notice. FairPe does not make any commitment to update the materials."
        },
        {
            "name": "Links",
            "content": "FairPe has not reviewed all of the sites linked to its Website and is not responsible for the contents of any such linked site. The presence of any link does not imply endorsement by FairPe of the site. The use of any linked website is at the user’s own risk."
        },
        {
            "name": "Site Terms of Use Modifications",
            "content": "FairPe may revise these Terms of Use for its Website at any time without prior notice. By using this Website, you are agreeing to be bound by the current version of these Terms and Conditions of Use."
        },
        {
            "name": "Your Privacy",
            "content": "Please read our Privacy Policy."
        },
        {
            "name": "Governing Law",
            "content": "Any claim related to FairPe's Website shall be governed by the laws of in without regards to its conflict of law provisions."
        }
    ]
}