{
  "header": {
    "navigation": [
      {
        "title": "Проекты",
        "url": "/",
        "subNavigation": [
          [
            {
              "title": "Краснодар",
              "url": "/"
            },
            {
              "title": "Краски",
              "url": "/"
            },
            {
              "title": "Славянка",
              "url": "/"
            },
            {
              "title": "Центральный",
              "url": "/"
            }
          ],
          [
            {
              "title": "Побережье",
              "url": "/"
            },
            {
              "title": "Botanica",
              "url": "/"
            },
            {
              "title": "Sun Hills",
              "url": "/"
            }
          ],
          [
            {
              "title": "Тайланд",
              "url": "/"
            },
            {
              "title": "Proxima",
              "url": "/"
            },
            {
              "title": "Proxima_2",
              "url": "/"
            },
            {
              "title": "Proxima_3",
              "url": "/"
            },
            {
              "title": "Proxima_4",
              "url": "/"
            }
          ],
          [
            {
              "title": "Адыгея",
              "url": "/"
            },
            {
              "title": "Ритм",
              "url": "/"
            },
            {
              "title": "Звёзды",
              "url": "/"
            }
          ]
        ]
      },
      {
        "title": "Недвижимость",
        "url": "/",
        "subNavigation": [
          [
            {
              "title": "Тест"
            }
          ],
          [
            {
              "title": "Тест1"
            }
          ]
        ]
      },
      {
        "title": "Как купить",
        "url": "/",
        "subNavigation": [
          [
            {
              "title": "Тест3"
            }
          ]
        ]
      },
      {
        "title": "Акции",
        "url": "/"
      }
    ],
    "phone": "8 (800) 222-90-92",
    "favourite": {
      "url": "/favorites.html"
    },
    "menu": "menu"
  }
}
