<svg viewBox="0 0 20 20" fill="none" xmlns="http://www.w3.org/2000/svg">
<path d="M10 7.2V10M17 10C17 13.866 13.866 17 10 17C6.13401 17 3 13.866 3 10C3 6.13401 6.13401 3 10 3C13.866 3 17 6.13401 17 10Z" stroke="#FF3333" stroke-linecap="round" stroke-linejoin="round"/>
<circle cx="10" cy="12.7915" r="0.5" fill="#FF3333"/>
</svg>
