{"questions": [
	{"que":"വജ്രാകൃതിയിൽ അമർത്തുക.","images":["kite","parachute","balloon","snowboard"],"ans":"kite"},
	{"que":"വജ്രാകൃതിയിലുള്ള വസ്തു  കണ്ടുപിടിക്കാമോ?","images":["trowel","spanner","gouge","saw"],"ans":"trowel"},
	{"que":"വജ്രാകൃതി കാണപ്പെടുന്നത് ഇവയിൽ ഏതിനാണ്?","images":["badam","burfi","chocolate","cupcake"],"ans":"burfi"},
	{"que":"വജ്രാകൃതിയിലുള്ള കടൽ  മീനിനെ കാണിച്ചുതരാമോ?","images":["crab","shrimp","stingray","starfish"],"ans":"stingray"}
	]
	}
