{"questions": [
	{"que":"ദീർഘ ചതുരം കണ്ടുപിടിക്കാമോ?","images":["framerect","frameoval","framecircle","frametri"],"ans":"framerect"},
	{"que":"ദീർഘ ചതുരത്തിൽ അമർത്തുക.","images":["chair","table","beachchair","roundtable"],"ans":"table"},
	{"que":"ഇതിൽ ദീർഘ ചതുരം ഏതാണ്? ","images":["arrow","blackboard","darts","ludopieces"],"ans":"blackboard"},
  {"que":"ദീർഘ ചതുരം കണ്ടുപിടിക്കാമോ?","images":["door","igloo","pyramid","frame"],"ans":"door"},
	{"que":"ദീർഘ ചതുരത്തിൽ അമർത്തുക.","images":["tablet","ironbox","clockhalf","blender"],"ans":"tablet"}
	]
	}
