{"findout":[
	
	{"engquestion":"Click on the options that you can touch.","engoptns":["Hot cup","Prickly fork","Thundering"],"enganswer1":"Hot cup","enganswer2":"Prickly fork","malquestion":"സ്പർശിക്കാൻ കഴിയുന്ന വസ്തുക്കളിൽ ക്ലിക്ക്  ചെയ്യുക.","maloptns":["ചൂട് കപ്പ്‌ ","മുള്ളുകരണ്ടി","ഇടിമുഴക്കം "],"malanswer1":"ചൂട് കപ്പ്‌ ","malanswer2":"മുള്ളുകരണ്ടി","answernum":"2","sound":"touch"},

	{"engquestion":"Click on the options that you can smell.","engoptns":["Candy","Fragrance","Cold glass"],"enganswer1":"Fragrance","malquestion":"ഗന്ധം നൽകുന്ന വസ്തുക്കളിൽ ക്ലിക്ക്  ചെയ്യുക .","maloptns":["മിഠായി","സുഗന്ധം","തണുത്ത ഗ്ലാസ്‌ "],"malanswer1":"സുഗന്ധം","answernum":"1","sound":"smell"},

	{"engquestion":"Click on the options that you can taste.","engoptns":["Tangy","Salty","Smoke"],"enganswer1":"Tangy","enganswer2":"Salty","malquestion":"രുചിക്കാൻ  കഴിയുന്ന വസ്തുക്കളിൽ ക്ലിക്ക്  ചെയ്യുക.","maloptns":["പുളിപ്പ് ","ഉപ്പ് ","പുക"],"malanswer1":"പുളിപ്പ് ","malanswer2":"ഉപ്പ് ","answernum":"2","sound":"taste"},

	{"engquestion":"Click on the options that you can touch.","engoptns":["Smoke","Hard nut","Fragrance"],"enganswer1":"Hard nut","malquestion":"സ്പർശിക്കാൻ കഴിയുന്ന വസ്തുക്കളിൽ ക്ലിക്ക്  ചെയ്യുക.","maloptns":["പുക","കട്ടിയുള്ള കായ്‌","സുഗന്ധം"],"malanswer1":"കട്ടിയുള്ള കായ്‌","answernum":"1","sound":"touch"},

	{"engquestion":"Click on the options that you can hear.","engoptns":["Aroma","Roaring","Tangy"],"enganswer1":"Roaring","malquestion":"ശബ്ദം കേൾക്കുവാൻ  കഴിയുന്ന വസ്തുക്കളിൽ ക്ലിക്ക്  ചെയ്യുക.","maloptns":["സൗരഭ്യം","ഗര്‍ജ്ജനം","പുളിപ്പ്"],"malanswer1":"ഗര്‍ജ്ജനം","answernum":"1","sound":"hear"},

	{"engquestion":"Click on the options that you can taste.","engoptns":["Bitter","Lemony","Sweaty"],"enganswer1":"Bitter","enganswer2":"Lemony","malquestion":"രുചിക്കാൻ  കഴിയുന്ന വസ്തുക്കളിൽ ക്ലിക്ക്  ചെയ്യുക.","maloptns":["കയ്പ്പ് ","ലെമണി ","വിയർപ്പുഗന്ധം"],"malanswer1":"കയ്പ്പ് ","malanswer2":"ലെമണി ","answernum":"2","sound":"taste"},

	{"engquestion":"Click on the options that you can hear.","engoptns":["Ringing","Hard nut","Thundering"],"enganswer1":"Ringing","enganswer2":"Thundering","malquestion":"ശബ്ദം കേൾക്കുവാൻ  കഴിയുന്ന വസ്തുക്കളിൽ ക്ലിക്ക്  ചെയ്യുക .","maloptns":["മുഴക്കം","കട്ടിയുള്ള കായ്‌","ഇടിമുഴക്കം"],"malanswer1":"മുഴക്കം","malanswer2":"ഇടിമുഴക്കം","answernum":"2","sound":"hear"},

	{"engquestion":"Click on the options that you can touch.","engoptns":["Cold glass","Pencil","Roaring"],"enganswer1":"Cold glass","enganswer2":"Pencil","malquestion":"സ്പർശിക്കാൻ കഴിയുന്ന വസ്തുക്കളിൽ ക്ലിക്ക്  ചെയ്യുക .","maloptns":["തണുത്ത ഗ്ലാസ്‌ ","പെൻസിൽ","ഗര്‍ജ്ജനം"],"malanswer1":"തണുത്ത ഗ്ലാസ്‌ ","malanswer2":"പെൻസിൽ","answernum":"2","sound":"touch"},

	{"engquestion":"Click on the options that you can smell.","engoptns":["Aroma","Burnt","Soft toy"],"enganswer1":"Aroma","enganswer2":"Burnt","malquestion":"ഗന്ധം നൽകുന്ന വസ്തുക്കളിൽ ക്ലിക്ക്  ചെയ്യുക .","maloptns":["സൗരഭ്യം","കരിഞ്ഞ","പാവ"],"malanswer1":"സൗരഭ്യം","malanswer2":"കരിഞ്ഞ","answernum":"2","sound":"smell"},

	{"engquestion":"Click on the options that you can hear.","engoptns":["Red chilly","Chirping","Croaking"],"enganswer1":"Chirping","enganswer2":"Croaking","malquestion":"ശബ്ദം കേൾക്കുവാൻ  കഴിയുന്ന വസ്തുക്കളിൽ ക്ലിക്ക്  ചെയ്യുക . ","maloptns":["ചുവപ്പ്  മുളക്" ,"ചിലപ്പ്","തവളക്കരച്ചില്‍"],"malanswer1":"ചിലപ്പ്","malanswer2":"തവളക്കരച്ചില്‍","answernum":"2","sound":"hear"},

	{"engquestion":"Click on the options that you can taste.","engoptns":["Soft toy","Candy","Chirping"],"enganswer1":"Candy","malquestion":"രുചിക്കാൻ  കഴിയുന്ന വസ്തുക്കളിൽ ക്ലിക്ക് ചെയ്യുക .","maloptns":["പാവ","മിഠായി","ചിലപ്പ്"],"malanswer1":"മിഠായി","answernum":"1","sound":"taste"},

	{"engquestion":"Click on the options that you can smell.","engoptns":["Candy","Sweaty","Bitter"],"enganswer1":"Sweaty","malquestion":"ഗന്ധം നൽകുന്ന വസ്തുക്കളിൽ ക്ലിക്ക്  ചെയ്യുക.","maloptns":["മിഠായി","വിയർപ്പുഗന്ധം","കയ്പ്പ് "],"malanswer1":"വിയർപ്പുഗന്ധം","answernum":"1","sound":"smell"}
	
]}
