{"questions":[
		{"que":"ഇതിൽ ഏതാണ് പച്ച  കാർ ?","images":["car1","car2","car4","car3"],"ans":"car3"},		
		{"que":"പച്ച ക്യാപ്സിക്കത്തിൽ അമർത്തുക.","images":["redcapsicum","greencapsicum","yellowcapsicum","goldcapsicum"],"ans":"greencapsicum"},
		{"que":"പച്ച  ആപ്പിൾ  കാണിച്ചു തരാമോ?","images":["yellowapple","greenapple","redapple","goldenapple"],"ans":"greenapple"},
		{"que":"പച്ച ഇലയിൽ അമർത്തുക .","images":["yellowleaf","greenleaf","orangeleaf","brownleaf"],"ans":"greenleaf"},
	{"que":"പച്ച പുൽച്ചാടിയെ കാണിച്ചുതരാമോ ?","images":["mantis2","mantis1","mantis4","mantis3"],"ans":"mantis1"}
		
]
}
