{"questions": [
	{"que":"ഇവയിൽ ആർക്കാണ് ത്രികോണാകൃതി ഉള്ളത്?","images":["angelfish","frogeyes","grasshopper","ladybug"],"ans":"angelfish"},
	{"que":"ത്രികോണാകൃതിയിലുള്ള ഭക്ഷണ സാധനം ഇതിൽ ഏതാണ്?","images":["pizzaslice","bread","egg","walnut"],"ans":"pizzaslice"},
	{"que":"ത്രികോണാകൃതിയിൽ അമർത്തുക.","images":["waterfall","mountain","wall","beach"],"ans":"mountain"},
	{"que":"ത്രികോണാകൃതിയിലുള്ള ഇതൾ  അമർത്തുക.","images":["milkweed","bougainvillea","floral","flowers"],"ans":"bougainvillea"},
	{"que":"ഇതിൽ ആർക്കാണ് ത്രികോണാകൃതിയിലുള്ള  ചെവി ഉള്ളത്?","images":["dogear","rabbit","monkey","mouse"],"ans":"dogear"}
	]
	}
