{ 
    "questions":[
	
			{"item":"ഐസ്ക്രീം","items":["Chocolate","Vanila","Straberry"],"price":["35","40","45"]},
			{"item":"ബിസ്കറ്റ് ","items":["Little","Tiger","Goodday"],"price":["40","20","30"]},
			{"item":"ബോക്സ്‌ ","items":["Pencilbox1","Pencilbox","Pencilbox3"],"price":["50","100","75"]},
			{"item":"പാനീയം","items":["Pineapple","Mango","Orange"],"price":["20","22","18"]},
            {"item":"മിഠായി","items":["Jalebi","Ladoo","Peda"],"price":["8","7","10"]},
            {"item":"പേന","items":["Pen3","Pen1","Pen2"],"price":["5","15","20"]},
            {"item":"ബോൾ ","items":["Ball2","Ball3","Ball1"],"price":["60","30","100"]},
            {"item":"ബലൂണ്‍ ","items":["Balloon2","Balloon1","Balloon3"],"price":["60","75","25"]},
            {"item":"തൊപ്പി","items":["Hat2","Hat1","Hat3"],"price":["25","75","50"]},
            {"item":"കളിപ്പാട്ടം ","items":["Doll1","Doll2","Doll3"],"price":["150","100","50"]}
			]		
}

