{"questions":[
		{"que":"ഇതിൽ ഏതാണ് ചുവന്ന  കാർ ?","images":["car1","car2","car4","car3"],"ans":"car1"},		
		{"que":"ചുവന്ന  റോസിൽ  അമർത്തുക.","images":["redrose","rose","yellowrose","orangerose"],"ans":"redrose"},
		{"que":"ചുവന്ന ആപ്പിൾ  കാണിച്ചുതരാമോ?","images":["yellowapple","greenapple","apple","goldenapple"],"ans":"apple"},
		{"que":"ചുവന്ന ചിത്രശലഭത്തിൽ അമർത്തുക .","images":["yellowbutterfly","greenbutterfly","violetbutterfly","redbutterfly"],"ans":"redbutterfly"},
	{"que":"ചുവന്ന ബലൂൺ  കാണിച്ചുതരാമോ ?","images":["roseballoon","redballoon","blueballoon","brownballoon"],"ans":"redballoon"}
		
]
}
