{"questions": [
	{"que":"നക്ഷത്ര ആകൃതിയുള്ള പൂവ് ഇതിൽ ഏതാണ്?","images":["mosanda","rose","flower","flower2"],"ans":"mosanda"},
	{"que":"ഇവയിൽ  ഏതിനാണ് നക്ഷത്രാകൃതി  ഉള്ളത്?","images":["cardamon","badam","cashewnut","anise"],"ans":"anise"},
	{"que":"നക്ഷത്രാകൃതി  ഉള്ള കടൽ മീൻ കണ്ടുപിടിക്കാമോ?","images":["seahorse","starfish","shrimp","dolphin"],"ans":"starfish"},
	{"que":"ക്രിസ്ത്മസ് അലങ്കാരങ്ങളിൽ നക്ഷത്ര ആകൃതി ഉള്ള വസ്തു ഏതാണ്?","images":["bell","hat","star","gift"],"ans":"star"},
	{"que":"നക്ഷത്ര ആകൃതിയിലെ ഫലം ഇവയിൽ ഏതാണ്?","images":["starfruit","banana","sugarapple","pear"],"ans":"starfruit"}
	
	]
	}
