{"findout":[
		{"engquestion":"We can see butterflies with our ________ .","enganswer":"Eyes","engdes":"Yes, We can see butterflies with our eyes.","malquestion":"നാം ചിത്രശലഭങ്ങളെ കാണുന്നത് നമ്മുടെ ______ കൊണ്ടാണ് .","malanswer":"കണ്ണ്‍ ","maldes":"അതെ , നാം ചിത്രശലഭങ്ങളെ കാണുന്നത് നമ്മുടെ  കണ്ണുകള്‍ കൊണ്ടാണ്.","sound":"butterflies"},
		{"engquestion":"We can taste sweet candy with our ________ .","enganswer":"Tongue","engdes":"Yes, We can taste sweet candy with our tongue.","malquestion":"നാം മിഠായിയുടെ മധുരം അറിയുന്നത് നമ്മുടെ _______ ഉപയോഗിച്ചാണ്.","malanswer":"നാവ്‌","maldes":"അതെ , നാം മിഠായിയുടെ മധുരം അറിയുന്നത് നമ്മുടെ നാവ്    ഉപയോഗിച്ചാണ്.","sound":"candy"},
		{"engquestion":"We can touch cold milk with our ________ .","enganswer":"Hand","engdes":"Yes, We can touch cold milk with our hand.","malquestion":"നാം തണുത്ത പാലിനെ തൊട്ട് മനസ്സിലാക്കുന്നത്  നമ്മുടെ _______ ഉപയോഗിച്ചാണ്.","malanswer":"കൈ","maldes":"അതെ , നാം തണുത്ത പാലിനെ തൊട്ട് മനസ്സിലാക്കുന്നത് നമ്മുടെ കൈ ഉപയോഗിച്ചാണ്.","sound":"coldmilk"},
		{"engquestion":"We can smell fragrance with our ________ .","enganswer":"Nose","engdes":"Yes, We can smell fragrance with our nose.","malquestion":"നാം സുഗന്ധം അറിയുന്നത്  നമ്മുടെ _______ ഉപയോഗിച്ചാണ്. ","malanswer":"മൂക്ക്","maldes":"അതെ , നാം സുഗന്ധം അറിയുന്നത്  നമ്മുടെ  മൂക്ക്  ഉപയോഗിച്ചാണ്.","sound":"fragrance"},
		{"engquestion":"We can see the sky with our ________ .","enganswer":"Eyes","engdes":"Yes, We can see the sky with our eyes.","malquestion":"നാം ആകാശത്തെ കാണുന്നത് നമ്മുടെ _______ കൊണ്ടാണ് .","malanswer":"കണ്ണ്‍ ","maldes":"അതെ , നാം ആകാശത്തെ കാണുന്നത് നമ്മുടെ  കണ്ണുകള്‍ കൊണ്ടാണ്.","sound":"sky"},
		{"engquestion":"We can hear the bell with our ________ .","enganswer":"Ears","engdes":"Yes, We can hear the bell with our ears.","malquestion":"നാം മണിയുടെ ശബ്ദം കേള്‍ക്കുന്നത് നമ്മുടെ ______ ഉപയോഗിച്ചാണ്.","malanswer":"ചെവി","maldes":"അതെ ,നാം മണിയുടെ ശബ്ദം കേള്‍ക്കുന്നത് നമ്മുടെ  ചെവികള്‍  ഉപയോഗിച്ചാണ്.","sound":"bell"},
		{"engquestion":"We can smell rotten fruit with our _______ .","enganswer":"Nose","engdes":"Yes, We can smell rotten fruit with our nose.","malquestion":"നാം അഴുകിയ പഴത്തിന്റെ ദുര്‍ഗന്ധം അറിയുന്നത് നമ്മുടെ ______ ഉപയോഗിച്ചാണ്.","malanswer":"മൂക്ക്","maldes":"അതെ , നാം അഴുകിയ പഴത്തിന്റെ ദുര്‍ഗന്ധം അറിയുന്നത് നമ്മുടെ  മൂക്ക്   ഉപയോഗിച്ചാണ്.","sound":"rotten"},
		{"engquestion":"We can hear horns with our ________ .","enganswer":"Ears","engdes":"Yes, We can hear horns with our ears.","malquestion":"നാം ഹോണിന്റെ ശബ്ദം കേള്‍ക്കുന്നത്   നമ്മുടെ _______ ഉപയോഗിച്ചാണ്.","malanswer":"ചെവി","maldes":"അതെ ,നാം ഹോണിന്റെ ശബ്ദം കേള്‍ക്കുന്നത്  നമ്മുടെ ചെവികള്‍ ഉപയോഗിച്ചാണ്.","sound":"horns"}

]
}
