-------------------------------------------------------------------------------
Test set: com.example.SelectionSortTest
-------------------------------------------------------------------------------
Tests run: 4, Failures: 0, Errors: 0, Skipped: 0, Time elapsed: 0.012 s - in com.example.SelectionSortTest
