{
    "KPlugin": {
        "Authors": [
            {
                "Email": "kexi@kde.org",
                "Name": "Kexi Team",
                "Name[ca@valencia]": "L'equip del Kexi",
                "Name[ca]": "L'equip del Kexi",
                "Name[cs]": "Tým Kexi",
                "Name[de]": "Kexi-Team",
                "Name[el]": "Ομάδα Kexi",
                "Name[en_GB]": "Kexi Team",
                "Name[es]": "El equipo de Kexi",
                "Name[et]": "Kexi meeskond",
                "Name[fi]": "Kexi-työryhmä",
                "Name[fr]": "L'équipe Kexi",
                "Name[gl]": "Equipo de Kexi",
                "Name[ia]": "Equipa de Kexi",
                "Name[it]": "La squadra di Kexi",
                "Name[ko]": "Kexi 팀",
                "Name[nl]": "Het team van Kexi",
                "Name[nn]": "Kexi-gruppa",
                "Name[pl]": "Zespół Kexi",
                "Name[pt]": "Equipa do Kexi",
                "Name[pt_BR]": "Equipe do Kexi",
                "Name[ru]": "Команда разработчиков Kexi",
                "Name[sk]": "Tím Kexi",
                "Name[sv]": "Kexi-gruppen",
                "Name[tr]": "Kexi Ekibi",
                "Name[uk]": "Команда Kexi",
                "Name[x-test]": "xxKexi Teamxx",
                "Name[zh_CN]": "Kexi 团队",
                "Name[zh_TW]": "Kexi 團隊"
            }
        ],
        "Category": "",
        "Dependencies": [],
        "Description": "KDb driver for handling xBase databases",
        "Description[ca@valencia]": "Controlador del KDb per a gestionar bases de dades xBase",
        "Description[ca]": "Controlador del KDb per a gestionar bases de dades xBase",
        "Description[cs]": "Ovladač KDb pro práci s databázemi xBase",
        "Description[de]": "KDb-Treiber für xBase",
        "Description[el]": "KDb oδηγός για χειρισμό βάσεων δεδομένων xBase",
        "Description[en_GB]": "KDb driver for handling xBase databases",
        "Description[es]": "Controlador de KDb para manejar bases de datos xBase",
        "Description[et]": "KDb draiver xBase'i andmebaaside käitlemiseks",
        "Description[fi]": "KDb-ajuri xBase-tietokantojen käsittelyyn",
        "Description[fr]": "Pilote KDb de gestion des bases de données xBase",
        "Description[gl]": "Controlador de KDb para manexar bases de datos xBase.",
        "Description[ia]": "Driver de KDb per manear bases de datos de xBase",
        "Description[it]": "Driver KDb per la gestione di banche dati xBase",
        "Description[ko]": "xBase 데이터베이스를 처리하기 위한 KDb 드라이버",
        "Description[nl]": "KDb-stuurprogramma for behandeling van xBase databases",
        "Description[nn]": "KDb-drivar for xBase-databasar",
        "Description[pl]": "Sterownik KDb do obsługi baz danych xBase",
        "Description[pt]": "Controlador do KDb para lidar com bases de dados xBase",
        "Description[pt_BR]": "Driver do KDb para lidar com bancos de dados xBase",
        "Description[sk]": "KDb ovládač na spracovanie databáz xBase",
        "Description[sv]": "Kdb-drivrutin för att hantera xBase-databaser",
        "Description[tr]": "xBase veritabanlarını kullanabilmek için KDb sürücüsü",
        "Description[uk]": "Драйвер KDb для роботи з базами даних xBase",
        "Description[x-test]": "xxKDb driver for handling xBase databasesxx",
        "Description[zh_CN]": "处理 xBase 数据库的 KDb 驱动",
        "Description[zh_TW]": "處理 xBase 資料庫的 KDb 驅動",
        "EnabledByDefault": true,
        "Icon": "",
        "Id": "org.kde.kdb.xbase",
        "License": "LGPL",
        "MimeTypes": [],
        "Name": "xBase",
        "Name[ca@valencia]": "xBase",
        "Name[ca]": "xBase",
        "Name[cs]": "xBase",
        "Name[de]": "xBase",
        "Name[el]": "xBase",
        "Name[en_GB]": "xBase",
        "Name[es]": "xBase",
        "Name[et]": "xBase",
        "Name[fi]": "xBase",
        "Name[fr]": "xBase",
        "Name[gl]": "xBase",
        "Name[ia]": "xBase",
        "Name[it]": "xBase",
        "Name[ko]": "xBase",
        "Name[nl]": "xBase",
        "Name[nn]": "xBase",
        "Name[pl]": "xBase",
        "Name[pt]": "xBase",
        "Name[pt_BR]": "xBase",
        "Name[ru]": "xBase",
        "Name[sk]": "xBase",
        "Name[sv]": "xBase",
        "Name[tr]": "xBase",
        "Name[uk]": "xBase",
        "Name[x-test]": "xxxBasexx",
        "Name[zh_CN]": "xBase",
        "Name[zh_TW]": "xBase",
        "ServiceTypes": [
            "KDb/Driver"
        ],
        "Version": "3.3",
        "Website": "https://kexi-project.org"
    },
    "X-KDb-FileBased": "true",
    "X-KDb-ImportingEnabled": "false"
}
