/* XPM */
static char * menu_inactive_xpm[] = {
"24 16 2 1",
" 	c None",
".	c #e8e8e7",
"........................",
"........................",
"........................",
"........................",
"........................",
"........................",
"........................",
"........................",
"........................",
"........................",
"........................",
"........................",
"........................",
"........................",
"........................",
"........................"};
