<?xml version="1.0" encoding="UTF-8" standalone="no"?>
<!-- Created with Inkscape (http://www.inkscape.org/) -->
<svg
   xmlns:dc="http://purl.org/dc/elements/1.1/"
   xmlns:cc="http://creativecommons.org/ns#"
   xmlns:rdf="http://www.w3.org/1999/02/22-rdf-syntax-ns#"
   xmlns:svg="http://www.w3.org/2000/svg"
   xmlns="http://www.w3.org/2000/svg"
   xmlns:xlink="http://www.w3.org/1999/xlink"
   xmlns:sodipodi="http://sodipodi.sourceforge.net/DTD/sodipodi-0.dtd"
   xmlns:inkscape="http://www.inkscape.org/namespaces/inkscape"
   width="48px"
   height="48px"
   id="svg7771"
   sodipodi:version="0.32"
   inkscape:version="0.46"
   sodipodi:docname="drawing-1.svg"
   inkscape:output_extension="org.inkscape.output.svg.inkscape">
  <defs
     id="defs7773">
    <linearGradient
       id="linearGradient9347">
      <stop
         id="stop9349"
         offset="0.0000000"
         style="stop-color:#7a7a7a;stop-opacity:1.0000000;" />
      <stop
         id="stop9351"
         offset="0.19801980"
         style="stop-color:#ebebeb;stop-opacity:1" />
      <stop
         id="stop9353"
         offset="0.59900987"
         style="stop-color:#b9b9b9;stop-opacity:1" />
      <stop
         id="stop9355"
         offset="1.0000000"
         style="stop-color:#878787;stop-opacity:1" />
    </linearGradient>
    <linearGradient
       inkscape:collect="always"
       xlink:href="#linearGradient9347"
       id="linearGradient7755"
       gradientUnits="userSpaceOnUse"
       gradientTransform="matrix(0.7312763,0,0,0.6969978,6.8679711,14.121765)"
       x1="23.100046"
       y1="38.296745"
       x2="23.143667"
       y2="46.03775" />
    <linearGradient
       id="linearGradient178">
      <stop
         style="stop-color:#ffffff;stop-opacity:0.0000000;"
         offset="0.0000000"
         id="stop179" />
      <stop
         style="stop-color:#d9d9d9;stop-opacity:1"
         offset="0.10827128"
         id="stop180" />
      <stop
         style="stop-color:#d9d9d9;stop-opacity:1"
         offset="0.92053902"
         id="stop181" />
      <stop
         style="stop-color:#ffffff;stop-opacity:0.0000000;"
         offset="1.0000000"
         id="stop182" />
    </linearGradient>
    <linearGradient
       inkscape:collect="always"
       xlink:href="#linearGradient178"
       id="linearGradient7832"
       gradientUnits="userSpaceOnUse"
       gradientTransform="matrix(3.1119049,0,0,9.1235758e-2,28.948795,19.750004)"
       x1="1.6422368"
       y1="117.8271"
       x2="15.343062"
       y2="117.8271" />
    <linearGradient
       inkscape:collect="always"
       xlink:href="#linearGradient272"
       id="linearGradient7834"
       gradientUnits="userSpaceOnUse"
       gradientTransform="matrix(9.3885418,0,0,0.2235361,29.130383,-45.865211)"
       x1="0.61210024"
       y1="372.57819"
       x2="5.0856376"
       y2="372.57819" />
    <linearGradient
       id="linearGradient272">
      <stop
         style="stop-color:#474747;stop-opacity:0.0000000;"
         offset="0.0000000"
         id="stop273" />
      <stop
         style="stop-color:#474747;stop-opacity:1.0000000;"
         offset="0.10000000"
         id="stop275" />
      <stop
         style="stop-color:#474747;stop-opacity:1.0000000;"
         offset="0.89999998"
         id="stop276" />
      <stop
         style="stop-color:#474747;stop-opacity:0.0000000;"
         offset="1.0000000"
         id="stop274" />
    </linearGradient>
    <linearGradient
       inkscape:collect="always"
       xlink:href="#linearGradient272"
       id="linearGradient7830"
       gradientUnits="userSpaceOnUse"
       gradientTransform="matrix(9.3885424,0,0,0.2235366,29.130395,-51.784906)"
       x1="0.61210024"
       y1="372.57819"
       x2="5.0856376"
       y2="372.57819" />
    <linearGradient
       inkscape:collect="always"
       id="linearGradient6704">
      <stop
         style="stop-color:#000000;stop-opacity:1;"
         offset="0"
         id="stop6706" />
      <stop
         style="stop-color:#000000;stop-opacity:0;"
         offset="1"
         id="stop6708" />
    </linearGradient>
    <radialGradient
       inkscape:collect="always"
       xlink:href="#linearGradient6704"
       id="radialGradient7753"
       gradientUnits="userSpaceOnUse"
       gradientTransform="matrix(1,0,0,0.1166667,0,348.72344)"
       cx="1120.375"
       cy="394.78125"
       fx="1120.375"
       fy="394.78125"
       r="20.625" />
    <linearGradient
       inkscape:collect="always"
       id="linearGradient4788-7">
      <stop
         style="stop-color:#ffffff;stop-opacity:1;"
         offset="0"
         id="stop4790-8" />
      <stop
         style="stop-color:#ffffff;stop-opacity:0;"
         offset="1"
         id="stop4792-6" />
    </linearGradient>
    <radialGradient
       inkscape:collect="always"
       xlink:href="#linearGradient4788-7"
       id="radialGradient8418"
       gradientUnits="userSpaceOnUse"
       gradientTransform="matrix(-2.3452637,1.0305331e-6,0.1678059,-1.6711651,1062.4349,156.14514)"
       cx="326.0206"
       cy="58"
       fx="326.0206"
       fy="58"
       r="12.5" />
    <linearGradient
       inkscape:collect="always"
       id="linearGradient5687">
      <stop
         style="stop-color:#ffffff;stop-opacity:1;"
         offset="0"
         id="stop5689" />
      <stop
         style="stop-color:#ffffff;stop-opacity:0;"
         offset="1"
         id="stop5691" />
    </linearGradient>
    <linearGradient
       inkscape:collect="always"
       xlink:href="#linearGradient5687"
       id="linearGradient8416"
       gradientUnits="userSpaceOnUse"
       gradientTransform="matrix(0.1923079,0,0,0.1854838,291.53839,45.645162)"
       x1="88"
       y1="44.5"
       x2="178"
       y2="202.5" />
    <linearGradient
       inkscape:collect="always"
       id="linearGradient4788">
      <stop
         style="stop-color:#ffffff;stop-opacity:1;"
         offset="0"
         id="stop4790" />
      <stop
         style="stop-color:#ffffff;stop-opacity:0;"
         offset="1"
         id="stop4792" />
    </linearGradient>
    <radialGradient
       inkscape:collect="always"
       xlink:href="#linearGradient4788"
       id="radialGradient8414"
       gradientUnits="userSpaceOnUse"
       gradientTransform="matrix(6.4215263,5.8880003e-8,-1.5792387e-8,1.4577864,-1775.5499,-25.551629)"
       cx="327.5"
       cy="58"
       fx="327.5"
       fy="58"
       r="12.5" />
    <linearGradient
       id="linearGradient2699">
      <stop
         style="stop-color:#af00af;stop-opacity:1"
         offset="0"
         id="stop2701" />
      <stop
         style="stop-color:#af00af;stop-opacity:1"
         offset="1"
         id="stop2703" />
    </linearGradient>
    <radialGradient
       inkscape:collect="always"
       xlink:href="#linearGradient2699"
       id="radialGradient8412"
       gradientUnits="userSpaceOnUse"
       gradientTransform="matrix(2.5089911,0,0,1.0747802,259.76908,42.963911)"
       cx="24.006104"
       cy="37.921711"
       fx="24.006104"
       fy="37.921711"
       r="19.00016" />
    <linearGradient
       inkscape:collect="always"
       id="linearGradient4646">
      <stop
         style="stop-color:#ffffff;stop-opacity:1;"
         offset="0"
         id="stop4648" />
      <stop
         style="stop-color:#ffffff;stop-opacity:0.1"
         offset="1"
         id="stop4650" />
    </linearGradient>
    <radialGradient
       inkscape:collect="always"
       xlink:href="#linearGradient4646"
       id="radialGradient8410"
       gradientUnits="userSpaceOnUse"
       gradientTransform="matrix(-3.0899695,-1.0606601,0.214115,-0.6237708,1278.6302,446.66487)"
       cx="314.36905"
       cy="75.283829"
       fx="314.36905"
       fy="75.283829"
       r="22.000002" />
    <linearGradient
       id="linearGradient5538"
       inkscape:collect="always">
      <stop
         id="stop5540"
         offset="0"
         style="stop-color:#555753;stop-opacity:1;" />
      <stop
         id="stop5542"
         offset="1"
         style="stop-color:#babdb6;stop-opacity:1" />
    </linearGradient>
    <linearGradient
       inkscape:collect="always"
       xlink:href="#linearGradient5538"
       id="linearGradient8408"
       gradientUnits="userSpaceOnUse"
       gradientTransform="translate(0,1)"
       x1="333.25"
       y1="97"
       x2="293"
       y2="54.01783" />
    <linearGradient
       inkscape:collect="always"
       id="linearGradient4654">
      <stop
         style="stop-color:#eeeeec;stop-opacity:1"
         offset="0"
         id="stop4656" />
      <stop
         style="stop-color:#babdb6;stop-opacity:1"
         offset="1"
         id="stop4658" />
    </linearGradient>
    <radialGradient
       inkscape:collect="always"
       xlink:href="#linearGradient4654"
       id="radialGradient8406"
       gradientUnits="userSpaceOnUse"
       gradientTransform="matrix(1.1263461,4.2035788,-1.0745854,0.2879343,23.033648,-1278.1206)"
       cx="314.30969"
       cy="61.654819"
       fx="314.30969"
       fy="61.654819"
       r="23" />
  </defs>
  <sodipodi:namedview
     id="base"
     pagecolor="#ffffff"
     bordercolor="#666666"
     borderopacity="1.0"
     inkscape:pageopacity="0.0"
     inkscape:pageshadow="2"
     inkscape:zoom="7"
     inkscape:cx="24"
     inkscape:cy="24"
     inkscape:current-layer="layer1"
     showgrid="true"
     inkscape:grid-bbox="true"
     inkscape:document-units="px"
     inkscape:window-width="641"
     inkscape:window-height="690"
     inkscape:window-x="242"
     inkscape:window-y="244" />
  <metadata
     id="metadata7776">
    <rdf:RDF>
      <cc:Work
         rdf:about="">
        <dc:format>image/svg+xml</dc:format>
        <dc:type
           rdf:resource="http://purl.org/dc/dcmitype/StillImage" />
      </cc:Work>
    </rdf:RDF>
  </metadata>
  <g
     id="layer1"
     inkscape:label="Layer 1"
     inkscape:groupmode="layer">
    <rect
       style="fill:#d9d9d9;fill-opacity:1;stroke:#707070;stroke-width:1;stroke-miterlimit:4;stroke-dasharray:none;stroke-opacity:1"
       id="rect8955"
       width="2.9998589"
       height="4.9998589"
       x="22.5"
       y="35.500164" />
    <g
       style="display:inline;enable-background:new"
       id="g10751"
       transform="translate(-296,-49.999997)">
      <rect
         ry="1.0625"
         rx="1.0625"
         y="55.51783"
         x="297.5"
         height="29.98217"
         width="45"
         id="rect2722"
         style="fill:url(#radialGradient8406);fill-opacity:1;stroke:url(#linearGradient8408);stroke-width:1.00000012;stroke-linecap:round;stroke-linejoin:round;stroke-miterlimit:4;stroke-dasharray:none;stroke-dashoffset:0.50000001;stroke-opacity:1" />
      <rect
         ry="0"
         rx="0"
         y="56.500004"
         x="298.5"
         height="28.017832"
         width="43.000004"
         id="rect4642"
         style="fill:none;stroke:url(#radialGradient8410);stroke-width:1.00000012;stroke-linecap:round;stroke-linejoin:round;stroke-miterlimit:4;stroke-dasharray:none;stroke-dashoffset:0.50000001;stroke-opacity:1;display:inline;enable-background:new" />
      <rect
         ry="0"
         rx="0"
         y="56.500004"
         x="298.5"
         height="28.017832"
         width="43.000004"
         id="rect5043"
         style="opacity:0.15;fill:none;stroke:#ffffff;stroke-width:1.00000012;stroke-linecap:round;stroke-linejoin:round;stroke-miterlimit:4;stroke-dasharray:none;stroke-dashoffset:0.50000001;stroke-opacity:1;display:inline;enable-background:new" />
      <rect
         style="fill:url(#radialGradient8412);fill-opacity:1;fill-rule:evenodd;stroke:#af00af;stroke-width:1px;stroke-linecap:butt;stroke-linejoin:miter;stroke-opacity:1;display:inline;enable-background:new"
         id="rect2716"
         width="41"
         height="24"
         x="299.5"
         y="58.500004" />
      <path
         sodipodi:nodetypes="ccccc"
         id="rect4785"
         d="M 330,59 L 340,59 L 340,82 L 318,82 L 330,59 z"
         style="opacity:0.24497992;fill:url(#radialGradient8414);fill-opacity:1;stroke:none" />
      <rect
         y="59"
         x="299.99994"
         height="23"
         width="40.000061"
         id="rect3466"
         style="opacity:0.15;fill:url(#linearGradient8416);fill-opacity:1;fill-rule:evenodd;stroke:none;display:inline;enable-background:new" />
      <path
         sodipodi:nodetypes="ccccc"
         id="path10688-3"
         d="M 317.0849,59.217901 L 324.79566,59.217901 L 315.63422,79.135653 L 311.85218,78.911858 L 317.0849,59.217901 L 317.0849,59.217901 L 317.0849,59.217901 z"
         style="opacity:0.24497992;fill:url(#radialGradient8418);fill-opacity:1;stroke:none;display:inline;enable-background:new" />
    </g>
    <rect
       style="opacity:1;fill:#eeeeec;fill-opacity:1;fill-rule:nonzero;stroke:none;stroke-width:1.5;stroke-linecap:square;stroke-linejoin:round;marker:none;marker-start:none;marker-mid:none;marker-end:none;stroke-miterlimit:4;stroke-dasharray:none;stroke-dashoffset:1.20000057;stroke-opacity:1;visibility:visible;display:inline;overflow:visible"
       id="rect4725"
       width="40"
       height="1"
       x="4.0000019"
       y="9.0000019" />
    <rect
       style="opacity:1;fill:#eeeeec;fill-opacity:1;fill-rule:nonzero;stroke:none;stroke-width:1.5;stroke-linecap:square;stroke-linejoin:round;marker:none;marker-start:none;marker-mid:none;marker-end:none;stroke-miterlimit:4;stroke-dasharray:none;stroke-dashoffset:1.20000057;stroke-opacity:1;visibility:visible;display:inline;overflow:visible"
       id="rect4727"
       width="10"
       height="9"
       x="15.000002"
       y="15.000003"
       rx="0.9375"
       ry="0.9375" />
    <rect
       style="opacity:1;fill:#af00af;fill-opacity:1;fill-rule:nonzero;stroke:none;stroke-width:1.5;stroke-linecap:square;stroke-linejoin:round;marker:none;marker-start:none;marker-mid:none;marker-end:none;stroke-miterlimit:4;stroke-dasharray:none;stroke-dashoffset:1.20000057;stroke-opacity:1;visibility:visible;display:inline;overflow:visible"
       id="rect4729"
       width="8"
       height="1"
       x="16"
       y="16.000004"
       rx="0"
       ry="0" />
    <rect
       style="opacity:1;fill:#eeeeec;fill-opacity:1;fill-rule:nonzero;stroke:none;stroke-width:1.5;stroke-linecap:square;stroke-linejoin:round;marker:none;marker-start:none;marker-mid:none;marker-end:none;stroke-miterlimit:4;stroke-dasharray:none;stroke-dashoffset:1.20000057;stroke-opacity:1;visibility:visible;display:inline;overflow:visible"
       id="rect4731"
       width="13"
       height="12"
       x="27"
       y="17.000004"
       rx="0.9375"
       ry="0.9375" />
    <rect
       style="opacity:1;fill:#af00af;fill-opacity:1;fill-rule:nonzero;stroke:none;stroke-width:1.5;stroke-linecap:square;stroke-linejoin:round;marker:none;marker-start:none;marker-mid:none;marker-end:none;stroke-miterlimit:4;stroke-dasharray:none;stroke-dashoffset:1.20000057;stroke-opacity:1;visibility:visible;display:inline;overflow:visible"
       id="rect4733"
       width="11"
       height="1"
       x="28"
       y="18.000004"
       rx="0"
       ry="0" />
    <rect
       style="opacity:1;fill:#eeeeec;fill-opacity:1;fill-rule:nonzero;stroke:none;stroke-width:1.5;stroke-linecap:square;stroke-linejoin:round;marker:none;marker-start:none;marker-mid:none;marker-end:none;stroke-miterlimit:4;stroke-dasharray:none;stroke-dashoffset:1.20000057;stroke-opacity:1;visibility:visible;display:inline;overflow:visible"
       id="rect4735"
       width="5"
       height="10"
       x="7.0000019"
       y="10.000003" />
    <rect
       style="opacity:1;fill:#d3d7cf;fill-opacity:1;fill-rule:nonzero;stroke:none;stroke-width:1.5;stroke-linecap:square;stroke-linejoin:round;marker:none;marker-start:none;marker-mid:none;marker-end:none;stroke-miterlimit:4;stroke-dasharray:none;stroke-dashoffset:1.20000057;stroke-opacity:1;visibility:visible;display:inline;overflow:visible"
       id="rect4737"
       width="3"
       height="1"
       x="8.0000019"
       y="10.000003" />
    <rect
       style="opacity:1;fill:#d3d7cf;fill-opacity:1;fill-rule:nonzero;stroke:none;stroke-width:1.5;stroke-linecap:square;stroke-linejoin:round;marker:none;marker-start:none;marker-mid:none;marker-end:none;stroke-miterlimit:4;stroke-dasharray:none;stroke-dashoffset:1.20000057;stroke-opacity:1;visibility:visible;display:inline;overflow:visible"
       id="rect4739"
       width="3"
       height="1"
       x="8.0000019"
       y="12.000003" />
    <rect
       style="opacity:1;fill:#d3d7cf;fill-opacity:1;fill-rule:nonzero;stroke:none;stroke-width:1.5;stroke-linecap:square;stroke-linejoin:round;marker:none;marker-start:none;marker-mid:none;marker-end:none;stroke-miterlimit:4;stroke-dasharray:none;stroke-dashoffset:1.20000057;stroke-opacity:1;visibility:visible;display:inline;overflow:visible"
       id="rect4741"
       width="3"
       height="1"
       x="8.0000019"
       y="14.000003" />
    <rect
       style="opacity:1;fill:#d3d7cf;fill-opacity:1;fill-rule:nonzero;stroke:none;stroke-width:1.5;stroke-linecap:square;stroke-linejoin:round;marker:none;marker-start:none;marker-mid:none;marker-end:none;stroke-miterlimit:4;stroke-dasharray:none;stroke-dashoffset:1.20000057;stroke-opacity:1;visibility:visible;display:inline;overflow:visible"
       id="rect4743"
       width="3"
       height="1"
       x="8.0000019"
       y="16.000004" />
    <rect
       style="opacity:1;fill:#d3d7cf;fill-opacity:1;fill-rule:nonzero;stroke:none;stroke-width:1.5;stroke-linecap:square;stroke-linejoin:round;marker:none;marker-start:none;marker-mid:none;marker-end:none;stroke-miterlimit:4;stroke-dasharray:none;stroke-dashoffset:1.20000057;stroke-opacity:1;visibility:visible;display:inline;overflow:visible"
       id="rect4745"
       width="3"
       height="1"
       x="8.0000019"
       y="18.000004" />
    <path
       sodipodi:type="arc"
       style="opacity:0.3;fill:url(#radialGradient7753);fill-opacity:1;fill-rule:evenodd;stroke:none;display:inline;enable-background:new"
       id="path6774"
       sodipodi:cx="1120.375"
       sodipodi:cy="394.78125"
       sodipodi:rx="20.625"
       sodipodi:ry="2.40625"
       d="M 1141,394.78125 A 20.625,2.40625 0 1 1 1099.75,394.78125 A 20.625,2.40625 0 1 1 1141,394.78125 z"
       transform="matrix(1.0181815,0,0,1.2467532,-1116.7451,-447.19479)" />
    <g
       style="display:inline;enable-background:new"
       id="g7753"
       transform="translate(-31.877101,12.999555)">
      <rect
         style="opacity:0.65;fill:url(#linearGradient7830);fill-opacity:1;fill-rule:nonzero;stroke:none;stroke-width:1;marker:none;visibility:visible;display:block;overflow:visible"
         id="rect8601"
         width="41.999989"
         height="1"
         x="34.877113"
         y="31" />
      <rect
         style="opacity:0.65;fill:url(#linearGradient7834);fill-opacity:1;fill-rule:nonzero;stroke:none;stroke-width:1;marker:none;visibility:visible;display:block;overflow:visible"
         id="rect8603"
         width="41.999989"
         height="1"
         x="34.877102"
         y="29" />
      <rect
         style="fill:url(#linearGradient7832);fill-opacity:1;fill-rule:nonzero;stroke:none;stroke-width:1;marker:none;visibility:visible;display:block;overflow:visible"
         id="rect8605"
         width="41.5"
         height="1"
         x="34.627102"
         y="30" />
      <g
         transform="matrix(0.544365,0,0,0.9411763,42.076688,-8.6470511)"
         id="g8613"
         style="fill:#ffffff;fill-opacity:0.72023806" />
    </g>
    <path
       sodipodi:nodetypes="ccccccccccc"
       style="fill:url(#linearGradient7755);fill-opacity:1;fill-rule:nonzero;stroke:#555753;stroke-width:1.00006688;stroke-linecap:butt;stroke-linejoin:miter;marker:none;stroke-miterlimit:4;stroke-dasharray:none;stroke-dashoffset:0;stroke-opacity:1;visibility:visible;display:block;overflow:visible;enable-background:new"
       d="M 21.778719,40.500056 L 18.545321,40.500056 C 17.962949,40.500056 17.500033,40.927096 17.500033,41.464331 L 17.500033,45.535414 C 17.500033,46.072644 17.962949,46.499989 18.545321,46.499989 L 29.454675,46.499989 C 30.037042,46.499989 30.499965,46.072644 30.499965,45.535414 L 30.499965,41.464331 C 30.499965,40.927096 30.037042,40.500056 29.454675,40.500056 L 26.63351,40.500056 L 21.778719,40.500056 z"
       id="path8607" />
    <rect
       style="fill:#ffffff;fill-opacity:0.72023806;fill-rule:nonzero;stroke:none;stroke-width:1.13999999;marker:none;visibility:visible;display:block;overflow:visible;enable-background:new"
       id="rect8615"
       width="8"
       height="1.5"
       x="21"
       y="41.250023"
       rx="0.49999997"
       ry="0.5" />
    <path
       sodipodi:type="arc"
       style="fill:#ffffff;fill-opacity:0.72023806;fill-rule:nonzero;stroke:none;stroke-width:1.13999999;marker:none;visibility:visible;display:block;overflow:visible;enable-background:new"
       id="path8617"
       sodipodi:cx="18.46875"
       sodipodi:cy="40.625"
       sodipodi:rx="0.53125"
       sodipodi:ry="0.53125"
       d="M 19,40.625 A 0.53125,0.53125 0 1 1 17.9375,40.625 A 0.53125,0.53125 0 1 1 19,40.625 z"
       transform="matrix(1.4117647,0,0,1.4117647,-6.5735287,-15.352919)" />
  </g>
</svg>
