<?xml version="1.0" encoding="UTF-8" standalone="no"?>
<!-- Created with Inkscape (http://www.inkscape.org/) -->
<svg
   xmlns:dc="http://purl.org/dc/elements/1.1/"
   xmlns:cc="http://creativecommons.org/ns#"
   xmlns:rdf="http://www.w3.org/1999/02/22-rdf-syntax-ns#"
   xmlns:svg="http://www.w3.org/2000/svg"
   xmlns="http://www.w3.org/2000/svg"
   xmlns:xlink="http://www.w3.org/1999/xlink"
   xmlns:sodipodi="http://sodipodi.sourceforge.net/DTD/sodipodi-0.dtd"
   xmlns:inkscape="http://www.inkscape.org/namespaces/inkscape"
   width="48px"
   height="48px"
   id="svg7733"
   sodipodi:version="0.32"
   inkscape:version="0.46"
   sodipodi:docname="drawing.svg"
   inkscape:output_extension="org.inkscape.output.svg.inkscape">
  <defs
     id="defs7735">
    <linearGradient
       id="linearGradient5113"
       inkscape:collect="always">
      <stop
         id="stop5115"
         offset="0"
         style="stop-color:white;stop-opacity:1;" />
      <stop
         id="stop5117"
         offset="1"
         style="stop-color:white;stop-opacity:0;" />
    </linearGradient>
    <linearGradient
       inkscape:collect="always"
       xlink:href="#linearGradient5113"
       id="linearGradient5807"
       gradientUnits="userSpaceOnUse"
       gradientTransform="matrix(0.6206223,0,0,0.6141576,-21.734445,-0.6310532)"
       x1="58.748795"
       y1="2.047786"
       x2="105.32369"
       y2="58.047787" />
    <linearGradient
       inkscape:collect="always"
       id="linearGradient3163">
      <stop
         style="stop-color:#a7cc5c;stop-opacity:1"
         offset="0"
         id="stop3165" />
      <stop
         style="stop-color:#789e2d;stop-opacity:1"
         offset="1"
         id="stop3167" />
    </linearGradient>
    <linearGradient
       inkscape:collect="always"
       xlink:href="#linearGradient3163"
       id="linearGradient3169"
       x1="17"
       y1="7"
       x2="17"
       y2="26"
       gradientUnits="userSpaceOnUse"
       gradientTransform="matrix(1.000019,0,0,0.9999995,10.009453,-0.9999932)" />
    <linearGradient
       inkscape:collect="always"
       id="linearGradient6381">
      <stop
         style="stop-color:#ffffff;stop-opacity:1;"
         offset="0"
         id="stop6383" />
      <stop
         style="stop-color:#ffffff;stop-opacity:0;"
         offset="1"
         id="stop6385" />
    </linearGradient>
    <linearGradient
       inkscape:collect="always"
       xlink:href="#linearGradient6381"
       id="linearGradient6387"
       x1="23.157747"
       y1="11.36132"
       x2="23.157747"
       y2="5.5276899"
       gradientUnits="userSpaceOnUse" />
    <linearGradient
       inkscape:collect="always"
       xlink:href="#linearGradient6190"
       id="linearGradient6254"
       gradientUnits="userSpaceOnUse"
       x1="24.88299"
       y1="14.294987"
       x2="25.148155"
       y2="10.941941"
       gradientTransform="matrix(0.7002263,0,0,0.6657952,15.325115,18.850398)" />
    <linearGradient
       inkscape:collect="always"
       xlink:href="#linearGradient4210"
       id="linearGradient6252"
       gradientUnits="userSpaceOnUse"
       gradientTransform="matrix(0.7002263,0,0,0.885443,15.325115,8.0882118)"
       x1="17.326572"
       y1="24.163702"
       x2="17.701572"
       y2="27.945204" />
    <linearGradient
       inkscape:collect="always"
       id="linearGradient6242">
      <stop
         style="stop-color:#d7b47f;stop-opacity:1;"
         offset="0"
         id="stop6244" />
      <stop
         style="stop-color:#f4dbb3;stop-opacity:1"
         offset="1"
         id="stop6246" />
    </linearGradient>
    <linearGradient
       inkscape:collect="always"
       xlink:href="#linearGradient6242"
       id="linearGradient6988"
       x1="5.5785265"
       y1="3.273787"
       x2="27.621359"
       y2="3.273787"
       gradientUnits="userSpaceOnUse"
       gradientTransform="matrix(1,0,0,0.8333333,15.000455,21.2492)" />
    <linearGradient
       inkscape:collect="always"
       xlink:href="#linearGradient6190"
       id="linearGradient6198"
       gradientUnits="userSpaceOnUse"
       x1="6.6749902"
       y1="10.140735"
       x2="8"
       y2="10.654029"
       gradientTransform="matrix(0.7002263,0,0,0.7201375,15.325115,18.126755)" />
    <linearGradient
       inkscape:collect="always"
       xlink:href="#linearGradient6210"
       id="linearGradient6218"
       gradientUnits="userSpaceOnUse"
       gradientTransform="matrix(0.7002263,0,0,0.957713,15.325115,6.4861578)"
       x1="8"
       y1="16.526962"
       x2="1.8265705"
       y2="23.499716" />
    <linearGradient
       inkscape:collect="always"
       id="linearGradient6234">
      <stop
         style="stop-color:#ffffff;stop-opacity:1;"
         offset="0"
         id="stop6236" />
      <stop
         style="stop-color:#ffffff;stop-opacity:0;"
         offset="1"
         id="stop6238" />
    </linearGradient>
    <linearGradient
       inkscape:collect="always"
       xlink:href="#linearGradient6234"
       id="linearGradient6240"
       x1="29.953026"
       y1="32.241776"
       x2="27.595888"
       y2="14.147761"
       gradientUnits="userSpaceOnUse" />
    <linearGradient
       inkscape:collect="always"
       id="linearGradient6222">
      <stop
         style="stop-color:#000000;stop-opacity:1;"
         offset="0"
         id="stop6224" />
      <stop
         style="stop-color:#000000;stop-opacity:0;"
         offset="1"
         id="stop6226" />
    </linearGradient>
    <linearGradient
       inkscape:collect="always"
       xlink:href="#linearGradient6222"
       id="linearGradient6228"
       x1="24.5"
       y1="17.8125"
       x2="24.5"
       y2="26.1875"
       gradientUnits="userSpaceOnUse"
       gradientTransform="matrix(0.7002263,0,0,0.699999,15.325115,18.459039)" />
    <linearGradient
       id="linearGradient6204">
      <stop
         id="stop6206"
         offset="0"
         style="stop-color:#120c02;stop-opacity:1;" />
      <stop
         id="stop6208"
         offset="1.0000000"
         style="stop-color:#b97a1b;stop-opacity:1.0000000;" />
    </linearGradient>
    <linearGradient
       inkscape:collect="always"
       xlink:href="#linearGradient6204"
       id="linearGradient4879"
       gradientUnits="userSpaceOnUse"
       gradientTransform="matrix(0.7096774,0,0,0.2991034,11.629488,16.176929)"
       x1="24.990499"
       y1="49.424099"
       x2="23.451571"
       y2="14.38251" />
    <linearGradient
       id="linearGradient6190">
      <stop
         style="stop-color:#a0670c;stop-opacity:1;"
         offset="0"
         id="stop6192" />
      <stop
         style="stop-color:#e6c99d;stop-opacity:1;"
         offset="1"
         id="stop6194" />
    </linearGradient>
    <linearGradient
       inkscape:collect="always"
       xlink:href="#linearGradient6190"
       id="linearGradient6200"
       gradientUnits="userSpaceOnUse"
       x1="41.448223"
       y1="9.3452396"
       x2="37.308056"
       y2="10.742416"
       gradientTransform="matrix(0.7002263,0,0,0.7218186,15.325115,18.126621)" />
    <linearGradient
       id="linearGradient6210">
      <stop
         id="stop6212"
         offset="0"
         style="stop-color:#f9ead2;stop-opacity:1;" />
      <stop
         id="stop6214"
         offset="1"
         style="stop-color:#e4a546;stop-opacity:1;" />
    </linearGradient>
    <linearGradient
       inkscape:collect="always"
       xlink:href="#linearGradient6210"
       id="linearGradient6216"
       gradientUnits="userSpaceOnUse"
       gradientTransform="matrix(0.7002263,0,0,0.9599488,15.325115,6.4588498)"
       x1="37.308056"
       y1="20.232172"
       x2="43.588387"
       y2="23.422194" />
    <linearGradient
       id="linearGradient4210">
      <stop
         style="stop-color:#eaba6f;stop-opacity:1.0000000;"
         offset="0.0000000"
         id="stop4212" />
      <stop
         style="stop-color:#b97a1b;stop-opacity:1.0000000;"
         offset="1.0000000"
         id="stop4214" />
    </linearGradient>
    <linearGradient
       inkscape:collect="always"
       xlink:href="#linearGradient4210"
       id="linearGradient6232"
       gradientUnits="userSpaceOnUse"
       gradientTransform="matrix(0.7072142,0,0,0.8394801,11.736635,11.571245)"
       x1="24.990499"
       y1="49.424099"
       x2="23.451571"
       y2="14.38251" />
    <filter
       inkscape:collect="always"
       x="-0.11116035"
       width="1.2223207"
       y="-0.50716913"
       height="2.0143383"
       id="filter6290">
      <feGaussianBlur
         inkscape:collect="always"
         stdDeviation="2.0286765"
         id="feGaussianBlur6292" />
    </filter>
    <linearGradient
       gradientTransform="matrix(1.0033404,0,0,1,-8.2374684,8)"
       y2="19.9583"
       x2="71.999496"
       y1="14.2578"
       x1="71.999496"
       gradientUnits="userSpaceOnUse"
       id="linearGradient4305-4-8">
      <stop
         id="stop4307-0-1"
         style="stop-color:#feebd6;stop-opacity:0;"
         offset="0.00445589" />
      <stop
         offset="0.46138024"
         style="stop-color:#f5f5f5;stop-opacity:0.53"
         id="stop4309-8-0" />
      <stop
         id="stop4311-0-3"
         style="stop-color:#f5f5f5;stop-opacity:0"
         offset="1" />
    </linearGradient>
    <linearGradient
       inkscape:collect="always"
       xlink:href="#linearGradient4305-4-8"
       id="linearGradient10810"
       gradientUnits="userSpaceOnUse"
       gradientTransform="matrix(0.3102479,0,0,0.942809,-3.0456936,-26.279211)"
       x1="7.2379346"
       y1="36.005047"
       x2="132.86028"
       y2="35.857735" />
    <linearGradient
       gradientTransform="matrix(1.0033404,0,0,1,-8.2374684,8)"
       y2="19.9583"
       x2="71.999496"
       y1="14.2578"
       x1="71.999496"
       gradientUnits="userSpaceOnUse"
       id="linearGradient10580">
      <stop
         id="stop10582"
         style="stop-color:#af00af;stop-opacity:0"
         offset="0.25" />
      <stop
         id="stop10584"
         style="stop-color:#af00af;stop-opacity:1"
         offset="1" />
    </linearGradient>
    <linearGradient
       inkscape:collect="always"
       xlink:href="#linearGradient10580"
       id="linearGradient10808"
       gradientUnits="userSpaceOnUse"
       gradientTransform="matrix(0.2402106,0,0,0.1666666,1.6255484,1.3333328)"
       x1="65.306877"
       y1="22"
       x2="65.306877"
       y2="28.003984" />
    <linearGradient
       inkscape:collect="always"
       id="linearGradient10572">
      <stop
         style="stop-color:#af00af;stop-opacity:1"
         offset="0"
         id="stop10574" />
      <stop
         style="stop-color:#af00af;stop-opacity:1"
         offset="1"
         id="stop10576" />
    </linearGradient>
    <linearGradient
       inkscape:collect="always"
       xlink:href="#linearGradient10572"
       id="linearGradient10806"
       gradientUnits="userSpaceOnUse"
       x1="151"
       y1="64"
       x2="150.99998"
       y2="83"
       gradientTransform="matrix(0.9997295,0,0,1.0000073,-132.95958,-58.000537)" />
    <linearGradient
       id="linearGradient10566">
      <stop
         style="stop-color:#af00af;stop-opacity:1"
         offset="0"
         id="stop10568" />
      <stop
         style="stop-color:#af00af;stop-opacity:1"
         offset="1"
         id="stop10570" />
    </linearGradient>
    <linearGradient
       inkscape:collect="always"
       xlink:href="#linearGradient10566"
       id="linearGradient10804"
       gradientUnits="userSpaceOnUse"
       gradientTransform="matrix(0.2421199,0,0,0.2368403,10.154606,-72.058011)"
       x1="28.272753"
       y1="325.34204"
       x2="28.272074"
       y2="409.80386" />
    <linearGradient
       id="linearGradient17648">
      <stop
         id="stop17650"
         offset="0"
         style="stop-color:#ffffff;stop-opacity:0.6" />
      <stop
         id="stop17652"
         offset="1"
         style="stop-color:#ffffff;stop-opacity:0;" />
    </linearGradient>
    <linearGradient
       inkscape:collect="always"
       xlink:href="#linearGradient17648"
       id="linearGradient17646"
       gradientUnits="userSpaceOnUse"
       x1="24.001408"
       y1="10.238918"
       x2="23.999996"
       y2="38.762936"
       gradientTransform="matrix(0.6666651,0,0,0.6666659,-3.8757186e-4,-4.8332972)" />
    <linearGradient
       inkscape:collect="always"
       id="linearGradient6293">
      <stop
         style="stop-color:#888a85;stop-opacity:1"
         offset="0"
         id="stop6295" />
      <stop
         style="stop-color:#555753;stop-opacity:0"
         offset="1"
         id="stop6297" />
    </linearGradient>
    <linearGradient
       inkscape:collect="always"
       xlink:href="#linearGradient6293"
       id="linearGradient17644"
       gradientUnits="userSpaceOnUse"
       x1="23.999998"
       y1="8.7654715"
       x2="24.046484"
       y2="31.230356"
       gradientTransform="matrix(0.6792506,0,0,0.6663604,-0.3024406,-4.8258142)" />
    <radialGradient
       inkscape:collect="always"
       xlink:href="#linearGradient5060"
       id="radialGradient2099"
       gradientUnits="userSpaceOnUse"
       gradientTransform="matrix(-2.774389,0,0,1.969706,112.7623,-872.8854)"
       cx="605.71429"
       cy="486.64789"
       fx="605.71429"
       fy="486.64789"
       r="117.14286" />
    <linearGradient
       inkscape:collect="always"
       id="linearGradient5060">
      <stop
         style="stop-color:black;stop-opacity:1;"
         offset="0"
         id="stop5062" />
      <stop
         style="stop-color:black;stop-opacity:0;"
         offset="1"
         id="stop5064" />
    </linearGradient>
    <radialGradient
       inkscape:collect="always"
       xlink:href="#linearGradient5060"
       id="radialGradient2097"
       gradientUnits="userSpaceOnUse"
       gradientTransform="matrix(2.774389,0,0,1.969706,-1891.633,-872.8854)"
       cx="605.71429"
       cy="486.64789"
       fx="605.71429"
       fy="486.64789"
       r="117.14286" />
    <linearGradient
       id="linearGradient5048">
      <stop
         style="stop-color:black;stop-opacity:0;"
         offset="0"
         id="stop5050" />
      <stop
         id="stop5056"
         offset="0.5"
         style="stop-color:black;stop-opacity:1;" />
      <stop
         style="stop-color:black;stop-opacity:0;"
         offset="1"
         id="stop5052" />
    </linearGradient>
    <linearGradient
       inkscape:collect="always"
       xlink:href="#linearGradient5048"
       id="linearGradient2095"
       gradientUnits="userSpaceOnUse"
       gradientTransform="matrix(2.774389,0,0,1.969706,-1892.179,-872.8854)"
       x1="302.85715"
       y1="366.64789"
       x2="302.85715"
       y2="609.50507" />
  </defs>
  <sodipodi:namedview
     id="base"
     pagecolor="#ffffff"
     bordercolor="#666666"
     borderopacity="1.0"
     inkscape:pageopacity="0.0"
     inkscape:pageshadow="2"
     inkscape:zoom="7"
     inkscape:cx="19.5"
     inkscape:cy="24"
     inkscape:current-layer="layer1"
     showgrid="true"
     inkscape:grid-bbox="true"
     inkscape:document-units="px"
     inkscape:window-width="1680"
     inkscape:window-height="1000"
     inkscape:window-x="0"
     inkscape:window-y="25" />
  <metadata
     id="metadata7738">
    <rdf:RDF>
      <cc:Work
         rdf:about="">
        <dc:format>image/svg+xml</dc:format>
        <dc:type
           rdf:resource="http://purl.org/dc/dcmitype/StillImage" />
      </cc:Work>
    </rdf:RDF>
  </metadata>
  <g
     id="layer1"
     inkscape:label="Layer 1"
     inkscape:groupmode="layer">
    <g
       id="g13071"
       transform="matrix(1.5760178e-2,0,0,1.4633417e-2,31.017662,22.20521)"
       style="display:inline">
      <rect
         y="-150.69685"
         x="-1559.2523"
         height="478.35718"
         width="1339.6335"
         id="rect13073"
         style="opacity:0.40206185;fill:url(#linearGradient2095);fill-opacity:1;fill-rule:nonzero;stroke:none;stroke-width:1;stroke-linecap:round;stroke-linejoin:miter;marker:none;marker-start:none;marker-mid:none;marker-end:none;stroke-miterlimit:4;stroke-dasharray:none;stroke-dashoffset:0;stroke-opacity:1;visibility:visible;display:inline;overflow:visible" />
      <path
         sodipodi:nodetypes="cccc"
         id="path13075"
         d="M -219.61876,-150.68038 C -219.61876,-150.68038 -219.61876,327.65041 -219.61876,327.65041 C -76.744594,328.55086 125.78146,220.48075 125.78138,88.454235 C 125.78138,-43.572302 -33.655436,-150.68036 -219.61876,-150.68038 z"
         style="opacity:0.40206185;fill:url(#radialGradient2097);fill-opacity:1;fill-rule:nonzero;stroke:none;stroke-width:1;stroke-linecap:round;stroke-linejoin:miter;marker:none;marker-start:none;marker-mid:none;marker-end:none;stroke-miterlimit:4;stroke-dasharray:none;stroke-dashoffset:0;stroke-opacity:1;visibility:visible;display:inline;overflow:visible" />
      <path
         style="opacity:0.40206185;fill:url(#radialGradient2099);fill-opacity:1;fill-rule:nonzero;stroke:none;stroke-width:1;stroke-linecap:round;stroke-linejoin:miter;marker:none;marker-start:none;marker-mid:none;marker-end:none;stroke-miterlimit:4;stroke-dasharray:none;stroke-dashoffset:0;stroke-opacity:1;visibility:visible;display:inline;overflow:visible"
         d="M -1559.2523,-150.68038 C -1559.2523,-150.68038 -1559.2523,327.65041 -1559.2523,327.65041 C -1702.1265,328.55086 -1904.6525,220.48075 -1904.6525,88.454235 C -1904.6525,-43.572302 -1745.2157,-150.68036 -1559.2523,-150.68038 z"
         id="path13077"
         sodipodi:nodetypes="cccc" />
    </g>
    <path
       d="M 30.499569,4.4999988 C 30.493768,3.9999988 29.985772,3.4999988 29.499569,3.4999988 L 14.499569,3.4999988 L 12.749569,1.9999988 C 12.568702,1.8271418 12.255297,1.4999988 11.999569,1.4999988 L 4.4995724,1.4999988 C 3.9881204,1.4999988 3.4995724,2.0112018 3.4995724,2.4999988 L 3.4995714,3.4999988 L 3.4995714,24.5 L 30.499569,24.5 L 30.499569,4.4999988 z"
       id="path15"
       style="fill:#eeeeec;fill-opacity:1;stroke:url(#linearGradient17644);stroke-width:1.0091393;stroke-miterlimit:4;stroke-dasharray:none"
       sodipodi:nodetypes="ccccccccccc" />
    <path
       d="M 29.499569,4.9999988 C 29.509409,4.4588208 29.498796,4.4684248 28.999544,4.4999988 L 14.099569,4.4999988 L 12.399569,2.9999988 C 11.919284,2.5891278 11.852271,2.4583318 10.999571,2.4999988 L 4.9995724,2.4999988 C 4.5233404,2.4999988 4.4995724,2.5415428 4.4995724,2.9999988 L 4.4995714,23.5 L 29.499569,23.5 L 29.499569,4.9999988 z"
       id="path7263"
       style="opacity:1;fill:none;fill-opacity:1;stroke:url(#linearGradient17646);stroke-width:0.99997574;stroke-miterlimit:4;stroke-dasharray:none;stroke-opacity:1"
       sodipodi:nodetypes="cccccccccc" />
    <path
       style="opacity:0.9;fill:url(#linearGradient10804);fill-opacity:1;stroke:url(#linearGradient10806);stroke-width:1.00012851;stroke-miterlimit:4;stroke-dasharray:none;stroke-opacity:1;display:inline;enable-background:new"
       id="path40085"
       d="M 31.745848,24.000062 C 31.724993,24.39038 31.396882,24.499936 30.99605,24.499936 L 3.0036274,24.499936 C 2.6027754,24.499936 2.2749644,24.39038 2.2538304,24.000062 L 1.5040334,6.9999368 C 1.4748704,6.6103278 1.6030464,6.5000628 2.0038974,6.5000628 L 31.99578,6.5000628 C 32.396631,6.5000628 32.526246,6.6103288 32.495645,6.9999368 L 31.745848,24.000062 L 31.745848,24.000062 z"
       sodipodi:nodetypes="cccccccccc" />
    <path
       style="opacity:0.5;fill:url(#linearGradient10808);fill-opacity:1;display:inline;enable-background:new"
       id="path50"
       d="M 4.0000024,4.9999988 C 4.0018634,5.2916658 4.0046564,5.6258328 4.0065174,5.9999988 L 29.993485,5.9999988 C 29.995347,5.6258328 29.998139,5.2916658 30,4.9999988 L 4.0004954,4.9999988 L 4.0000024,4.9999988 z" />
    <rect
       ry="0"
       rx="0"
       y="6.999999"
       x="2.0000081"
       height="1"
       width="30"
       id="rect3521-5-0"
       style="fill:url(#linearGradient10810);fill-opacity:1;stroke:none;display:inline;enable-background:new" />
    <rect
       style="opacity:0.5;fill:#000000;fill-opacity:1;fill-rule:nonzero;stroke:none;stroke-width:1;stroke-linecap:butt;stroke-linejoin:round;marker:none;marker-start:none;marker-mid:none;marker-end:none;stroke-miterlimit:4;stroke-dasharray:none;stroke-dashoffset:0;stroke-opacity:1;visibility:visible;display:block;overflow:visible;filter:url(#filter6290);enable-background:accumulate"
       id="rect6264"
       width="36.5"
       height="8"
       x="5"
       y="31"
       rx="5.7124391"
       ry="5.7142935"
       transform="matrix(0.7002263,0,0,0.699999,15.325115,18.459039)" />
    <rect
       style="opacity:1;fill:url(#linearGradient6232);fill-opacity:1;fill-rule:nonzero;stroke:#a0670c;stroke-width:1.00000083;stroke-linecap:butt;stroke-linejoin:miter;marker:none;marker-start:none;marker-mid:none;marker-end:none;stroke-miterlimit:4;stroke-dasharray:none;stroke-dashoffset:0;stroke-opacity:1;visibility:visible;display:block;overflow:visible;enable-background:accumulate"
       id="rect4873"
       width="21.923641"
       height="17.990171"
       x="20.576813"
       y="26.509026"
       rx="1.9142135"
       ry="1.9142134" />
    <path
       style="opacity:1;fill:url(#linearGradient6216);fill-opacity:1;fill-rule:nonzero;stroke:url(#linearGradient6200);stroke-width:1;stroke-linecap:butt;stroke-linejoin:round;marker:none;marker-start:none;marker-mid:none;marker-end:none;stroke-miterlimit:4;stroke-dasharray:none;stroke-dashoffset:0;stroke-opacity:1;visibility:visible;display:block;overflow:visible;enable-background:accumulate"
       d="M 42.283828,26.413383 L 46.52584,29.123409 L 45.866268,24.283641 L 42.170663,21.4992 L 42.283828,26.413383 z"
       id="path4881"
       sodipodi:nodetypes="ccccc" />
    <rect
       ry="0.55368161"
       rx="0.55153912"
       y="21.499199"
       x="20.500454"
       height="6.4098258"
       width="22"
       id="rect4877"
       style="opacity:1;fill:url(#linearGradient4879);fill-opacity:1;fill-rule:nonzero;stroke:#a0670c;stroke-width:1.00000083;stroke-linecap:butt;stroke-linejoin:miter;marker:none;marker-start:none;marker-mid:none;marker-end:none;stroke-miterlimit:4;stroke-dasharray:none;stroke-dashoffset:0;stroke-opacity:1;visibility:visible;display:block;overflow:visible;enable-background:accumulate" />
    <rect
       style="opacity:0.55294118;fill:url(#linearGradient6228);fill-opacity:1;fill-rule:nonzero;stroke:none;stroke-width:1.00000083;stroke-linecap:butt;stroke-linejoin:miter;marker:none;marker-start:none;marker-mid:none;marker-end:none;stroke-miterlimit:4;stroke-dasharray:none;stroke-dashoffset:0;stroke-opacity:1;visibility:visible;display:block;overflow:visible;enable-background:accumulate"
       id="rect6220"
       width="21.181845"
       height="8.1374884"
       x="20.751869"
       y="29.134024" />
    <path
       sodipodi:type="inkscape:offset"
       inkscape:radius="-1.0565168"
       inkscape:original="M 22.5 26.5 C 21.439526 26.5 20.5625 27.377026 20.5625 28.4375 L 20.5625 42.59375 C 20.5625 43.654224 21.439526 44.499998 22.5 44.5 L 40.59375 44.5 C 41.654224 44.5 42.5 43.654224 42.5 42.59375 L 42.5 28.4375 C 42.5 27.377026 41.654226 26.5 40.59375 26.5 L 22.5 26.5 z "
       xlink:href="#rect4873"
       style="opacity:0.47647059;fill:none;fill-opacity:1;fill-rule:nonzero;stroke:url(#linearGradient6240);stroke-width:1.00524569;stroke-linecap:butt;stroke-linejoin:miter;marker:none;marker-start:none;marker-mid:none;marker-end:none;stroke-miterlimit:4;stroke-dasharray:none;stroke-dashoffset:0;stroke-opacity:1;visibility:visible;display:block;overflow:visible;enable-background:accumulate"
       id="path6230"
       inkscape:href="#rect4873"
       d="M 22.5,27.5625 C 22.022028,27.5625 21.625,27.959528 21.625,28.4375 L 21.625,42.59375 C 21.625,43.071722 22.00127,43.437499 22.5,43.4375 L 40.59375,43.4375 C 41.092477,43.4375 41.4375,43.092477 41.4375,42.59375 L 41.4375,28.4375 C 41.4375,27.938771 41.071725,27.5625 40.59375,27.5625 L 22.5,27.5625 z"
       transform="matrix(1.0094645,0,0,0.9802844,-0.3202125,0.9189045)" />
    <path
       style="opacity:1;fill:url(#linearGradient6218);fill-opacity:1;fill-rule:nonzero;stroke:url(#linearGradient6198);stroke-width:1.00000083;stroke-linecap:butt;stroke-linejoin:round;marker:none;marker-start:none;marker-mid:none;marker-end:none;stroke-miterlimit:4;stroke-dasharray:none;stroke-dashoffset:0;stroke-opacity:1;visibility:visible;display:block;overflow:visible;enable-background:accumulate"
       d="M 20.620577,21.4992 L 20.576813,26.408336 L 16.478,30.009023 L 17.096919,24.353385 L 20.620577,21.4992 z"
       id="path4883"
       sodipodi:nodetypes="ccccc" />
    <rect
       style="opacity:0.61363639;fill:none;fill-opacity:1;fill-rule:evenodd;stroke:url(#linearGradient6988);stroke-width:0.99999988;stroke-linecap:round;stroke-linejoin:round;stroke-miterlimit:4;stroke-dasharray:none;stroke-dashoffset:0.69999992;stroke-opacity:1"
       id="rect6003"
       width="22"
       height="5"
       x="20.500454"
       y="22.499199"
       rx="0.46323475"
       ry="0.46323472" />
    <path
       style="opacity:1;fill:url(#linearGradient6252);fill-opacity:1;fill-rule:nonzero;stroke:url(#linearGradient6254);stroke-width:1.00000083;stroke-linecap:butt;stroke-linejoin:miter;marker:none;marker-start:none;marker-mid:none;marker-end:none;stroke-miterlimit:4;stroke-dasharray:none;stroke-dashoffset:0;stroke-opacity:1;visibility:visible;display:block;overflow:visible;enable-background:accumulate"
       d="M 20.617466,26.468387 L 19.217014,32.4992 L 43.663043,32.4992 L 42.330703,26.488581 L 20.617466,26.468387 z"
       id="path4885"
       sodipodi:nodetypes="ccccc" />
    <path
       sodipodi:type="inkscape:offset"
       inkscape:radius="-1.013667"
       inkscape:original="M 5.625 6.46875 L 4.21875 12.5 L 28.65625 12.5 L 27.34375 6.5 L 5.625 6.46875 z "
       style="opacity:0.3;fill:none;fill-opacity:1;fill-rule:nonzero;stroke:url(#linearGradient6387);stroke-width:1.00000083;stroke-linecap:butt;stroke-linejoin:miter;marker:none;marker-start:none;marker-mid:none;marker-end:none;stroke-miterlimit:4;stroke-dasharray:none;stroke-dashoffset:0;stroke-opacity:1;visibility:visible;display:block;overflow:visible;enable-background:accumulate"
       id="path5406"
       d="M 6.4375,7.46875 L 5.5,11.5 L 27.375,11.5 L 26.5,7.5 L 6.4375,7.46875 z"
       transform="translate(15,19.9992)" />
    <path
       style="fill:url(#linearGradient3169);fill-opacity:1;fill-rule:nonzero;stroke:#42770c;stroke-width:1.00000882;stroke-linecap:butt;stroke-linejoin:miter;marker:none;marker-start:none;marker-mid:none;marker-end:none;stroke-miterlimit:4;stroke-dasharray:none;stroke-dashoffset:0;stroke-opacity:1;visibility:visible;display:inline;overflow:visible"
       d="M 38.509995,16.50775 L 31.075144,25.499996 L 23.677553,16.50775 L 27.440795,16.50775 C 28.705529,13.138501 26.203431,11.149553 23.195974,11.000003 C 20.533553,10.867602 18.042086,12.434492 17.009586,15 C 16.632499,15.57116 15.381896,16.21622 15.509039,14.250701 C 15.478181,9.7419128 19.507354,5.4896748 25.267233,5.5000048 C 31.027113,5.5103348 34.904227,9.8358128 34.587261,16.50775 L 38.509995,16.50775 z"
       id="path5792"
       sodipodi:nodetypes="ccccscczcc" />
    <path
       sodipodi:nodetypes="ccccsczcc"
       id="path5798"
       d="M 36.440806,17.531599 L 31.075144,24.093696 L 25.688211,17.531599 L 28.121888,17.564719 C 30.009834,14.188861 27.551647,10.105172 23.717614,10.000002 C 20.631365,9.9153428 18.072807,10.947472 16.892845,13.241971 C 16.645443,10.520122 20.37984,6.5031238 25.228233,6.4817138 C 30.076625,6.4603038 34.222064,9.5381428 33.605332,17.531599 L 36.440806,17.531599 z"
       style="opacity:0.35400008;fill:none;fill-opacity:1;fill-rule:nonzero;stroke:url(#linearGradient5807);stroke-width:1.00000882;stroke-linecap:butt;stroke-linejoin:miter;marker:none;marker-start:none;marker-mid:none;marker-end:none;stroke-miterlimit:4;stroke-dasharray:none;stroke-dashoffset:0;stroke-opacity:1;visibility:visible;display:inline;overflow:visible;enable-background:accumulate" />
  </g>
</svg>
