<?xml version="1.0" encoding="UTF-8" standalone="no"?>
<!-- Created with Inkscape (http://www.inkscape.org/) -->
<svg
   xmlns:dc="http://purl.org/dc/elements/1.1/"
   xmlns:cc="http://creativecommons.org/ns#"
   xmlns:rdf="http://www.w3.org/1999/02/22-rdf-syntax-ns#"
   xmlns:svg="http://www.w3.org/2000/svg"
   xmlns="http://www.w3.org/2000/svg"
   xmlns:xlink="http://www.w3.org/1999/xlink"
   xmlns:sodipodi="http://sodipodi.sourceforge.net/DTD/sodipodi-0.dtd"
   xmlns:inkscape="http://www.inkscape.org/namespaces/inkscape"
   width="48px"
   height="48px"
   id="svg7519"
   sodipodi:version="0.32"
   inkscape:version="0.46"
   sodipodi:docname="drawing.svg"
   inkscape:output_extension="org.inkscape.output.svg.inkscape">
  <defs
     id="defs7521">
    <linearGradient
       inkscape:collect="always"
       xlink:href="#linearGradient3832"
       id="linearGradient10039"
       gradientUnits="userSpaceOnUse"
       x1="305.5"
       y1="83.375"
       x2="305.5"
       y2="75.623993" />
    <linearGradient
       inkscape:collect="always"
       xlink:href="#linearGradient3832"
       id="linearGradient10037"
       gradientUnits="userSpaceOnUse"
       x1="305.5"
       y1="83.375"
       x2="305.5"
       y2="75.623993" />
    <linearGradient
       inkscape:collect="always"
       xlink:href="#linearGradient3832"
       id="linearGradient10035"
       gradientUnits="userSpaceOnUse"
       x1="305.5"
       y1="83.375"
       x2="305.5"
       y2="75.623993" />
    <linearGradient
       inkscape:collect="always"
       xlink:href="#linearGradient3832"
       id="linearGradient10033"
       gradientUnits="userSpaceOnUse"
       x1="305.5"
       y1="83.375"
       x2="305.5"
       y2="75.623993" />
    <linearGradient
       inkscape:collect="always"
       xlink:href="#linearGradient3832"
       id="linearGradient10031"
       gradientUnits="userSpaceOnUse"
       x1="305.5"
       y1="83.375"
       x2="305.5"
       y2="75.623993" />
    <linearGradient
       inkscape:collect="always"
       xlink:href="#linearGradient3832"
       id="linearGradient10029"
       gradientUnits="userSpaceOnUse"
       x1="305.5"
       y1="83.375"
       x2="305.5"
       y2="75.623993" />
    <linearGradient
       inkscape:collect="always"
       xlink:href="#linearGradient3832"
       id="linearGradient10027"
       gradientUnits="userSpaceOnUse"
       x1="305.5"
       y1="83.375"
       x2="305.5"
       y2="75.623993" />
    <linearGradient
       inkscape:collect="always"
       xlink:href="#linearGradient3832"
       id="linearGradient10025"
       gradientUnits="userSpaceOnUse"
       x1="305.5"
       y1="83.375"
       x2="305.5"
       y2="75.623993" />
    <linearGradient
       inkscape:collect="always"
       xlink:href="#linearGradient3832"
       id="linearGradient10023"
       gradientUnits="userSpaceOnUse"
       x1="305.5"
       y1="83.375"
       x2="305.5"
       y2="75.623993" />
    <linearGradient
       inkscape:collect="always"
       xlink:href="#linearGradient3832"
       id="linearGradient10021"
       gradientUnits="userSpaceOnUse"
       x1="305.5"
       y1="83.375"
       x2="305.5"
       y2="75.623993" />
    <linearGradient
       inkscape:collect="always"
       xlink:href="#linearGradient3832"
       id="linearGradient10019"
       gradientUnits="userSpaceOnUse"
       x1="305.5"
       y1="83.375"
       x2="305.5"
       y2="75.623993" />
    <linearGradient
       inkscape:collect="always"
       xlink:href="#linearGradient3832"
       id="linearGradient10017"
       gradientUnits="userSpaceOnUse"
       x1="305.5"
       y1="83.375"
       x2="305.5"
       y2="75.623993" />
    <linearGradient
       inkscape:collect="always"
       xlink:href="#linearGradient3832"
       id="linearGradient10015"
       gradientUnits="userSpaceOnUse"
       x1="305.5"
       y1="83.375"
       x2="305.5"
       y2="75.623993" />
    <linearGradient
       inkscape:collect="always"
       xlink:href="#linearGradient3832"
       id="linearGradient10013"
       gradientUnits="userSpaceOnUse"
       x1="305.5"
       y1="83.375"
       x2="305.5"
       y2="75.623993" />
    <linearGradient
       inkscape:collect="always"
       xlink:href="#linearGradient3832"
       id="linearGradient10011"
       gradientUnits="userSpaceOnUse"
       x1="305.5"
       y1="83.375"
       x2="305.5"
       y2="75.623993" />
    <linearGradient
       inkscape:collect="always"
       xlink:href="#linearGradient3832"
       id="linearGradient10009"
       gradientUnits="userSpaceOnUse"
       x1="305.5"
       y1="83.375"
       x2="305.5"
       y2="75.623993" />
    <linearGradient
       inkscape:collect="always"
       xlink:href="#linearGradient3832"
       id="linearGradient10007"
       gradientUnits="userSpaceOnUse"
       x1="305.5"
       y1="83.375"
       x2="305.5"
       y2="75.623993" />
    <linearGradient
       inkscape:collect="always"
       xlink:href="#linearGradient3832"
       id="linearGradient10005"
       gradientUnits="userSpaceOnUse"
       x1="305.5"
       y1="83.375"
       x2="305.5"
       y2="75.623993" />
    <linearGradient
       inkscape:collect="always"
       xlink:href="#linearGradient3832"
       id="linearGradient10003"
       gradientUnits="userSpaceOnUse"
       x1="305.5"
       y1="83.375"
       x2="305.5"
       y2="75.623993" />
    <linearGradient
       inkscape:collect="always"
       xlink:href="#linearGradient3832"
       id="linearGradient10001"
       gradientUnits="userSpaceOnUse"
       x1="305.5"
       y1="83.375"
       x2="305.5"
       y2="75.623993" />
    <linearGradient
       inkscape:collect="always"
       xlink:href="#linearGradient3832"
       id="linearGradient9999"
       gradientUnits="userSpaceOnUse"
       x1="305.5"
       y1="83.375"
       x2="305.5"
       y2="75.623993" />
    <linearGradient
       inkscape:collect="always"
       xlink:href="#linearGradient3832"
       id="linearGradient9997"
       gradientUnits="userSpaceOnUse"
       x1="305.5"
       y1="83.375"
       x2="305.5"
       y2="75.623993" />
    <linearGradient
       inkscape:collect="always"
       xlink:href="#linearGradient3832"
       id="linearGradient9995"
       gradientUnits="userSpaceOnUse"
       x1="305.5"
       y1="83.375"
       x2="305.5"
       y2="75.623993" />
    <linearGradient
       inkscape:collect="always"
       xlink:href="#linearGradient3832"
       id="linearGradient9993"
       gradientUnits="userSpaceOnUse"
       x1="305.5"
       y1="83.375"
       x2="305.5"
       y2="75.623993" />
    <linearGradient
       inkscape:collect="always"
       xlink:href="#linearGradient3832"
       id="linearGradient9991"
       gradientUnits="userSpaceOnUse"
       x1="305.5"
       y1="83.375"
       x2="305.5"
       y2="75.623993" />
    <linearGradient
       inkscape:collect="always"
       xlink:href="#linearGradient3832"
       id="linearGradient9989"
       gradientUnits="userSpaceOnUse"
       x1="305.5"
       y1="83.375"
       x2="305.5"
       y2="75.623993" />
    <linearGradient
       inkscape:collect="always"
       xlink:href="#linearGradient3832"
       id="linearGradient9987"
       gradientUnits="userSpaceOnUse"
       x1="305.5"
       y1="83.375"
       x2="305.5"
       y2="75.623993" />
    <linearGradient
       inkscape:collect="always"
       xlink:href="#linearGradient3832"
       id="linearGradient9985"
       gradientUnits="userSpaceOnUse"
       x1="305.5"
       y1="83.375"
       x2="305.5"
       y2="75.623993" />
    <linearGradient
       inkscape:collect="always"
       xlink:href="#linearGradient3832"
       id="linearGradient9983"
       gradientUnits="userSpaceOnUse"
       x1="305.5"
       y1="83.375"
       x2="305.5"
       y2="75.623993" />
    <linearGradient
       inkscape:collect="always"
       xlink:href="#linearGradient3832"
       id="linearGradient9981"
       gradientUnits="userSpaceOnUse"
       x1="305.5"
       y1="83.375"
       x2="305.5"
       y2="75.623993" />
    <linearGradient
       inkscape:collect="always"
       xlink:href="#linearGradient3832"
       id="linearGradient9979"
       gradientUnits="userSpaceOnUse"
       x1="305.5"
       y1="83.375"
       x2="305.5"
       y2="75.623993" />
    <linearGradient
       inkscape:collect="always"
       xlink:href="#linearGradient3832"
       id="linearGradient9977"
       gradientUnits="userSpaceOnUse"
       x1="305.5"
       y1="83.375"
       x2="305.5"
       y2="75.623993" />
    <linearGradient
       inkscape:collect="always"
       xlink:href="#linearGradient3832"
       id="linearGradient9975"
       gradientUnits="userSpaceOnUse"
       x1="305.5"
       y1="83.375"
       x2="305.5"
       y2="75.623993" />
    <linearGradient
       inkscape:collect="always"
       xlink:href="#linearGradient3832"
       id="linearGradient9973"
       gradientUnits="userSpaceOnUse"
       x1="305.5"
       y1="83.375"
       x2="305.5"
       y2="75.623993" />
    <linearGradient
       inkscape:collect="always"
       xlink:href="#linearGradient3832"
       id="linearGradient9971"
       gradientUnits="userSpaceOnUse"
       x1="305.5"
       y1="83.375"
       x2="305.5"
       y2="75.623993" />
    <linearGradient
       inkscape:collect="always"
       xlink:href="#linearGradient3832"
       id="linearGradient9969"
       gradientUnits="userSpaceOnUse"
       x1="305.5"
       y1="83.375"
       x2="305.5"
       y2="75.623993" />
    <linearGradient
       inkscape:collect="always"
       xlink:href="#linearGradient3832"
       id="linearGradient9967"
       gradientUnits="userSpaceOnUse"
       x1="305.5"
       y1="83.375"
       x2="305.5"
       y2="75.623993" />
    <linearGradient
       inkscape:collect="always"
       xlink:href="#linearGradient3832"
       id="linearGradient9965"
       gradientUnits="userSpaceOnUse"
       x1="305.5"
       y1="83.375"
       x2="305.5"
       y2="75.623993" />
    <linearGradient
       inkscape:collect="always"
       xlink:href="#linearGradient3832"
       id="linearGradient9963"
       gradientUnits="userSpaceOnUse"
       x1="305.5"
       y1="83.375"
       x2="305.5"
       y2="75.623993" />
    <linearGradient
       inkscape:collect="always"
       xlink:href="#linearGradient3832"
       id="linearGradient9961"
       gradientUnits="userSpaceOnUse"
       x1="305.5"
       y1="83.375"
       x2="305.5"
       y2="75.623993" />
    <linearGradient
       inkscape:collect="always"
       xlink:href="#linearGradient3832"
       id="linearGradient9959"
       gradientUnits="userSpaceOnUse"
       x1="305.5"
       y1="83.375"
       x2="305.5"
       y2="75.623993" />
    <linearGradient
       inkscape:collect="always"
       xlink:href="#linearGradient3832"
       id="linearGradient9957"
       gradientUnits="userSpaceOnUse"
       x1="305.5"
       y1="83.375"
       x2="305.5"
       y2="75.623993" />
    <linearGradient
       inkscape:collect="always"
       xlink:href="#linearGradient3832"
       id="linearGradient9955"
       gradientUnits="userSpaceOnUse"
       x1="305.5"
       y1="83.375"
       x2="305.5"
       y2="75.623993" />
    <linearGradient
       inkscape:collect="always"
       xlink:href="#linearGradient3832"
       id="linearGradient9953"
       gradientUnits="userSpaceOnUse"
       x1="305.5"
       y1="83.375"
       x2="305.5"
       y2="75.623993" />
    <linearGradient
       inkscape:collect="always"
       xlink:href="#linearGradient3832"
       id="linearGradient9951"
       gradientUnits="userSpaceOnUse"
       x1="305.5"
       y1="83.375"
       x2="305.5"
       y2="75.623993" />
    <linearGradient
       inkscape:collect="always"
       xlink:href="#linearGradient3832"
       id="linearGradient9949"
       gradientUnits="userSpaceOnUse"
       x1="305.5"
       y1="83.375"
       x2="305.5"
       y2="75.623993" />
    <linearGradient
       inkscape:collect="always"
       xlink:href="#linearGradient3832"
       id="linearGradient9947"
       gradientUnits="userSpaceOnUse"
       x1="305.5"
       y1="83.375"
       x2="305.5"
       y2="75.623993" />
    <linearGradient
       inkscape:collect="always"
       xlink:href="#linearGradient3832"
       id="linearGradient9945"
       gradientUnits="userSpaceOnUse"
       x1="305.5"
       y1="83.375"
       x2="305.5"
       y2="75.623993" />
    <linearGradient
       inkscape:collect="always"
       xlink:href="#linearGradient3832"
       id="linearGradient9943"
       gradientUnits="userSpaceOnUse"
       x1="305.5"
       y1="83.375"
       x2="305.5"
       y2="75.623993" />
    <linearGradient
       inkscape:collect="always"
       xlink:href="#linearGradient3832"
       id="linearGradient9941"
       gradientUnits="userSpaceOnUse"
       x1="305.5"
       y1="83.375"
       x2="305.5"
       y2="75.623993" />
    <linearGradient
       inkscape:collect="always"
       xlink:href="#linearGradient3832"
       id="linearGradient9939"
       gradientUnits="userSpaceOnUse"
       x1="305.5"
       y1="83.375"
       x2="305.5"
       y2="75.623993" />
    <linearGradient
       inkscape:collect="always"
       xlink:href="#linearGradient3832"
       id="linearGradient9937"
       gradientUnits="userSpaceOnUse"
       x1="305.5"
       y1="83.375"
       x2="305.5"
       y2="75.623993" />
    <linearGradient
       inkscape:collect="always"
       xlink:href="#linearGradient3832"
       id="linearGradient9935"
       gradientUnits="userSpaceOnUse"
       x1="305.5"
       y1="83.375"
       x2="305.5"
       y2="75.623993" />
    <linearGradient
       inkscape:collect="always"
       xlink:href="#linearGradient3832"
       id="linearGradient9933"
       gradientUnits="userSpaceOnUse"
       x1="305.5"
       y1="83.375"
       x2="305.5"
       y2="75.623993" />
    <linearGradient
       inkscape:collect="always"
       xlink:href="#linearGradient3832"
       id="linearGradient9931"
       gradientUnits="userSpaceOnUse"
       x1="305.5"
       y1="83.375"
       x2="305.5"
       y2="75.623993" />
    <linearGradient
       inkscape:collect="always"
       xlink:href="#linearGradient3832"
       id="linearGradient9929"
       gradientUnits="userSpaceOnUse"
       x1="305.5"
       y1="83.375"
       x2="305.5"
       y2="75.623993" />
    <linearGradient
       inkscape:collect="always"
       xlink:href="#linearGradient3832"
       id="linearGradient9927"
       gradientUnits="userSpaceOnUse"
       x1="305.5"
       y1="83.375"
       x2="305.5"
       y2="75.623993" />
    <linearGradient
       inkscape:collect="always"
       id="linearGradient3832">
      <stop
         style="stop-color:#babdb6;stop-opacity:1;"
         offset="0"
         id="stop3834" />
      <stop
         style="stop-color:#babdb6;stop-opacity:0;"
         offset="1"
         id="stop3836" />
    </linearGradient>
    <linearGradient
       inkscape:collect="always"
       xlink:href="#linearGradient3832"
       id="linearGradient10041"
       gradientUnits="userSpaceOnUse"
       x1="305.5"
       y1="83.375"
       x2="305.5"
       y2="75.623993" />
    <linearGradient
       inkscape:collect="always"
       id="linearGradient4574">
      <stop
         style="stop-color:#2e3436;stop-opacity:1"
         offset="0"
         id="stop4576" />
      <stop
         style="stop-color:#888a85;stop-opacity:1"
         offset="1"
         id="stop4578" />
    </linearGradient>
    <linearGradient
       inkscape:collect="always"
       xlink:href="#linearGradient4574"
       id="linearGradient9925"
       gradientUnits="userSpaceOnUse"
       gradientTransform="matrix(0.9167044,0,0,0.8153692,76.67546,19.06288)"
       x1="316.18286"
       y1="83.224533"
       x2="316.18286"
       y2="90.819603" />
    <linearGradient
       inkscape:collect="always"
       id="linearGradient3833">
      <stop
         style="stop-color:#ffffff;stop-opacity:1;"
         offset="0"
         id="stop3835" />
      <stop
         style="stop-color:#ffffff;stop-opacity:0;"
         offset="1"
         id="stop3837" />
    </linearGradient>
    <linearGradient
       inkscape:collect="always"
       xlink:href="#linearGradient3833"
       id="linearGradient9923"
       gradientUnits="userSpaceOnUse"
       x1="178.91721"
       y1="409.98514"
       x2="178.91721"
       y2="371.44675" />
    <linearGradient
       inkscape:collect="always"
       xlink:href="#linearGradient2740"
       id="linearGradient9921"
       gradientUnits="userSpaceOnUse"
       x1="147.5"
       y1="353.40439"
       x2="145.43736"
       y2="404.6619" />
    <filter
       inkscape:collect="always"
       id="filter3523"
       x="-0.006099917"
       width="1.0121998"
       y="-0.36629945"
       height="1.7325989">
      <feGaussianBlur
         inkscape:collect="always"
         stdDeviation="0.57234376"
         id="feGaussianBlur3525" />
    </filter>
    <linearGradient
       inkscape:collect="always"
       id="linearGradient2748">
      <stop
         style="stop-color:#eeeeec;stop-opacity:1"
         offset="0"
         id="stop2750" />
      <stop
         style="stop-color:#babdb6;stop-opacity:1"
         offset="1"
         id="stop2752" />
    </linearGradient>
    <radialGradient
       inkscape:collect="always"
       xlink:href="#linearGradient2748"
       id="radialGradient9919"
       gradientUnits="userSpaceOnUse"
       gradientTransform="matrix(-0.9950172,-1.7234204,1.1254929,-0.6498033,7.41235,817.82855)"
       cx="139.85194"
       cy="260.93466"
       fx="139.85194"
       fy="260.93466"
       r="112.59389" />
    <clipPath
       clipPathUnits="userSpaceOnUse"
       id="clipPath3519">
      <path
         sodipodi:nodetypes="cccsccccsccsscsccccc"
         id="path3521"
         d="M 49.053018,377.91849 C 48.342312,377.99122 47.713462,378.41045 47.372978,379.03851 L 33.092643,405.42136 C 32.920748,405.74568 32.837999,406.09423 32.843749,406.44805 C 32.843921,406.45862 32.843421,406.46859 32.843749,406.47916 L 32.843749,409.46589 L 32.843749,409.77701 L 32.905972,409.77701 C 32.951307,410.03663 33.015025,410.28987 33.154867,410.5237 C 33.54293,411.17259 34.234402,411.57735 34.990466,411.5815 L 255.85342,411.5815 C 256.61879,411.58325 257.33012,411.18224 257.72013,410.5237 C 257.85756,410.29166 257.92585,410.03519 257.96903,409.77701 C 258.01775,409.48565 258.03125,408.90588 258.03125,408.90588 L 258.03125,406.82139 C 258.03125,406.32941 257.99578,405.83393 257.75124,405.39024 L 242.9109,379.0074 C 242.52232,378.32737 241.79626,377.91078 241.01307,377.91849 L 49.270801,377.91849 C 49.198253,377.91482 49.125565,377.91482 49.053018,377.91849 z"
         style="fill:#000000;fill-opacity:1;stroke:none;stroke-width:1;stroke-linecap:square;stroke-linejoin:miter;stroke-miterlimit:4;stroke-dashoffset:0.3612;stroke-opacity:1;display:inline;enable-background:new" />
    </clipPath>
    <linearGradient
       inkscape:collect="always"
       id="linearGradient4538">
      <stop
         style="stop-color:#555753;stop-opacity:1;"
         offset="0"
         id="stop4540" />
      <stop
         style="stop-color:#888a85;stop-opacity:1"
         offset="1"
         id="stop4542" />
    </linearGradient>
    <linearGradient
       inkscape:collect="always"
       xlink:href="#linearGradient4538"
       id="linearGradient9917"
       gradientUnits="userSpaceOnUse"
       x1="110.53181"
       y1="416.36923"
       x2="110.53181"
       y2="360.96701" />
    <linearGradient
       id="linearGradient2740">
      <stop
         style="stop-color:#888a85;stop-opacity:1"
         offset="0"
         id="stop2742" />
      <stop
         style="stop-color:#888a85;stop-opacity:0;"
         offset="1"
         id="stop2744" />
    </linearGradient>
    <linearGradient
       inkscape:collect="always"
       xlink:href="#linearGradient2740"
       id="linearGradient9915"
       gradientUnits="userSpaceOnUse"
       x1="147.5"
       y1="353.40439"
       x2="145.43736"
       y2="404.6619" />
    <filter
       inkscape:collect="always"
       id="filter4804"
       x="-0.034545526"
       width="1.0690911"
       y="-0.24324691"
       height="1.4864938">
      <feGaussianBlur
         inkscape:collect="always"
         stdDeviation="0.64763895"
         id="feGaussianBlur4806" />
    </filter>
    <linearGradient
       inkscape:collect="always"
       id="linearGradient4788-7">
      <stop
         style="stop-color:#ffffff;stop-opacity:1;"
         offset="0"
         id="stop4790-8" />
      <stop
         style="stop-color:#ffffff;stop-opacity:0;"
         offset="1"
         id="stop4792-6" />
    </linearGradient>
    <radialGradient
       inkscape:collect="always"
       xlink:href="#linearGradient4788-7"
       id="radialGradient8975"
       gradientUnits="userSpaceOnUse"
       gradientTransform="matrix(-2.3452637,1.0305331e-6,0.1678059,-1.6711651,1062.4349,156.14514)"
       cx="326.0206"
       cy="58"
       fx="326.0206"
       fy="58"
       r="12.5" />
    <linearGradient
       inkscape:collect="always"
       id="linearGradient5687">
      <stop
         style="stop-color:#ffffff;stop-opacity:1;"
         offset="0"
         id="stop5689" />
      <stop
         style="stop-color:#ffffff;stop-opacity:0;"
         offset="1"
         id="stop5691" />
    </linearGradient>
    <linearGradient
       inkscape:collect="always"
       xlink:href="#linearGradient5687"
       id="linearGradient8973"
       gradientUnits="userSpaceOnUse"
       gradientTransform="matrix(0.1923079,0,0,0.1854838,291.53839,45.645162)"
       x1="88"
       y1="44.5"
       x2="178"
       y2="202.5" />
    <linearGradient
       inkscape:collect="always"
       id="linearGradient4788">
      <stop
         style="stop-color:#ffffff;stop-opacity:1;"
         offset="0"
         id="stop4790" />
      <stop
         style="stop-color:#ffffff;stop-opacity:0;"
         offset="1"
         id="stop4792" />
    </linearGradient>
    <radialGradient
       inkscape:collect="always"
       xlink:href="#linearGradient4788"
       id="radialGradient8971"
       gradientUnits="userSpaceOnUse"
       gradientTransform="matrix(6.4215263,5.8880003e-8,-1.5792387e-8,1.4577864,-1775.5499,-25.551629)"
       cx="327.5"
       cy="58"
       fx="327.5"
       fy="58"
       r="12.5" />
    <linearGradient
       id="linearGradient2699">
      <stop
         style="stop-color:#000000;stop-opacity:1"
         offset="0"
         id="stop2701" />
      <stop
         style="stop-color:#000000;stop-opacity:1"
         offset="1"
         id="stop2703" />
    </linearGradient>
    <radialGradient
       inkscape:collect="always"
       xlink:href="#linearGradient2699"
       id="radialGradient8969"
       gradientUnits="userSpaceOnUse"
       gradientTransform="matrix(2.5089911,0,0,1.0747802,259.76908,42.963911)"
       cx="24.006104"
       cy="37.921711"
       fx="24.006104"
       fy="37.921711"
       r="19.00016" />
    <linearGradient
       inkscape:collect="always"
       id="linearGradient4646">
      <stop
         style="stop-color:#ffffff;stop-opacity:1;"
         offset="0"
         id="stop4648" />
      <stop
         style="stop-color:#ffffff;stop-opacity:0.1"
         offset="1"
         id="stop4650" />
    </linearGradient>
    <radialGradient
       inkscape:collect="always"
       xlink:href="#linearGradient4646"
       id="radialGradient8967"
       gradientUnits="userSpaceOnUse"
       gradientTransform="matrix(-3.0899695,-1.0228037,0.214115,-0.6015075,1278.6302,433.73934)"
       cx="314.36905"
       cy="75.283829"
       fx="314.36905"
       fy="75.283829"
       r="22.000002" />
    <linearGradient
       id="linearGradient5538"
       inkscape:collect="always">
      <stop
         id="stop5540"
         offset="0"
         style="stop-color:#555753;stop-opacity:1;" />
      <stop
         id="stop5542"
         offset="1"
         style="stop-color:#babdb6;stop-opacity:1" />
    </linearGradient>
    <linearGradient
       inkscape:collect="always"
       xlink:href="#linearGradient5538"
       id="linearGradient8965"
       gradientUnits="userSpaceOnUse"
       gradientTransform="matrix(1,0,0,0.9672415,0,3.7680911)"
       x1="333.25"
       y1="97"
       x2="293"
       y2="54.01783" />
    <linearGradient
       inkscape:collect="always"
       id="linearGradient4654">
      <stop
         style="stop-color:#eeeeec;stop-opacity:1"
         offset="0"
         id="stop4656" />
      <stop
         style="stop-color:#babdb6;stop-opacity:1"
         offset="1"
         id="stop4658" />
    </linearGradient>
    <radialGradient
       inkscape:collect="always"
       xlink:href="#linearGradient4654"
       id="radialGradient8963"
       gradientUnits="userSpaceOnUse"
       gradientTransform="matrix(1.1263461,4.0658759,-1.0745854,0.278502,23.033648,-1233.4504)"
       cx="314.30969"
       cy="61.654819"
       fx="314.30969"
       fy="61.654819"
       r="23" />
    <linearGradient
       id="linearGradient3396">
      <stop
         style="stop-color:#ffffff;stop-opacity:1;"
         offset="0"
         id="stop3398" />
      <stop
         id="stop3404"
         offset="0.14204781"
         style="stop-color:#babdb6;stop-opacity:1" />
      <stop
         style="stop-color:#d3d7cf;stop-opacity:1"
         offset="0.88917607"
         id="stop3406" />
      <stop
         style="stop-color:#ffffff;stop-opacity:1"
         offset="1"
         id="stop3400" />
    </linearGradient>
    <linearGradient
       inkscape:collect="always"
       xlink:href="#linearGradient3396"
       id="linearGradient8961"
       gradientUnits="userSpaceOnUse"
       x1="311.625"
       y1="93.5"
       x2="328.25"
       y2="93.5" />
    <linearGradient
       inkscape:collect="always"
       id="linearGradient4713">
      <stop
         style="stop-color:#ffffff;stop-opacity:1;"
         offset="0"
         id="stop4715" />
      <stop
         style="stop-color:#ffffff;stop-opacity:0;"
         offset="1"
         id="stop4717" />
    </linearGradient>
    <radialGradient
       inkscape:collect="always"
       xlink:href="#linearGradient4713"
       id="radialGradient8959"
       gradientUnits="userSpaceOnUse"
       gradientTransform="matrix(1.852385,2.7827307e-8,0,0.3925925,-272.78985,54.512731)"
       cx="320.03125"
       cy="91.50647"
       fx="320.03125"
       fy="91.50647"
       r="8.4375" />
    <linearGradient
       id="linearGradient2702">
      <stop
         id="stop2704"
         offset="0"
         style="stop-color:#555753;stop-opacity:1" />
      <stop
         style="stop-color:#babdb6;stop-opacity:1"
         offset="0.64084536"
         id="stop2706" />
      <stop
         id="stop2708"
         offset="0.85106832"
         style="stop-color:#888a85;stop-opacity:1" />
      <stop
         id="stop2710"
         offset="1"
         style="stop-color:#555753;stop-opacity:1" />
    </linearGradient>
    <linearGradient
       inkscape:collect="always"
       xlink:href="#linearGradient2702"
       id="linearGradient8957"
       gradientUnits="userSpaceOnUse"
       x1="325.8125"
       y1="86.031227"
       x2="325.8125"
       y2="93.728882" />
    <linearGradient
       id="linearGradient4693">
      <stop
         id="stop4695"
         offset="0"
         style="stop-color:#555753;stop-opacity:1" />
      <stop
         style="stop-color:#babdb6;stop-opacity:1"
         offset="0.30146292"
         id="stop4701" />
      <stop
         id="stop3408"
         offset="0.48027775"
         style="stop-color:#eeeeec;stop-opacity:1" />
      <stop
         style="stop-color:#ffffff;stop-opacity:1"
         offset="0.64304489"
         id="stop4699" />
      <stop
         id="stop4697"
         offset="1"
         style="stop-color:#555753;stop-opacity:1" />
    </linearGradient>
    <linearGradient
       inkscape:collect="always"
       xlink:href="#linearGradient4693"
       id="linearGradient8955"
       gradientUnits="userSpaceOnUse"
       x1="320.28125"
       y1="86.913208"
       x2="320.28125"
       y2="93.379616" />
    <filter
       height="2.3388598"
       y="-0.66942996"
       width="1.1218799"
       x="-0.060939956"
       id="filter6655"
       inkscape:collect="always">
      <feGaussianBlur
         id="feGaussianBlur6657"
         stdDeviation="1.1680158"
         inkscape:collect="always" />
    </filter>
    <linearGradient
       inkscape:collect="always"
       id="linearGradient3847">
      <stop
         style="stop-color:#babdb6;stop-opacity:1;"
         offset="0"
         id="stop3849" />
      <stop
         style="stop-color:#babdb6;stop-opacity:0;"
         offset="1"
         id="stop3851" />
    </linearGradient>
    <linearGradient
       inkscape:collect="always"
       xlink:href="#linearGradient3847"
       id="linearGradient9090"
       gradientUnits="userSpaceOnUse"
       gradientTransform="translate(-295.12721,-37.918469)"
       x1="328.62787"
       y1="74.43293"
       x2="327.47882"
       y2="67.36187" />
    <filter
       inkscape:collect="always"
       id="filter4777">
      <feGaussianBlur
         inkscape:collect="always"
         stdDeviation="0.39456135"
         id="feGaussianBlur4779" />
    </filter>
    <linearGradient
       id="linearGradient4783">
      <stop
         id="stop4785"
         offset="0"
         style="stop-color:#000000;stop-opacity:1" />
      <stop
         id="stop4787"
         offset="1"
         style="stop-color:#000000;stop-opacity:0;" />
    </linearGradient>
    <linearGradient
       inkscape:collect="always"
       xlink:href="#linearGradient4783"
       id="linearGradient9088"
       gradientUnits="userSpaceOnUse"
       gradientTransform="translate(-294.97889,-38.39488)"
       x1="329.86533"
       y1="75.493599"
       x2="327.39044"
       y2="69.836746" />
    <filter
       inkscape:collect="always"
       id="filter11642"
       x="-0.066728197"
       width="1.1334563"
       y="-0.69905728"
       height="2.3981147">
      <feGaussianBlur
         inkscape:collect="always"
         stdDeviation="0.76459391"
         id="feGaussianBlur11644" />
    </filter>
  </defs>
  <sodipodi:namedview
     id="base"
     pagecolor="#ffffff"
     bordercolor="#666666"
     borderopacity="1.0"
     inkscape:pageopacity="0.0"
     inkscape:pageshadow="2"
     inkscape:zoom="7"
     inkscape:cx="24"
     inkscape:cy="24"
     inkscape:current-layer="layer1"
     showgrid="true"
     inkscape:grid-bbox="true"
     inkscape:document-units="px"
     inkscape:window-width="641"
     inkscape:window-height="690"
     inkscape:window-x="0"
     inkscape:window-y="25" />
  <metadata
     id="metadata7524">
    <rdf:RDF>
      <cc:Work
         rdf:about="">
        <dc:format>image/svg+xml</dc:format>
        <dc:type
           rdf:resource="http://purl.org/dc/dcmitype/StillImage" />
      </cc:Work>
    </rdf:RDF>
  </metadata>
  <g
     id="layer1"
     inkscape:label="Layer 1"
     inkscape:groupmode="layer">
    <rect
       transform="matrix(0.7818182,0,0,0.7235787,-226.35001,-30.805213)"
       ry="1.8139008"
       rx="1.3125"
       y="93"
       x="306.625"
       height="2.625"
       width="27.5"
       id="rect10838"
       style="opacity:0.47150263;fill:#000000;fill-opacity:1;fill-rule:nonzero;stroke:none;stroke-width:1;marker:none;visibility:visible;display:inline;overflow:visible;filter:url(#filter11642);enable-background:accumulate" />
    <path
       style="opacity:0.21461188;fill:none;fill-opacity:1;fill-rule:evenodd;stroke:url(#linearGradient9088);stroke-width:0.69999999;stroke-linecap:butt;stroke-linejoin:miter;stroke-miterlimit:4;stroke-dasharray:none;stroke-opacity:1;display:inline;filter:url(#filter4777);enable-background:new"
       d="M 39.798245,44.10512 C 39.798245,44.10512 36.512425,41.27028 37.279775,39.173109 C 38.213515,36.621199 47.458605,39.081156 47.458605,37.284254 C 47.458605,34.398167 26.583655,37.368461 26.051575,35.395399"
       id="path4625"
       sodipodi:nodetypes="csss" />
    <path
       style="fill:none;fill-opacity:1;fill-rule:evenodd;stroke:url(#linearGradient9090);stroke-width:1;stroke-linecap:butt;stroke-linejoin:miter;stroke-miterlimit:4;stroke-dasharray:none;stroke-opacity:1;display:inline;enable-background:new"
       d="M 39.798245,43.547062 C 39.798245,43.547062 36.512425,40.712222 37.279775,38.615051 C 38.213515,36.063141 47.458605,38.523098 47.458605,36.726196 C 47.458605,33.840109 26.583655,36.810403 26.051575,34.837341"
       id="path3590"
       sodipodi:nodetypes="cssc" />
    <g
       id="g256"
       style="display:inline;enable-background:new"
       transform="translate(1203.6157,183.08346)" />
    <g
       id="g4021"
       style="display:inline;enable-background:new"
       transform="translate(605.63799,523.85886)" />
    <g
       id="g4445"
       style="display:inline;enable-background:new"
       transform="translate(790.6157,90.837429)" />
    <g
       id="g5542"
       style="display:inline;enable-background:new"
       transform="translate(819.21873,319.35215)" />
    <g
       id="g11680"
       transform="matrix(1,0,0,0.7235787,-296.24984,-30.805213)"
       style="opacity:0.47150263;display:inline;enable-background:new" />
    <g
       style="display:inline;enable-background:new"
       id="g8934"
       transform="translate(-295.99975,-20.000497)">
      <g
         transform="translate(0,-37)"
         id="g2789">
        <rect
           transform="matrix(0.9673917,0,0,0.9552235,10.434651,6.2537675)"
           ry="1.4394537"
           rx="1.5812495"
           y="90.8125"
           x="297"
           height="4.1875"
           width="46"
           id="rect6551"
           style="opacity:0.06024098;fill:#2e3436;fill-opacity:1;fill-rule:nonzero;stroke:none;stroke-width:1;stroke-linecap:round;stroke-linejoin:miter;marker:none;marker-start:none;marker-mid:none;marker-end:none;stroke-miterlimit:4;stroke-dasharray:none;stroke-dashoffset:0;stroke-opacity:1;visibility:visible;display:inline;overflow:visible;filter:url(#filter6655);enable-background:accumulate" />
      </g>
      <g
         transform="translate(0,-37)"
         id="g2784">
        <path
           style="fill:url(#linearGradient8955);fill-opacity:1;stroke:url(#linearGradient8957);stroke-width:1;stroke-linecap:round;stroke-linejoin:round;stroke-miterlimit:4;stroke-dasharray:none;stroke-dashoffset:0.50000001;stroke-opacity:1;display:inline;enable-background:new"
           d="M 314.5,82.5 C 314.5,82.5 314.5,89.5 314.5,89.5 C 314.4779,91.30197 311.625,92.5 311.625,92.5 C 310.87364,92.588427 310.5,92.946 310.5,93.5 C 310.5,94.054 311.00583,94.5 311.625,94.5 L 328.4375,94.5 C 329.05667,94.5 329.5625,94.054 329.5625,93.5 C 329.5625,92.946 329.18886,92.588427 328.4375,92.5 C 328.4375,92.5 325.5846,91.30197 325.5625,89.5 C 325.5625,89.5 325.5625,82.5 325.5625,82.5 L 314.5,82.5 z"
           id="path4675"
           sodipodi:nodetypes="cccsccscccc" />
        <path
           sodipodi:type="inkscape:offset"
           inkscape:radius="-1.0625"
           inkscape:original="M 314.5 82.5 C 314.5 82.5 314.5 89.5 314.5 89.5 C 314.4779 91.30197 311.625 92.5 311.625 92.5 C 310.87364 92.588427 310.5 92.946 310.5 93.5 C 310.5 94.054 311.00583 94.5 311.625 94.5 L 328.4375 94.5 C 329.05667 94.5 329.5625 94.054 329.5625 93.5 C 329.5625 92.946 329.18886 92.588427 328.4375 92.5 C 328.4375 92.5 325.5846 91.30197 325.5625 89.5 C 325.5625 89.5 325.5625 82.5 325.5625 82.5 L 314.5 82.5 z "
           style="fill:none;fill-opacity:1;stroke:url(#radialGradient8959);stroke-width:1;stroke-linecap:round;stroke-linejoin:round;stroke-miterlimit:4;stroke-dasharray:none;stroke-dashoffset:0.50000001;stroke-opacity:1;display:inline;enable-background:new"
           id="path4709"
           d="M 315.5625,83.5625 C 315.5625,85.091368 315.5625,89.5 315.5625,89.5 C 315.54461,90.958692 314.51936,91.92157 313.6875,92.53125 C 312.88614,93.118574 312.15023,93.41376 312.09375,93.4375 L 327.96875,93.4375 C 327.91227,93.41376 327.17636,93.118574 326.375,92.53125 C 325.54314,91.92157 324.51789,90.958692 324.5,89.5 C 324.5,89.5 324.5,85.091368 324.5,83.5625 L 315.5625,83.5625 z" />
        <rect
           style="fill:url(#linearGradient8961);fill-opacity:1;stroke:none;stroke-width:0.99999994;stroke-linecap:round;stroke-linejoin:round;stroke-miterlimit:4;stroke-dasharray:none;stroke-dashoffset:0.50000001;stroke-opacity:1;display:inline;enable-background:new"
           id="rect4703"
           width="18"
           height="1.0000002"
           x="311"
           y="93"
           rx="0.50000012"
           ry="0.50000012" />
      </g>
      <g
         transform="matrix(1.0434783,0,0,1,-13.913043,-36)"
         id="g2795">
        <rect
           style="fill:url(#radialGradient8963);fill-opacity:1;stroke:url(#linearGradient8965);stroke-width:0.97894514;stroke-linecap:round;stroke-linejoin:round;stroke-miterlimit:4;stroke-dasharray:none;stroke-dashoffset:0.50000001;stroke-opacity:1"
           id="rect2722"
           width="45"
           height="29"
           x="297.5"
           y="56.5"
           rx="1.0625"
           ry="1.0276941" />
        <rect
           style="fill:none;fill-opacity:1;stroke:url(#radialGradient8967);stroke-width:0.97894514;stroke-linecap:round;stroke-linejoin:round;stroke-miterlimit:4;stroke-dasharray:none;stroke-dashoffset:0.50000001;stroke-opacity:1;display:inline;enable-background:new"
           id="rect4642"
           width="43.000004"
           height="27.017836"
           x="298.5"
           y="57.5"
           rx="0"
           ry="0" />
        <rect
           style="opacity:0.15;fill:none;fill-opacity:1;stroke:#ffffff;stroke-width:0.97894514;stroke-linecap:round;stroke-linejoin:round;stroke-miterlimit:4;stroke-dasharray:none;stroke-dashoffset:0.50000001;stroke-opacity:1;display:inline;enable-background:new"
           id="rect5043"
           width="43.124969"
           height="27.017836"
           x="298.43753"
           y="57.5"
           rx="0"
           ry="0" />
        <path
           style="fill:#888a85;fill-opacity:1;stroke:#555753;stroke-width:0.97894502;stroke-linecap:butt;stroke-linejoin:round;stroke-miterlimit:4;stroke-dashoffset:0.50000001;stroke-opacity:1"
           d="M 337.73478,86.002816 C 337.73478,86.002816 337.72915,85.5 337.72915,85.5 C 337.72915,84.946 338.17515,84.5 338.72915,84.5 C 339.28315,84.5 339.72915,84.946 339.72915,85.5 C 339.72915,85.5 339.74477,85.998552 339.74477,85.998552"
           id="rect5045"
           sodipodi:nodetypes="cscss" />
      </g>
      <g
         transform="matrix(1.047619,0,0,0.9600002,-15.238095,-32.68001)"
         id="g2758">
        <rect
           y="58.500004"
           x="299.5"
           height="24"
           width="41"
           id="rect2716"
           style="fill:url(#radialGradient8969);fill-opacity:1;fill-rule:evenodd;stroke:#000000;stroke-width:0.99715501px;stroke-linecap:butt;stroke-linejoin:miter;stroke-opacity:1;display:inline;enable-background:new" />
        <path
           style="opacity:0.24497992;fill:url(#radialGradient8971);fill-opacity:1;stroke:none;stroke-width:1;stroke-linecap:round;stroke-linejoin:round;stroke-miterlimit:4;stroke-dashoffset:0.50000001;stroke-opacity:1"
           d="M 330,59 L 340,59 L 340,82 L 318,82 L 330,59 z"
           id="rect4785"
           sodipodi:nodetypes="ccccc" />
        <rect
           style="opacity:0.15;fill:url(#linearGradient8973);fill-opacity:1;fill-rule:evenodd;stroke:none;stroke-width:0.19827586px;stroke-linecap:butt;stroke-linejoin:miter;stroke-opacity:1;display:inline;enable-background:new"
           id="rect3466"
           width="40.000061"
           height="23"
           x="299.99994"
           y="59" />
        <path
           style="opacity:0.24497992;fill:url(#radialGradient8975);fill-opacity:1;stroke:none;display:inline;enable-background:new"
           d="M 317.0849,59.217901 L 324.79566,59.217901 L 315.63422,79.135653 L 311.85218,78.911858 L 317.0849,59.217901 L 317.0849,59.217901 z"
           id="path10688-3"
           sodipodi:nodetypes="ccccc" />
      </g>
    </g>
    <g
       style="display:inline;enable-background:new"
       id="g9846"
       transform="translate(-345.99975,-50.000497)">
      <path
         transform="matrix(0.977821,0,0,0.8509468,57.118094,22.22236)"
         sodipodi:nodetypes="ccccc"
         id="path4789"
         d="M 300.26999,82 L 297.50623,88.374691 L 342.5,88.389941 L 339.62033,82 L 300.26999,82 z"
         style="opacity:0.6;fill:#000000;fill-opacity:1;stroke:none;stroke-width:0.99999976;stroke-linecap:square;stroke-linejoin:round;stroke-miterlimit:4;stroke-dashoffset:0.3612;stroke-opacity:1;display:inline;filter:url(#filter4804);enable-background:new" />
      <path
         transform="matrix(0.1878343,0,0,0.1596571,342.70276,30.499403)"
         d="M 48.84375,375.8125 C 47.435282,375.95664 46.206014,376.78657 45.53125,378.03125 L 31.25,404.40625 C 30.914755,405.03876 30.73848,405.75988 30.75,406.46875 C 30.748746,406.39129 30.746329,406.41294 30.75,406.53125 L 30.75,409.46875 L 30.75,409.78125 C 30.745943,410.21651 30.87696,410.64231 31.125,411 C 31.201261,411.21987 31.198308,411.38181 31.34375,411.625 C 32.103454,412.89529 33.491398,413.67922 35,413.6875 L 255.84375,413.6875 C 257.35566,413.69094 258.75604,412.9027 259.53125,411.59375 C 259.86135,411.03642 259.96546,410.51837 260.03125,410.125 C 260.14476,409.44634 260.125,408.96875 260.125,408.96875 C 260.12531,408.94792 260.12531,408.92708 260.125,408.90625 L 260.125,406.8125 C 260.125,406.21586 260.11907,405.29688 259.59375,404.34375 L 244.75,377.96875 C 244.73958,377.96867 244.72917,377.96867 244.71875,377.96875 C 243.94931,376.62222 242.5196,375.79723 240.96875,375.8125 L 49.375,375.8125 C 49.341697,375.81082 49.314423,375.81341 49.28125,375.8125 C 49.170672,375.80948 49.079762,375.80688 48.96875,375.8125 C 48.927093,375.81126 48.885407,375.81126 48.84375,375.8125 z"
         id="path3698"
         style="fill:url(#linearGradient9915);fill-opacity:1;stroke:url(#linearGradient9917);stroke-width:5.77455425;stroke-linecap:square;stroke-linejoin:miter;stroke-miterlimit:4;stroke-dasharray:none;stroke-dashoffset:0.3612;stroke-opacity:1;display:inline;enable-background:new"
         inkscape:original="M 49.0625 377.90625 C 48.351795 377.97898 47.715484 378.40319 47.375 379.03125 L 33.09375 405.40625 C 32.921854 405.73057 32.838 406.08368 32.84375 406.4375 C 32.843921 406.44806 32.843422 406.45818 32.84375 406.46875 L 32.84375 409.46875 L 32.84375 409.78125 L 32.90625 409.78125 C 32.951585 410.04087 33.016408 410.29742 33.15625 410.53125 C 33.544315 411.18013 34.243936 411.5896 35 411.59375 L 255.84375 411.59375 C 256.60912 411.59549 257.32874 411.18979 257.71875 410.53125 C 257.85619 410.2992 257.92557 410.03943 257.96875 409.78125 C 258.01748 409.48989 258.03125 408.90625 258.03125 408.90625 L 258.03125 406.8125 C 258.03125 406.32053 257.99454 405.81869 257.75 405.375 L 242.90625 379 C 242.51767 378.31998 241.78319 377.89854 241 377.90625 L 49.28125 377.90625 C 49.208701 377.90258 49.135047 377.90258 49.0625 377.90625 z "
         inkscape:radius="2.1041079"
         sodipodi:type="inkscape:offset" />
      <g
         transform="matrix(0.1872588,0,0,0.1485186,342.78643,34.872494)"
         clip-path="url(#clipPath3519)"
         id="g3594"
         style="display:inline;enable-background:new">
        <path
           style="fill:url(#radialGradient9919);fill-opacity:1;stroke:none;stroke-width:1;stroke-linecap:square;stroke-linejoin:miter;stroke-miterlimit:4;stroke-dashoffset:0.3612;stroke-opacity:1;display:inline;enable-background:new"
           d="M 49.053018,377.91849 C 48.342312,377.99122 47.713462,378.41045 47.372978,379.03851 L 33.092643,405.42136 C 32.920748,405.74568 32.837999,406.09423 32.843749,406.44805 C 32.843921,406.45862 32.843421,406.46859 32.843749,406.47916 L 32.843749,409.46589 L 32.843749,409.77701 L 32.905972,409.77701 C 32.951307,410.03663 33.015025,410.28987 33.154867,410.5237 C 33.54293,411.17259 34.234402,411.57735 34.990466,411.5815 L 255.85342,411.5815 C 256.61879,411.58325 257.33012,411.18224 257.72013,410.5237 C 257.85756,410.29166 257.92585,410.03519 257.96903,409.77701 C 258.01775,409.48565 258.03125,408.90588 258.03125,408.90588 L 258.03125,406.82139 C 258.03125,406.32941 257.99578,405.83393 257.75124,405.39024 L 242.9109,379.0074 C 242.52232,378.32737 241.79626,377.91078 241.01307,377.91849 L 49.270801,377.91849 C 49.198253,377.91482 49.125565,377.91482 49.053018,377.91849 z"
           id="path3596"
           sodipodi:nodetypes="cccsccccsccsscsccccc" />
        <path
           style="opacity:1;fill:#ffffff;fill-opacity:1;stroke:none;stroke-width:1;stroke-linecap:square;stroke-linejoin:miter;stroke-miterlimit:4;stroke-dashoffset:0.3612;stroke-opacity:1;display:inline;filter:url(#filter3523);enable-background:new"
           d="M 32.84375,407.84375 L 32.84375,409.46875 L 32.84375,409.78125 L 32.90625,409.78125 C 32.95158,410.04087 33.01641,410.29742 33.15625,410.53125 C 33.5443,411.18013 34.24393,411.5896 35,411.59375 L 255.84375,411.59375 C 256.60915,411.59549 257.32874,411.18979 257.71875,410.53125 C 257.85616,410.2992 257.92557,410.03943 257.96875,409.78125 C 258.01744,409.48989 258.03125,408.90625 258.03125,408.90625 L 258.03125,407.84375 C 257.62159,408.34791 257.0046,408.65776 256.34375,408.65625 L 34.5,408.65625 C 33.84719,408.65267 33.24985,408.34097 32.84375,407.84375 z"
           id="path3598" />
        <path
           style="fill:url(#linearGradient9921);fill-opacity:1;stroke:none;stroke-width:1;stroke-linecap:square;stroke-linejoin:miter;stroke-miterlimit:4;stroke-dashoffset:0.3612;stroke-opacity:1;display:inline;enable-background:new"
           d="M 49.053018,377.91849 C 48.342312,377.99122 47.713462,378.41045 47.372978,379.03851 L 33.092643,405.42136 C 32.920748,405.74568 32.837999,406.09423 32.843749,406.44805 C 32.843921,406.45862 32.843421,406.46859 32.843749,406.47916 L 32.843749,409.46589 L 32.843749,409.77701 L 32.905972,409.77701 C 32.951307,410.03663 33.015025,410.28987 33.154867,410.5237 C 33.54293,411.17259 34.234402,411.57735 34.990466,411.5815 L 255.85342,411.5815 C 256.61879,411.58325 257.33012,411.18224 257.72013,410.5237 C 257.85756,410.29166 257.92585,410.03519 257.96903,409.77701 C 258.01775,409.48565 258.03125,408.90588 258.03125,408.90588 L 258.03125,406.82139 C 258.03125,406.32941 257.99578,405.83393 257.75124,405.39024 L 242.9109,379.0074 C 242.52232,378.32737 241.79626,377.91078 241.01307,377.91849 L 49.270801,377.91849 C 49.198253,377.91482 49.125565,377.91482 49.053018,377.91849 z"
           id="path3600"
           sodipodi:nodetypes="cccsccccsccsscsccccc" />
      </g>
      <path
         sodipodi:nodetypes="cccccccccccccccccccccccc"
         id="path3702"
         d="M 353.09083,90 L 350.77007,95.06953 L 375.582,95.063207 L 374.92639,90 L 353.09083,90 z M 376.06066,90 L 376.42038,92.567703 L 381.27079,92.567703 L 380.59197,90 L 376.06066,90 z M 381.72774,90.810116 L 383.02736,95.063207 L 389.27165,95.063207 L 387.27579,90.810116 L 381.72774,90.810116 z M 378.21318,93.240449 L 378.34082,94.050559 L 376.74529,94.050559 L 376.90774,95.063207 L 382.00764,95.063207 L 381.68853,94.050559 L 380.05238,94.050559 L 379.84933,93.240449 L 378.21318,93.240449 z"
         style="opacity:0.8310502;fill:#555753;fill-opacity:1;fill-rule:evenodd;stroke:none;stroke-width:1px;stroke-linecap:butt;stroke-linejoin:miter;stroke-opacity:1;display:inline;enable-background:new" />
      <path
         transform="matrix(0.1867514,0,0,0.1394339,342.86027,38.458456)"
         d="M 49.5,380.40625 L 35.34375,406.53125 L 35.34375,409.09375 L 255.53125,409.09375 C 255.5417,408.94999 255.53125,408.84375 255.53125,408.84375 L 255.53125,406.8125 C 255.53125,406.44538 255.47213,406.42979 255.5625,406.59375 L 240.8125,380.40625 L 49.5,380.40625 z"
         id="path8710"
         style="opacity:0.84474888;fill:none;fill-opacity:1;stroke:url(#linearGradient9923);stroke-width:6.19703245;stroke-linecap:square;stroke-linejoin:round;stroke-miterlimit:4;stroke-dasharray:none;stroke-dashoffset:0.3612;stroke-opacity:1;display:inline;enable-background:new"
         inkscape:original="M 49.0625 377.90625 C 48.351795 377.97898 47.715484 378.40319 47.375 379.03125 L 33.09375 405.40625 C 32.921854 405.73057 32.838 406.08368 32.84375 406.4375 C 32.843921 406.44806 32.843422 406.45818 32.84375 406.46875 L 32.84375 409.46875 L 32.84375 409.78125 L 32.90625 409.78125 C 32.951585 410.04087 33.016408 410.29742 33.15625 410.53125 C 33.544315 411.18013 34.243936 411.5896 35 411.59375 L 255.84375 411.59375 C 256.60912 411.59549 257.32874 411.18979 257.71875 410.53125 C 257.85619 410.2992 257.92557 410.03943 257.96875 409.78125 C 258.01748 409.48989 258.03125 408.90625 258.03125 408.90625 L 258.03125 406.8125 C 258.03125 406.32053 257.99454 405.81869 257.75 405.375 L 242.90625 379 C 242.51767 378.31998 241.78319 377.89854 241 377.90625 L 49.28125 377.90625 C 49.208701 377.90258 49.135047 377.90258 49.0625 377.90625 z "
         inkscape:radius="-2.5097508"
         sodipodi:type="inkscape:offset" />
      <path
         sodipodi:nodetypes="cccccccccccccccccccccccc"
         id="path3704"
         d="M 353.09083,90 L 350.77007,94.076847 L 375.582,94.071757 L 374.92639,90 L 353.09083,90 z M 376.06066,90 L 376.42038,92.06491 L 381.27079,92.06491 L 380.59197,90 L 376.06066,90 z M 381.72774,90.651483 L 383.02736,94.071757 L 389.27165,94.071757 L 387.27579,90.651483 L 381.72774,90.651483 z M 378.21318,92.605925 L 378.34082,93.257401 L 376.74529,93.257401 L 376.90774,94.071757 L 382.00764,94.071757 L 381.68853,93.257401 L 380.05238,93.257401 L 379.84933,92.605925 L 378.21318,92.605925 z"
         style="fill:url(#linearGradient9925);fill-opacity:1;fill-rule:evenodd;stroke:none;stroke-width:1px;stroke-linecap:butt;stroke-linejoin:miter;stroke-opacity:1;display:inline;enable-background:new" />
      <g
         transform="translate(50.020859,10.047559)"
         style="fill:url(#linearGradient10041);fill-opacity:1"
         id="g3735">
        <rect
           style="opacity:0.55363734;fill:url(#linearGradient9927);fill-opacity:1;stroke:none;stroke-width:1;stroke-linecap:round;stroke-linejoin:round;stroke-miterlimit:4;stroke-dasharray:none;stroke-dashoffset:0.3612;stroke-opacity:1;display:inline;enable-background:new"
           id="rect4584"
           width="1"
           height="1"
           x="302"
           y="82"
           rx="0.28125"
           ry="0.28125" />
        <rect
           style="opacity:0.55363734;fill:url(#linearGradient9929);fill-opacity:1;stroke:none;stroke-width:1;stroke-linecap:round;stroke-linejoin:round;stroke-miterlimit:4;stroke-dasharray:none;stroke-dashoffset:0.3612;stroke-opacity:1;display:inline;enable-background:new"
           id="rect4586"
           width="1"
           height="1"
           x="301"
           y="83"
           rx="0.28125"
           ry="0.28125" />
        <rect
           style="opacity:0.55363734;fill:url(#linearGradient9931);fill-opacity:1;stroke:none;stroke-width:1;stroke-linecap:round;stroke-linejoin:round;stroke-miterlimit:4;stroke-dasharray:none;stroke-dashoffset:0.3612;stroke-opacity:1;display:inline;enable-background:new"
           id="rect4590"
           width="1"
           height="1"
           x="303"
           y="81"
           rx="0.28125"
           ry="0.28125" />
        <rect
           style="opacity:0.55363734;fill:url(#linearGradient9933);fill-opacity:1;stroke:none;stroke-width:1;stroke-linecap:round;stroke-linejoin:round;stroke-miterlimit:4;stroke-dasharray:none;stroke-dashoffset:0.3612;stroke-opacity:1;display:inline;enable-background:new"
           id="rect4592"
           width="1"
           height="1"
           x="303"
           y="83"
           rx="0.28125"
           ry="0.28125" />
        <rect
           style="opacity:0.55363734;fill:url(#linearGradient9935);fill-opacity:1;stroke:none;stroke-width:1;stroke-linecap:round;stroke-linejoin:round;stroke-miterlimit:4;stroke-dasharray:none;stroke-dashoffset:0.3612;stroke-opacity:1;display:inline;enable-background:new"
           id="rect4594"
           width="1"
           height="1"
           x="304"
           y="80"
           rx="0.28125"
           ry="0.28125" />
        <rect
           style="opacity:0.55363734;fill:url(#linearGradient9937);fill-opacity:1;stroke:none;stroke-width:1;stroke-linecap:round;stroke-linejoin:round;stroke-miterlimit:4;stroke-dasharray:none;stroke-dashoffset:0.3612;stroke-opacity:1"
           id="rect4607"
           width="1"
           height="1"
           x="306"
           y="80"
           rx="0.28125"
           ry="0.28125" />
        <rect
           style="opacity:0.55363734;fill:url(#linearGradient9939);fill-opacity:1;stroke:none;stroke-width:1;stroke-linecap:round;stroke-linejoin:round;stroke-miterlimit:4;stroke-dasharray:none;stroke-dashoffset:0.3612;stroke-opacity:1;display:inline;enable-background:new"
           id="rect4609"
           width="1"
           height="1"
           x="306"
           y="82"
           rx="0.28125"
           ry="0.28125" />
        <rect
           style="opacity:0.55363734;fill:url(#linearGradient9941);fill-opacity:1;stroke:none;stroke-width:1;stroke-linecap:round;stroke-linejoin:round;stroke-miterlimit:4;stroke-dasharray:none;stroke-dashoffset:0.3612;stroke-opacity:1;display:inline;enable-background:new"
           id="rect4611"
           width="1"
           height="1"
           x="305"
           y="83"
           rx="0.28125"
           ry="0.28125" />
        <rect
           style="opacity:0.55363734;fill:url(#linearGradient9943);fill-opacity:1;stroke:none;stroke-width:1;stroke-linecap:round;stroke-linejoin:round;stroke-miterlimit:4;stroke-dasharray:none;stroke-dashoffset:0.3612;stroke-opacity:1;display:inline;enable-background:new"
           id="rect4613"
           width="1"
           height="1"
           x="305"
           y="81"
           rx="0.28125"
           ry="0.28125" />
        <rect
           style="opacity:0.55363734;fill:url(#linearGradient9945);fill-opacity:1;stroke:none;stroke-width:1;stroke-linecap:round;stroke-linejoin:round;stroke-miterlimit:4;stroke-dasharray:none;stroke-dashoffset:0.3612;stroke-opacity:1;display:inline;enable-background:new"
           id="rect4615"
           width="1"
           height="1"
           x="307"
           y="81"
           rx="0.28125"
           ry="0.28125" />
        <rect
           style="opacity:0.55363734;fill:url(#linearGradient9947);fill-opacity:1;stroke:none;stroke-width:1;stroke-linecap:round;stroke-linejoin:round;stroke-miterlimit:4;stroke-dasharray:none;stroke-dashoffset:0.3612;stroke-opacity:1;display:inline;enable-background:new"
           id="rect4619"
           width="1"
           height="1"
           x="308"
           y="80"
           rx="0.28125"
           ry="0.28125" />
        <rect
           style="opacity:0.55363734;fill:url(#linearGradient9949);fill-opacity:1;stroke:none;stroke-width:1;stroke-linecap:round;stroke-linejoin:round;stroke-miterlimit:4;stroke-dasharray:none;stroke-dashoffset:0.3612;stroke-opacity:1;display:inline;enable-background:new"
           id="rect4628"
           width="1"
           height="1"
           x="308"
           y="82"
           rx="0.28125"
           ry="0.28125" />
        <rect
           style="opacity:0.55363734;fill:url(#linearGradient9951);fill-opacity:1;stroke:none;stroke-width:1;stroke-linecap:round;stroke-linejoin:round;stroke-miterlimit:4;stroke-dasharray:none;stroke-dashoffset:0.3612;stroke-opacity:1;display:inline;enable-background:new"
           id="rect4630"
           width="1"
           height="1"
           x="304"
           y="82"
           rx="0.28125"
           ry="0.28125" />
        <rect
           style="opacity:0.55363734;fill:url(#linearGradient9953);fill-opacity:1;stroke:none;stroke-width:1;stroke-linecap:round;stroke-linejoin:round;stroke-miterlimit:4;stroke-dasharray:none;stroke-dashoffset:0.3612;stroke-opacity:1;display:inline;enable-background:new"
           id="rect4639"
           width="1"
           height="1"
           x="310"
           y="80"
           rx="0.28125"
           ry="0.28125" />
        <rect
           style="opacity:0.55363734;fill:url(#linearGradient9955);fill-opacity:1;stroke:none;stroke-width:1;stroke-linecap:round;stroke-linejoin:round;stroke-miterlimit:4;stroke-dasharray:none;stroke-dashoffset:0.3612;stroke-opacity:1;display:inline;enable-background:new"
           id="rect4641"
           width="1"
           height="1"
           x="310"
           y="82"
           rx="0.28125"
           ry="0.28125" />
        <rect
           style="opacity:0.55363734;fill:url(#linearGradient9957);fill-opacity:1;stroke:none;stroke-width:1;stroke-linecap:round;stroke-linejoin:round;stroke-miterlimit:4;stroke-dasharray:none;stroke-dashoffset:0.3612;stroke-opacity:1;display:inline;enable-background:new"
           id="rect4645"
           width="1"
           height="1"
           x="309"
           y="81"
           rx="0.28125"
           ry="0.28125" />
        <rect
           style="opacity:0.55363734;fill:url(#linearGradient9959);fill-opacity:1;stroke:none;stroke-width:1;stroke-linecap:round;stroke-linejoin:round;stroke-miterlimit:4;stroke-dasharray:none;stroke-dashoffset:0.3612;stroke-opacity:1;display:inline;enable-background:new"
           id="rect4647"
           width="1"
           height="1"
           x="311"
           y="81"
           rx="0.28125"
           ry="0.28125" />
        <rect
           style="opacity:0.55363734;fill:url(#linearGradient9961);fill-opacity:1;stroke:none;stroke-width:1;stroke-linecap:round;stroke-linejoin:round;stroke-miterlimit:4;stroke-dasharray:none;stroke-dashoffset:0.3612;stroke-opacity:1;display:inline;enable-background:new"
           id="rect4651"
           width="1"
           height="1"
           x="312"
           y="80"
           rx="0.28125"
           ry="0.28125" />
        <rect
           style="opacity:0.55363734;fill:url(#linearGradient9963);fill-opacity:1;stroke:none;stroke-width:1;stroke-linecap:round;stroke-linejoin:round;stroke-miterlimit:4;stroke-dasharray:none;stroke-dashoffset:0.3612;stroke-opacity:1;display:inline;enable-background:new"
           id="rect4653"
           width="1"
           height="1"
           x="314"
           y="80"
           rx="0.28125"
           ry="0.28125" />
        <rect
           style="opacity:0.55363734;fill:url(#linearGradient9965);fill-opacity:1;stroke:none;stroke-width:1;stroke-linecap:round;stroke-linejoin:round;stroke-miterlimit:4;stroke-dasharray:none;stroke-dashoffset:0.3612;stroke-opacity:1;display:inline;enable-background:new"
           id="rect4655"
           width="1"
           height="1"
           x="314"
           y="82"
           rx="0.28125"
           ry="0.28125" />
        <rect
           style="opacity:0.55363734;fill:url(#linearGradient9967);fill-opacity:1;stroke:none;stroke-width:1;stroke-linecap:round;stroke-linejoin:round;stroke-miterlimit:4;stroke-dasharray:none;stroke-dashoffset:0.3612;stroke-opacity:1;display:inline;enable-background:new"
           id="rect4659"
           width="1"
           height="1"
           x="313"
           y="81"
           rx="0.28125"
           ry="0.28125" />
        <rect
           style="opacity:0.55363734;fill:url(#linearGradient9969);fill-opacity:1;stroke:none;stroke-width:1;stroke-linecap:round;stroke-linejoin:round;stroke-miterlimit:4;stroke-dasharray:none;stroke-dashoffset:0.3612;stroke-opacity:1;display:inline;enable-background:new"
           id="rect4661"
           width="1"
           height="1"
           x="315"
           y="81"
           rx="0.28125"
           ry="0.28125" />
        <rect
           style="opacity:0.55363734;fill:url(#linearGradient9971);fill-opacity:1;stroke:none;stroke-width:1;stroke-linecap:round;stroke-linejoin:round;stroke-miterlimit:4;stroke-dasharray:none;stroke-dashoffset:0.3612;stroke-opacity:1;display:inline;enable-background:new"
           id="rect4665"
           width="1"
           height="1"
           x="316"
           y="80"
           rx="0.28125"
           ry="0.28125" />
        <rect
           style="opacity:0.55363734;fill:url(#linearGradient9973);fill-opacity:1;stroke:none;stroke-width:1;stroke-linecap:round;stroke-linejoin:round;stroke-miterlimit:4;stroke-dasharray:none;stroke-dashoffset:0.3612;stroke-opacity:1;display:inline;enable-background:new"
           id="rect4667"
           width="1"
           height="1"
           x="316"
           y="82"
           rx="0.28125"
           ry="0.28125" />
        <rect
           style="opacity:0.55363734;fill:url(#linearGradient9975);fill-opacity:1;stroke:none;stroke-width:1;stroke-linecap:round;stroke-linejoin:round;stroke-miterlimit:4;stroke-dasharray:none;stroke-dashoffset:0.3612;stroke-opacity:1;display:inline;enable-background:new"
           id="rect4669"
           width="1"
           height="1"
           x="312"
           y="82"
           rx="0.28125"
           ry="0.28125" />
        <rect
           style="opacity:0.55363734;fill:url(#linearGradient9977);fill-opacity:1;stroke:none;stroke-width:1;stroke-linecap:round;stroke-linejoin:round;stroke-miterlimit:4;stroke-dasharray:none;stroke-dashoffset:0.3612;stroke-opacity:1;display:inline;enable-background:new"
           id="rect4671"
           width="1"
           height="1"
           x="318"
           y="80"
           rx="0.28125"
           ry="0.28125" />
        <rect
           style="opacity:0.55363734;fill:url(#linearGradient9979);fill-opacity:1;stroke:none;stroke-width:1;stroke-linecap:round;stroke-linejoin:round;stroke-miterlimit:4;stroke-dasharray:none;stroke-dashoffset:0.3612;stroke-opacity:1;display:inline;enable-background:new"
           id="rect4673"
           width="1"
           height="1"
           x="318"
           y="82"
           rx="0.28125"
           ry="0.28125" />
        <rect
           style="opacity:0.55363734;fill:url(#linearGradient9981);fill-opacity:1;stroke:none;stroke-width:1;stroke-linecap:round;stroke-linejoin:round;stroke-miterlimit:4;stroke-dasharray:none;stroke-dashoffset:0.3612;stroke-opacity:1;display:inline;enable-background:new"
           id="rect4677"
           width="1"
           height="1"
           x="317"
           y="81"
           rx="0.28125"
           ry="0.28125" />
        <rect
           style="opacity:0.55363734;fill:url(#linearGradient9983);fill-opacity:1;stroke:none;stroke-width:1;stroke-linecap:round;stroke-linejoin:round;stroke-miterlimit:4;stroke-dasharray:none;stroke-dashoffset:0.3612;stroke-opacity:1;display:inline;enable-background:new"
           id="rect4679"
           width="1"
           height="1"
           x="319"
           y="81"
           rx="0.28125"
           ry="0.28125" />
        <rect
           style="opacity:0.55363734;fill:url(#linearGradient9985);fill-opacity:1;stroke:none;stroke-width:1;stroke-linecap:round;stroke-linejoin:round;stroke-miterlimit:4;stroke-dasharray:none;stroke-dashoffset:0.3612;stroke-opacity:1;display:inline;enable-background:new"
           id="rect4683"
           width="1"
           height="1"
           x="320"
           y="80"
           rx="0.28125"
           ry="0.28125" />
        <rect
           style="opacity:0.55363734;fill:url(#linearGradient9987);fill-opacity:1;stroke:none;stroke-width:1;stroke-linecap:round;stroke-linejoin:round;stroke-miterlimit:4;stroke-dasharray:none;stroke-dashoffset:0.3612;stroke-opacity:1;display:inline;enable-background:new"
           id="rect4685"
           width="1"
           height="1"
           x="322"
           y="80"
           rx="0.28125"
           ry="0.28125" />
        <rect
           style="opacity:0.55363734;fill:url(#linearGradient9989);fill-opacity:1;stroke:none;stroke-width:1;stroke-linecap:round;stroke-linejoin:round;stroke-miterlimit:4;stroke-dasharray:none;stroke-dashoffset:0.3612;stroke-opacity:1;display:inline;enable-background:new"
           id="rect4687"
           width="1"
           height="1"
           x="322"
           y="82"
           rx="0.28125"
           ry="0.28125" />
        <rect
           style="opacity:0.55363734;fill:url(#linearGradient9991);fill-opacity:1;stroke:none;stroke-width:1;stroke-linecap:round;stroke-linejoin:round;stroke-miterlimit:4;stroke-dasharray:none;stroke-dashoffset:0.3612;stroke-opacity:1;display:inline;enable-background:new"
           id="rect4689"
           width="1"
           height="1"
           x="321"
           y="83"
           rx="0.28125"
           ry="0.28125" />
        <rect
           style="opacity:0.55363734;fill:url(#linearGradient9993);fill-opacity:1;stroke:none;stroke-width:1;stroke-linecap:round;stroke-linejoin:round;stroke-miterlimit:4;stroke-dasharray:none;stroke-dashoffset:0.3612;stroke-opacity:1;display:inline;enable-background:new"
           id="rect4691"
           width="1"
           height="1"
           x="321"
           y="81"
           rx="0.28125"
           ry="0.28125" />
        <rect
           style="opacity:0.55363734;fill:url(#linearGradient9995);fill-opacity:1;stroke:none;stroke-width:1;stroke-linecap:round;stroke-linejoin:round;stroke-miterlimit:4;stroke-dasharray:none;stroke-dashoffset:0.3612;stroke-opacity:1;display:inline;enable-background:new"
           id="rect4693"
           width="1"
           height="1"
           x="323"
           y="81"
           rx="0.28125"
           ry="0.28125" />
        <rect
           style="opacity:0.55363734;fill:url(#linearGradient9997);fill-opacity:1;stroke:none;stroke-width:1;stroke-linecap:round;stroke-linejoin:round;stroke-miterlimit:4;stroke-dasharray:none;stroke-dashoffset:0.3612;stroke-opacity:1;display:inline;enable-background:new"
           id="rect4695"
           width="1"
           height="1"
           x="323"
           y="83"
           rx="0.28125"
           ry="0.28125" />
        <rect
           style="opacity:0.55363734;fill:url(#linearGradient9999);fill-opacity:1;stroke:none;stroke-width:1;stroke-linecap:round;stroke-linejoin:round;stroke-miterlimit:4;stroke-dasharray:none;stroke-dashoffset:0.3612;stroke-opacity:1;display:inline;enable-background:new"
           id="rect4697"
           width="1"
           height="1"
           x="324"
           y="80"
           rx="0.28125"
           ry="0.28125" />
        <rect
           style="opacity:0.55363734;fill:url(#linearGradient10001);fill-opacity:1;stroke:none;stroke-width:1;stroke-linecap:round;stroke-linejoin:round;stroke-miterlimit:4;stroke-dasharray:none;stroke-dashoffset:0.3612;stroke-opacity:1;display:inline;enable-background:new"
           id="rect4699"
           width="1"
           height="1"
           x="324"
           y="82"
           rx="0.28125"
           ry="0.28125" />
        <rect
           style="opacity:0.55363734;fill:url(#linearGradient10003);fill-opacity:1;stroke:none;stroke-width:1;stroke-linecap:round;stroke-linejoin:round;stroke-miterlimit:4;stroke-dasharray:none;stroke-dashoffset:0.3612;stroke-opacity:1;display:inline;enable-background:new"
           id="rect4701"
           width="1"
           height="1"
           x="320"
           y="82"
           rx="0.28125"
           ry="0.28125" />
        <rect
           style="opacity:0.55363734;fill:url(#linearGradient10005);fill-opacity:1;stroke:none;stroke-width:1;stroke-linecap:round;stroke-linejoin:round;stroke-miterlimit:4;stroke-dasharray:none;stroke-dashoffset:0.3612;stroke-opacity:1;display:inline;enable-background:new"
           id="rect4704"
           width="1"
           height="1"
           x="326"
           y="80"
           rx="0.28125"
           ry="0.28125" />
        <rect
           style="opacity:0.55363734;fill:url(#linearGradient10007);fill-opacity:1;stroke:none;stroke-width:1;stroke-linecap:round;stroke-linejoin:round;stroke-miterlimit:4;stroke-dasharray:none;stroke-dashoffset:0.3612;stroke-opacity:1;display:inline;enable-background:new"
           id="rect4708"
           width="1"
           height="1"
           x="325"
           y="83"
           rx="0.28125"
           ry="0.28125" />
        <rect
           style="opacity:0.55363734;fill:url(#linearGradient10009);fill-opacity:1;stroke:none;stroke-width:1;stroke-linecap:round;stroke-linejoin:round;stroke-miterlimit:4;stroke-dasharray:none;stroke-dashoffset:0.3612;stroke-opacity:1;display:inline;enable-background:new"
           id="rect4712"
           width="1"
           height="1"
           x="327"
           y="81"
           rx="0.28125"
           ry="0.28125" />
        <rect
           style="opacity:0.55363734;fill:url(#linearGradient10011);fill-opacity:1;stroke:none;stroke-width:1;stroke-linecap:round;stroke-linejoin:round;stroke-miterlimit:4;stroke-dasharray:none;stroke-dashoffset:0.3612;stroke-opacity:1;display:inline;enable-background:new"
           id="rect4714"
           width="1"
           height="1"
           x="327"
           y="83"
           rx="0.28125"
           ry="0.28125" />
        <rect
           style="opacity:0.55363734;fill:url(#linearGradient10013);fill-opacity:1;stroke:none;stroke-width:1;stroke-linecap:round;stroke-linejoin:round;stroke-miterlimit:4;stroke-dasharray:none;stroke-dashoffset:0.3612;stroke-opacity:1;display:inline;enable-background:new"
           id="rect4716"
           width="1"
           height="1"
           x="328"
           y="80"
           rx="0.28125"
           ry="0.28125" />
        <rect
           style="opacity:0.55363734;fill:url(#linearGradient10015);fill-opacity:1;stroke:none;stroke-width:1;stroke-linecap:round;stroke-linejoin:round;stroke-miterlimit:4;stroke-dasharray:none;stroke-dashoffset:0.3612;stroke-opacity:1;display:inline;enable-background:new"
           id="rect4718"
           width="1"
           height="1"
           x="330"
           y="80"
           rx="0.28125"
           ry="0.28125" />
        <rect
           style="opacity:0.55363734;fill:url(#linearGradient10017);fill-opacity:1;stroke:none;stroke-width:1;stroke-linecap:round;stroke-linejoin:round;stroke-miterlimit:4;stroke-dasharray:none;stroke-dashoffset:0.3612;stroke-opacity:1;display:inline;enable-background:new"
           id="rect4722"
           width="1"
           height="1"
           x="329"
           y="83"
           rx="0.28125"
           ry="0.28125" />
        <rect
           style="opacity:0.55363734;fill:url(#linearGradient10019);fill-opacity:1;stroke:none;stroke-width:1;stroke-linecap:round;stroke-linejoin:round;stroke-miterlimit:4;stroke-dasharray:none;stroke-dashoffset:0.3612;stroke-opacity:1;display:inline;enable-background:new"
           id="rect4724"
           width="1"
           height="1"
           x="329"
           y="81"
           rx="0.28125"
           ry="0.28125" />
        <rect
           style="opacity:0.55363734;fill:url(#linearGradient10021);fill-opacity:1;stroke:none;stroke-width:1;stroke-linecap:round;stroke-linejoin:round;stroke-miterlimit:4;stroke-dasharray:none;stroke-dashoffset:0.3612;stroke-opacity:1;display:inline;enable-background:new"
           id="rect4728"
           width="1"
           height="1"
           x="331"
           y="83"
           rx="0.28125"
           ry="0.28125" />
        <rect
           style="opacity:0.55363734;fill:url(#linearGradient10023);fill-opacity:1;stroke:none;stroke-width:1;stroke-linecap:round;stroke-linejoin:round;stroke-miterlimit:4;stroke-dasharray:none;stroke-dashoffset:0.3612;stroke-opacity:1;display:inline;enable-background:new"
           id="rect4736"
           width="1"
           height="1"
           x="333"
           y="81"
           rx="0.28125"
           ry="0.28125" />
        <rect
           style="opacity:0.55363734;fill:url(#linearGradient10025);fill-opacity:1;stroke:none;stroke-width:1;stroke-linecap:round;stroke-linejoin:round;stroke-miterlimit:4;stroke-dasharray:none;stroke-dashoffset:0.3612;stroke-opacity:1;display:inline;enable-background:new"
           id="rect4738"
           width="1"
           height="1"
           x="333"
           y="83"
           rx="0.28125"
           ry="0.28125" />
        <rect
           style="opacity:0.55363734;fill:url(#linearGradient10027);fill-opacity:1;stroke:none;stroke-width:1;stroke-linecap:round;stroke-linejoin:round;stroke-miterlimit:4;stroke-dasharray:none;stroke-dashoffset:0.3612;stroke-opacity:1;display:inline;enable-background:new"
           id="rect4744"
           width="1"
           height="1"
           x="336"
           y="82"
           rx="0.28125"
           ry="0.28125" />
        <rect
           style="opacity:0.55363734;fill:url(#linearGradient10029);fill-opacity:1;stroke:none;stroke-width:1;stroke-linecap:round;stroke-linejoin:round;stroke-miterlimit:4;stroke-dasharray:none;stroke-dashoffset:0.3612;stroke-opacity:1;display:inline;enable-background:new"
           id="rect4746"
           width="1"
           height="1"
           x="335"
           y="83"
           rx="0.28125"
           ry="0.28125" />
        <rect
           style="opacity:0.55363734;fill:url(#linearGradient10031);fill-opacity:1;stroke:none;stroke-width:1;stroke-linecap:round;stroke-linejoin:round;stroke-miterlimit:4;stroke-dasharray:none;stroke-dashoffset:0.3612;stroke-opacity:1;display:inline;enable-background:new"
           id="rect4748"
           width="1"
           height="1"
           x="335"
           y="81"
           rx="0.28125"
           ry="0.28125" />
        <rect
           style="opacity:0.55363734;fill:url(#linearGradient10033);fill-opacity:1;stroke:none;stroke-width:1;stroke-linecap:round;stroke-linejoin:round;stroke-miterlimit:4;stroke-dasharray:none;stroke-dashoffset:0.3612;stroke-opacity:1;display:inline;enable-background:new"
           id="rect4750"
           width="1"
           height="1"
           x="337"
           y="81"
           rx="0.28125"
           ry="0.28125" />
        <rect
           style="opacity:0.55363734;fill:url(#linearGradient10035);fill-opacity:1;stroke:none;stroke-width:1;stroke-linecap:round;stroke-linejoin:round;stroke-miterlimit:4;stroke-dasharray:none;stroke-dashoffset:0.3612;stroke-opacity:1;display:inline;enable-background:new"
           id="rect4752"
           width="1"
           height="1"
           x="337"
           y="83"
           rx="0.28125"
           ry="0.28125" />
        <rect
           style="opacity:0.55363734;fill:url(#linearGradient10037);fill-opacity:1;stroke:none;stroke-width:1;stroke-linecap:round;stroke-linejoin:round;stroke-miterlimit:4;stroke-dasharray:none;stroke-dashoffset:0.3612;stroke-opacity:1;display:inline;enable-background:new"
           id="rect4756"
           width="1"
           height="1"
           x="338"
           y="82"
           rx="0.28125"
           ry="0.28125" />
        <rect
           style="opacity:0.55363734;fill:url(#linearGradient10039);fill-opacity:1;stroke:none;stroke-width:1;stroke-linecap:round;stroke-linejoin:round;stroke-miterlimit:4;stroke-dasharray:none;stroke-dashoffset:0.3612;stroke-opacity:1;display:inline;enable-background:new"
           id="rect4758"
           width="1"
           height="1"
           x="334"
           y="82"
           rx="0.28125"
           ry="0.28125" />
      </g>
    </g>
  </g>
</svg>
