<?xml version="1.0" encoding="UTF-8" standalone="no"?>
<!-- Created with Inkscape (http://www.inkscape.org/) -->
<svg
   xmlns:dc="http://purl.org/dc/elements/1.1/"
   xmlns:cc="http://creativecommons.org/ns#"
   xmlns:rdf="http://www.w3.org/1999/02/22-rdf-syntax-ns#"
   xmlns:svg="http://www.w3.org/2000/svg"
   xmlns="http://www.w3.org/2000/svg"
   xmlns:xlink="http://www.w3.org/1999/xlink"
   xmlns:sodipodi="http://sodipodi.sourceforge.net/DTD/sodipodi-0.dtd"
   xmlns:inkscape="http://www.inkscape.org/namespaces/inkscape"
   width="48px"
   height="48px"
   id="svg7359"
   sodipodi:version="0.32"
   inkscape:version="0.46"
   sodipodi:docname="drawing.svg"
   inkscape:output_extension="org.inkscape.output.svg.inkscape">
  <defs
     id="defs7361">
    <linearGradient
       inkscape:collect="always"
       xlink:href="#linearGradient7758"
       id="linearGradient11233"
       gradientUnits="userSpaceOnUse"
       x1="307.53125"
       y1="193.1875"
       x2="307.53125"
       y2="189.11911" />
    <linearGradient
       inkscape:collect="always"
       xlink:href="#linearGradient7758"
       id="linearGradient11231"
       gradientUnits="userSpaceOnUse"
       x1="307.53125"
       y1="193.1875"
       x2="307.53125"
       y2="189.11911" />
    <linearGradient
       inkscape:collect="always"
       xlink:href="#linearGradient7758"
       id="linearGradient11229"
       gradientUnits="userSpaceOnUse"
       x1="307.53125"
       y1="193.1875"
       x2="307.53125"
       y2="189.11911" />
    <linearGradient
       inkscape:collect="always"
       xlink:href="#linearGradient7758"
       id="linearGradient11227"
       gradientUnits="userSpaceOnUse"
       gradientTransform="translate(0,1)"
       x1="307.53125"
       y1="193.1875"
       x2="307.53125"
       y2="189.11911" />
    <linearGradient
       inkscape:collect="always"
       xlink:href="#linearGradient7758"
       id="linearGradient11225"
       gradientUnits="userSpaceOnUse"
       x1="307.53125"
       y1="193.1875"
       x2="307.53125"
       y2="189.11911" />
    <linearGradient
       inkscape:collect="always"
       xlink:href="#linearGradient7758"
       id="linearGradient11223"
       gradientUnits="userSpaceOnUse"
       x1="307.53125"
       y1="193.1875"
       x2="307.53125"
       y2="189.11911" />
    <linearGradient
       inkscape:collect="always"
       xlink:href="#linearGradient7758"
       id="linearGradient11221"
       gradientUnits="userSpaceOnUse"
       x1="307.53125"
       y1="193.1875"
       x2="307.53125"
       y2="189.11911" />
    <linearGradient
       inkscape:collect="always"
       xlink:href="#linearGradient7758"
       id="linearGradient11219"
       gradientUnits="userSpaceOnUse"
       x1="307.53125"
       y1="193.1875"
       x2="307.53125"
       y2="189.11911" />
    <linearGradient
       inkscape:collect="always"
       xlink:href="#linearGradient7758"
       id="linearGradient11217"
       gradientUnits="userSpaceOnUse"
       x1="307.53125"
       y1="193.1875"
       x2="307.53125"
       y2="189.11911" />
    <linearGradient
       inkscape:collect="always"
       xlink:href="#linearGradient7758"
       id="linearGradient11215"
       gradientUnits="userSpaceOnUse"
       x1="307.53125"
       y1="193.1875"
       x2="307.53125"
       y2="189.11911" />
    <linearGradient
       inkscape:collect="always"
       xlink:href="#linearGradient7758"
       id="linearGradient11235"
       gradientUnits="userSpaceOnUse"
       x1="307.53125"
       y1="193.1875"
       x2="307.53125"
       y2="189.11911" />
    <linearGradient
       inkscape:collect="always"
       xlink:href="#linearGradient4574"
       id="linearGradient11213"
       gradientUnits="userSpaceOnUse"
       gradientTransform="matrix(0.3586948,0,0,0.4000001,229.28732,160.2)"
       x1="316.18286"
       y1="83.224533"
       x2="316.18286"
       y2="90.819603" />
    <linearGradient
       inkscape:collect="always"
       xlink:href="#linearGradient4538"
       id="linearGradient11211"
       gradientUnits="userSpaceOnUse"
       x1="110.53181"
       y1="416.36923"
       x2="110.53181"
       y2="368.06689" />
    <linearGradient
       inkscape:collect="always"
       xlink:href="#linearGradient11187"
       id="linearGradient11209"
       gradientUnits="userSpaceOnUse"
       x1="169.53629"
       y1="406.25653"
       x2="169.53629"
       y2="381.70447" />
    <radialGradient
       inkscape:collect="always"
       xlink:href="#linearGradient4788-7"
       id="radialGradient11207"
       gradientUnits="userSpaceOnUse"
       gradientTransform="matrix(-0.8608208,3.7279326e-7,4.195139e-2,-0.6045406,586.48445,215.18657)"
       cx="326.0206"
       cy="58"
       fx="326.0206"
       fy="58"
       r="12.5" />
    <radialGradient
       inkscape:collect="always"
       xlink:href="#linearGradient4788"
       id="radialGradient11205"
       gradientUnits="userSpaceOnUse"
       gradientTransform="matrix(2.9199174,2.523046e-8,0,0.6246709,-639.95678,143.91344)"
       cx="327.5"
       cy="58"
       fx="327.5"
       fy="58"
       r="12.5" />
    <linearGradient
       inkscape:collect="always"
       xlink:href="#linearGradient5687"
       id="linearGradient11203"
       gradientUnits="userSpaceOnUse"
       gradientTransform="matrix(7.6923313e-2,0,0,7.0591222e-2,302.61531,175.04077)"
       x1="88"
       y1="44.5"
       x2="178"
       y2="202.5" />
    <radialGradient
       inkscape:collect="always"
       xlink:href="#linearGradient2711"
       id="radialGradient11201"
       gradientUnits="userSpaceOnUse"
       gradientTransform="matrix(1.1011252,0,0,0.4728361,287.58732,172.07816)"
       cx="24.006104"
       cy="37.921711"
       fx="24.006104"
       fy="37.921711"
       r="19.00016" />
    <linearGradient
       inkscape:collect="always"
       xlink:href="#linearGradient5538"
       id="linearGradient11199"
       gradientUnits="userSpaceOnUse"
       gradientTransform="matrix(0.4667846,0,0,0.4669448,164.62624,152.04321)"
       x1="315.04031"
       y1="89.236771"
       x2="291.66104"
       y2="45.183807" />
    <radialGradient
       inkscape:collect="always"
       xlink:href="#linearGradient4654"
       id="radialGradient11197"
       gradientUnits="userSpaceOnUse"
       gradientTransform="matrix(0.525761,1.962839,-0.5015999,0.1344494,175.37799,-445.23546)"
       cx="314.30969"
       cy="61.654819"
       fx="314.30969"
       fy="61.654819"
       r="23" />
    <linearGradient
       inkscape:collect="always"
       xlink:href="#linearGradient3380"
       id="linearGradient11195"
       gradientUnits="userSpaceOnUse"
       gradientTransform="translate(-20,0)"
       x1="336.5625"
       y1="192.875"
       x2="336.5625"
       y2="196.99327" />
    <linearGradient
       inkscape:collect="always"
       xlink:href="#linearGradient4693"
       id="linearGradient11193"
       gradientUnits="userSpaceOnUse"
       gradientTransform="translate(-20,0)"
       x1="333.5625"
       y1="192.91261"
       x2="333.5625"
       y2="196.26506" />
    <linearGradient
       inkscape:collect="always"
       xlink:href="#linearGradient4772"
       id="linearGradient11191"
       gradientUnits="userSpaceOnUse"
       x1="327.91971"
       y1="93.75"
       x2="327.91971"
       y2="88.849144" />
    <linearGradient
       inkscape:collect="always"
       xlink:href="#linearGradient3847"
       id="linearGradient11189"
       gradientUnits="userSpaceOnUse"
       gradientTransform="matrix(0.6443737,0,0,0.9724074,143.7467,121.28233)"
       x1="328.62787"
       y1="74.43293"
       x2="327.47882"
       y2="67.36187" />
    <linearGradient
       inkscape:collect="always"
       xlink:href="#linearGradient7758"
       id="linearGradient3401"
       gradientUnits="userSpaceOnUse"
       x1="307.53125"
       y1="193.1875"
       x2="307.53125"
       y2="189.11911" />
    <linearGradient
       inkscape:collect="always"
       xlink:href="#linearGradient7758"
       id="linearGradient3399"
       gradientUnits="userSpaceOnUse"
       x1="307.53125"
       y1="193.1875"
       x2="307.53125"
       y2="189.11911" />
    <linearGradient
       inkscape:collect="always"
       xlink:href="#linearGradient7758"
       id="linearGradient3397"
       gradientUnits="userSpaceOnUse"
       x1="307.53125"
       y1="193.1875"
       x2="307.53125"
       y2="189.11911" />
    <linearGradient
       inkscape:collect="always"
       xlink:href="#linearGradient7758"
       id="linearGradient3395"
       gradientUnits="userSpaceOnUse"
       gradientTransform="translate(0,1)"
       x1="307.53125"
       y1="193.1875"
       x2="307.53125"
       y2="189.11911" />
    <linearGradient
       inkscape:collect="always"
       xlink:href="#linearGradient7758"
       id="linearGradient3393"
       gradientUnits="userSpaceOnUse"
       x1="307.53125"
       y1="193.1875"
       x2="307.53125"
       y2="189.11911" />
    <linearGradient
       inkscape:collect="always"
       xlink:href="#linearGradient7758"
       id="linearGradient3391"
       gradientUnits="userSpaceOnUse"
       x1="307.53125"
       y1="193.1875"
       x2="307.53125"
       y2="189.11911" />
    <linearGradient
       inkscape:collect="always"
       xlink:href="#linearGradient7758"
       id="linearGradient3389"
       gradientUnits="userSpaceOnUse"
       x1="307.53125"
       y1="193.1875"
       x2="307.53125"
       y2="189.11911" />
    <linearGradient
       inkscape:collect="always"
       xlink:href="#linearGradient7758"
       id="linearGradient3387"
       gradientUnits="userSpaceOnUse"
       x1="307.53125"
       y1="193.1875"
       x2="307.53125"
       y2="189.11911" />
    <linearGradient
       inkscape:collect="always"
       xlink:href="#linearGradient7758"
       id="linearGradient3385"
       gradientUnits="userSpaceOnUse"
       x1="307.53125"
       y1="193.1875"
       x2="307.53125"
       y2="189.11911" />
    <linearGradient
       inkscape:collect="always"
       xlink:href="#linearGradient7758"
       id="linearGradient3383"
       gradientUnits="userSpaceOnUse"
       x1="307.53125"
       y1="193.1875"
       x2="307.53125"
       y2="189.11911" />
    <linearGradient
       inkscape:collect="always"
       id="linearGradient7758">
      <stop
         style="stop-color:#babdb6;stop-opacity:1;"
         offset="0"
         id="stop7760" />
      <stop
         style="stop-color:#babdb6;stop-opacity:0;"
         offset="1"
         id="stop7762" />
    </linearGradient>
    <linearGradient
       inkscape:collect="always"
       xlink:href="#linearGradient7758"
       id="linearGradient3403"
       gradientUnits="userSpaceOnUse"
       x1="307.53125"
       y1="193.1875"
       x2="307.53125"
       y2="189.11911" />
    <linearGradient
       inkscape:collect="always"
       id="linearGradient4574">
      <stop
         style="stop-color:#2e3436;stop-opacity:1"
         offset="0"
         id="stop4576" />
      <stop
         style="stop-color:#888a85;stop-opacity:1"
         offset="1"
         id="stop4578" />
    </linearGradient>
    <linearGradient
       inkscape:collect="always"
       xlink:href="#linearGradient4574"
       id="linearGradient3381"
       gradientUnits="userSpaceOnUse"
       gradientTransform="matrix(0.3586948,0,0,0.4000001,229.28732,160.2)"
       x1="316.18286"
       y1="83.224533"
       x2="316.18286"
       y2="90.819603" />
    <linearGradient
       inkscape:collect="always"
       id="linearGradient4538">
      <stop
         style="stop-color:#555753;stop-opacity:1;"
         offset="0"
         id="stop4540" />
      <stop
         style="stop-color:#888a85;stop-opacity:1"
         offset="1"
         id="stop4542" />
    </linearGradient>
    <linearGradient
       inkscape:collect="always"
       xlink:href="#linearGradient4538"
       id="linearGradient3378"
       gradientUnits="userSpaceOnUse"
       x1="110.53181"
       y1="416.36923"
       x2="110.53181"
       y2="368.06689" />
    <linearGradient
       inkscape:collect="always"
       id="linearGradient11187">
      <stop
         style="stop-color:#ffffff;stop-opacity:1"
         offset="0"
         id="stop11189" />
      <stop
         style="stop-color:#d3d7cf;stop-opacity:1"
         offset="1"
         id="stop11191" />
    </linearGradient>
    <linearGradient
       inkscape:collect="always"
       xlink:href="#linearGradient11187"
       id="linearGradient3376"
       gradientUnits="userSpaceOnUse"
       x1="169.53629"
       y1="406.25653"
       x2="169.53629"
       y2="381.70447" />
    <linearGradient
       inkscape:collect="always"
       id="linearGradient4788-7">
      <stop
         style="stop-color:#ffffff;stop-opacity:1;"
         offset="0"
         id="stop4790-8" />
      <stop
         style="stop-color:#ffffff;stop-opacity:0;"
         offset="1"
         id="stop4792-6" />
    </linearGradient>
    <radialGradient
       inkscape:collect="always"
       xlink:href="#linearGradient4788-7"
       id="radialGradient3374"
       gradientUnits="userSpaceOnUse"
       gradientTransform="matrix(-0.8608208,3.7279326e-7,4.195139e-2,-0.6045406,586.48445,215.18657)"
       cx="326.0206"
       cy="58"
       fx="326.0206"
       fy="58"
       r="12.5" />
    <linearGradient
       inkscape:collect="always"
       id="linearGradient4788">
      <stop
         style="stop-color:#ffffff;stop-opacity:1;"
         offset="0"
         id="stop4790" />
      <stop
         style="stop-color:#ffffff;stop-opacity:0;"
         offset="1"
         id="stop4792" />
    </linearGradient>
    <radialGradient
       inkscape:collect="always"
       xlink:href="#linearGradient4788"
       id="radialGradient3372"
       gradientUnits="userSpaceOnUse"
       gradientTransform="matrix(2.9199174,2.523046e-8,0,0.6246709,-639.95678,143.91344)"
       cx="327.5"
       cy="58"
       fx="327.5"
       fy="58"
       r="12.5" />
    <linearGradient
       inkscape:collect="always"
       id="linearGradient5687">
      <stop
         style="stop-color:#ffffff;stop-opacity:1;"
         offset="0"
         id="stop5689" />
      <stop
         style="stop-color:#ffffff;stop-opacity:0;"
         offset="1"
         id="stop5691" />
    </linearGradient>
    <linearGradient
       inkscape:collect="always"
       xlink:href="#linearGradient5687"
       id="linearGradient3370"
       gradientUnits="userSpaceOnUse"
       gradientTransform="matrix(7.6923313e-2,0,0,7.0591222e-2,302.61531,175.04077)"
       x1="88"
       y1="44.5"
       x2="178"
       y2="202.5" />
    <linearGradient
       id="linearGradient2711">
      <stop
         style="stop-color:#4b9600;stop-opacity:1"
         offset="0"
         id="stop2713" />
      <stop
         style="stop-color:#4b0096;stop-opacity:1"
         offset="1"
         id="stop2715" />
    </linearGradient>
    <radialGradient
       inkscape:collect="always"
       xlink:href="#linearGradient2711"
       id="radialGradient3368"
       gradientUnits="userSpaceOnUse"
       gradientTransform="matrix(1.1011252,0,0,0.4728361,287.58732,172.07816)"
       cx="24.006104"
       cy="37.921711"
       fx="24.006104"
       fy="37.921711"
       r="19.00016" />
    <linearGradient
       id="linearGradient5538"
       inkscape:collect="always">
      <stop
         id="stop5540"
         offset="0"
         style="stop-color:#555753;stop-opacity:1;" />
      <stop
         id="stop5542"
         offset="1"
         style="stop-color:#babdb6;stop-opacity:1" />
    </linearGradient>
    <linearGradient
       inkscape:collect="always"
       xlink:href="#linearGradient5538"
       id="linearGradient3366"
       gradientUnits="userSpaceOnUse"
       gradientTransform="matrix(0.4667846,0,0,0.4669448,164.62624,152.04321)"
       x1="315.04031"
       y1="89.236771"
       x2="291.66104"
       y2="45.183807" />
    <linearGradient
       inkscape:collect="always"
       id="linearGradient4654">
      <stop
         style="stop-color:#eeeeec;stop-opacity:1"
         offset="0"
         id="stop4656" />
      <stop
         style="stop-color:#babdb6;stop-opacity:1"
         offset="1"
         id="stop4658" />
    </linearGradient>
    <radialGradient
       inkscape:collect="always"
       xlink:href="#linearGradient4654"
       id="radialGradient3364"
       gradientUnits="userSpaceOnUse"
       gradientTransform="matrix(0.525761,1.962839,-0.5015999,0.1344494,175.37799,-445.23546)"
       cx="314.30969"
       cy="61.654819"
       fx="314.30969"
       fy="61.654819"
       r="23" />
    <linearGradient
       id="linearGradient3380">
      <stop
         style="stop-color:#555753;stop-opacity:1"
         offset="0"
         id="stop3382" />
      <stop
         id="stop3410"
         offset="0.47892022"
         style="stop-color:#babdb6;stop-opacity:1" />
      <stop
         style="stop-color:#888a85;stop-opacity:1"
         offset="0.76858371"
         id="stop3412" />
      <stop
         style="stop-color:#555753;stop-opacity:1"
         offset="1"
         id="stop3384" />
    </linearGradient>
    <linearGradient
       inkscape:collect="always"
       xlink:href="#linearGradient3380"
       id="linearGradient3362"
       gradientUnits="userSpaceOnUse"
       gradientTransform="translate(-20,0)"
       x1="336.5625"
       y1="192.875"
       x2="336.5625"
       y2="196.99327" />
    <linearGradient
       id="linearGradient4693">
      <stop
         id="stop4695"
         offset="0"
         style="stop-color:#555753;stop-opacity:1" />
      <stop
         style="stop-color:#babdb6;stop-opacity:1"
         offset="0.30146292"
         id="stop4701" />
      <stop
         id="stop3408"
         offset="0.48027775"
         style="stop-color:#eeeeec;stop-opacity:1" />
      <stop
         style="stop-color:#ffffff;stop-opacity:1"
         offset="0.64304489"
         id="stop4699" />
      <stop
         id="stop4697"
         offset="1"
         style="stop-color:#555753;stop-opacity:1" />
    </linearGradient>
    <linearGradient
       inkscape:collect="always"
       xlink:href="#linearGradient4693"
       id="linearGradient3360"
       gradientUnits="userSpaceOnUse"
       gradientTransform="translate(-20,0)"
       x1="333.5625"
       y1="192.91261"
       x2="333.5625"
       y2="196.26506" />
    <filter
       height="2.3388599"
       y="-0.66942997"
       width="1.1218799"
       x="-0.060939956"
       id="filter6655"
       inkscape:collect="always">
      <feGaussianBlur
         id="feGaussianBlur6657"
         stdDeviation="1.1680158"
         inkscape:collect="always" />
    </filter>
    <filter
       inkscape:collect="always"
       id="filter4768"
       x="-0.11389347"
       width="1.2277869"
       y="-0.56768775"
       height="2.1353755">
      <feGaussianBlur
         inkscape:collect="always"
         stdDeviation="0.94614625"
         id="feGaussianBlur4770" />
    </filter>
    <linearGradient
       inkscape:collect="always"
       id="linearGradient4772">
      <stop
         style="stop-color:#000000;stop-opacity:1;"
         offset="0"
         id="stop4774" />
      <stop
         style="stop-color:#000000;stop-opacity:0;"
         offset="1"
         id="stop4776" />
    </linearGradient>
    <linearGradient
       inkscape:collect="always"
       xlink:href="#linearGradient4772"
       id="linearGradient3358"
       gradientUnits="userSpaceOnUse"
       x1="327.91971"
       y1="93.75"
       x2="327.91971"
       y2="88.849144" />
    <linearGradient
       inkscape:collect="always"
       id="linearGradient3847">
      <stop
         style="stop-color:#babdb6;stop-opacity:1;"
         offset="0"
         id="stop3849" />
      <stop
         style="stop-color:#babdb6;stop-opacity:0;"
         offset="1"
         id="stop3851" />
    </linearGradient>
    <linearGradient
       inkscape:collect="always"
       xlink:href="#linearGradient3847"
       id="linearGradient3356"
       gradientUnits="userSpaceOnUse"
       gradientTransform="matrix(0.6443737,0,0,0.9724074,143.7467,121.28233)"
       x1="328.62787"
       y1="74.43293"
       x2="327.47882"
       y2="67.36187" />
    <linearGradient
       inkscape:collect="always"
       id="linearGradient7065">
      <stop
         style="stop-color:#babdb6;stop-opacity:1;"
         offset="0"
         id="stop7067" />
      <stop
         style="stop-color:#babdb6;stop-opacity:0;"
         offset="1"
         id="stop7069" />
    </linearGradient>
    <linearGradient
       inkscape:collect="always"
       xlink:href="#linearGradient7065"
       id="linearGradient7071"
       x1="18.813038"
       y1="44.941074"
       x2="17.10545"
       y2="41.983444"
       gradientUnits="userSpaceOnUse"
       gradientTransform="translate(3.1249412e-6,0.9999969)" />
    <radialGradient
       inkscape:collect="always"
       xlink:href="#linearGradient7152"
       id="radialGradient7061"
       gradientUnits="userSpaceOnUse"
       gradientTransform="matrix(1.7476697,0,0,0.6599099,-22.571122,7.367593)"
       cx="24.871729"
       cy="33.480179"
       fx="24.871729"
       fy="33.480179"
       r="12.593109" />
    <linearGradient
       inkscape:collect="always"
       id="linearGradient7152">
      <stop
         style="stop-color:#ffffff;stop-opacity:1;"
         offset="0"
         id="stop7154" />
      <stop
         style="stop-color:#ffffff;stop-opacity:0;"
         offset="1"
         id="stop7156" />
    </linearGradient>
    <radialGradient
       inkscape:collect="always"
       xlink:href="#linearGradient7152"
       id="radialGradient7059"
       gradientUnits="userSpaceOnUse"
       gradientTransform="matrix(1.4010158,0,0,1.212303,-11.300033,-4.7293674)"
       cx="28.006489"
       cy="17.245893"
       fx="28.006489"
       fy="17.245893"
       r="12.593109" />
    <linearGradient
       inkscape:collect="always"
       id="linearGradient7166">
      <stop
         style="stop-color:#000000;stop-opacity:1;"
         offset="0"
         id="stop7168" />
      <stop
         style="stop-color:#000000;stop-opacity:0;"
         offset="1"
         id="stop7170" />
    </linearGradient>
    <linearGradient
       inkscape:collect="always"
       xlink:href="#linearGradient7166"
       id="linearGradient7057"
       gradientUnits="userSpaceOnUse"
       gradientTransform="translate(1,-6)"
       x1="22.75"
       y1="39.125"
       x2="24"
       y2="19.625" />
  </defs>
  <sodipodi:namedview
     id="base"
     pagecolor="#ffffff"
     bordercolor="#666666"
     borderopacity="1.0"
     inkscape:pageopacity="0.0"
     inkscape:pageshadow="2"
     inkscape:zoom="7"
     inkscape:cx="24"
     inkscape:cy="24"
     inkscape:current-layer="layer1"
     showgrid="true"
     inkscape:grid-bbox="true"
     inkscape:document-units="px"
     inkscape:window-width="641"
     inkscape:window-height="690"
     inkscape:window-x="404"
     inkscape:window-y="243" />
  <metadata
     id="metadata7364">
    <rdf:RDF>
      <cc:Work
         rdf:about="">
        <dc:format>image/svg+xml</dc:format>
        <dc:type
           rdf:resource="http://purl.org/dc/dcmitype/StillImage" />
      </cc:Work>
    </rdf:RDF>
  </metadata>
  <g
     id="layer1"
     inkscape:label="Layer 1"
     inkscape:groupmode="layer">
    <g
       id="g7050"
       transform="translate(1.0000031,-1.0579333e-6)">
      <path
         style="opacity:0.2;fill:none;fill-opacity:1;fill-rule:evenodd;stroke:url(#linearGradient7057);stroke-width:3;stroke-linecap:butt;stroke-linejoin:round;stroke-miterlimit:4;stroke-dasharray:none;stroke-opacity:1"
         d="M 11.5,13.432481 L 22.5,13.432481 C 40.603159,13.432481 7.4867447,31.5 25.5,31.5 L 35.5,31.5"
         id="path7164"
         sodipodi:nodetypes="cccc" />
      <g
         transform="matrix(1,0,0,0.6949046,-1,3.7461739)"
         id="g7148">
        <path
           style="fill:none;fill-rule:evenodd;stroke:#4b9600;stroke-width:3.59880781;stroke-linecap:butt;stroke-linejoin:round;stroke-miterlimit:4;stroke-dasharray:none;stroke-opacity:1"
           d="M 12.5,12.5 L 23.5,12.5 C 41.603159,12.5 8.4867447,38.499999 26.5,38.499999 L 36.5,38.499999"
           id="path7146"
           sodipodi:nodetypes="cccc" />
        <path
           style="fill:none;fill-rule:evenodd;stroke:url(#radialGradient7059);stroke-width:1.1996026px;stroke-linecap:butt;stroke-linejoin:round;stroke-opacity:1"
           d="M 12.5,12.5 L 23.5,12.5 C 41.603159,12.5 8.4867447,38.499999 26.5,38.499999 L 36.5,38.499999"
           id="path6173"
           sodipodi:nodetypes="cccc" />
      </g>
      <path
         style="opacity:1;fill:none;fill-rule:evenodd;stroke:url(#radialGradient7061);stroke-width:1px;stroke-linecap:butt;stroke-linejoin:round;stroke-opacity:1"
         d="M 11.5,12.465767 L 22.5,12.465767 C 40.603159,12.465767 7.4867447,30.499998 25.5,30.499998 L 35.5,30.499998"
         id="path7160"
         sodipodi:nodetypes="cccc" />
    </g>
    <path
       style="fill:none;fill-rule:evenodd;stroke:#555753;stroke-width:3;stroke-linecap:round;stroke-linejoin:miter;stroke-miterlimit:4;stroke-dasharray:none;stroke-opacity:1"
       d="M 22.500003,45.499997 L 18.500003,45.499997 L 16.500003,42.499997"
       id="path7007" />
    <path
       style="fill:none;fill-rule:evenodd;stroke:#888a85;stroke-width:1px;stroke-linecap:round;stroke-linejoin:miter;stroke-opacity:1"
       d="M 22.500003,45.499997 L 18.500003,45.499997 L 16.500003,42.499997"
       id="path6036" />
    <path
       style="fill:none;fill-opacity:1;fill-rule:evenodd;stroke:#4b9600;stroke-width:0.99999994;stroke-linecap:round;stroke-linejoin:miter;stroke-miterlimit:4;stroke-opacity:1"
       d="M 13.035901,43.499994 C 11.931902,41.58781 12.587817,39.139895 14.500001,38.035896 C 15.137395,37.667896 15.764001,37.499997 16.500001,37.499997"
       id="path7025"
       sodipodi:nodetypes="csc" />
    <path
       style="fill:none;fill-opacity:1;fill-rule:evenodd;stroke:#4b9600;stroke-width:0.99999994;stroke-linecap:round;stroke-linejoin:miter;stroke-miterlimit:4;stroke-opacity:1"
       d="M 10.437821,44.999998 C 8.5058211,41.653673 9.6536731,37.36982 12.999998,35.437819 C 14.115439,34.793819 15.211999,34.499995 16.5,34.499995"
       id="path7027" />
    <path
       style="fill:none;fill-opacity:1;fill-rule:evenodd;stroke:#4b9600;stroke-width:0.99999994;stroke-linecap:round;stroke-linejoin:miter;stroke-miterlimit:4;stroke-opacity:1"
       d="M 7.8397461,47.499999 C 5.0797451,42.719535 6.7195341,36.599745 11.499998,33.839744 C 13.093484,32.919744 14.659999,32.499995 16.5,32.499995"
       id="path7029"
       sodipodi:nodetypes="csc" />
    <path
       style="fill:#babdb6;fill-opacity:1;fill-rule:evenodd;stroke:url(#linearGradient7071);stroke-width:1px;stroke-linecap:round;stroke-linejoin:miter;stroke-opacity:1"
       d="M 18.500003,45.499997 L 16.500003,42.499997"
       id="path7063"
       sodipodi:nodetypes="cc" />
    <g
       style="display:inline;enable-background:new"
       id="g12317"
       transform="translate(-343.99886,-177)">
      <path
         sodipodi:nodetypes="css"
         id="path12313"
         d="M 357.94102,195.70409 C 358.5427,193.22259 364.5,195.61467 364.5,193.86735 C 364.5,191.06091 351.04873,193.94925 350.70587,192.03063"
         style="fill:none;fill-opacity:1;fill-rule:evenodd;stroke:url(#linearGradient3356);stroke-width:0.99999994;stroke-linecap:butt;stroke-linejoin:miter;stroke-miterlimit:4;stroke-dasharray:none;stroke-opacity:1;display:inline;enable-background:new" />
      <g
         transform="translate(40,-3)"
         id="g10916"
         style="display:inline;enable-background:new">
        <path
           style="opacity:0.52610438;fill:url(#linearGradient3358);fill-opacity:1;stroke:none;stroke-width:1;stroke-linecap:round;stroke-linejoin:round;stroke-miterlimit:4;stroke-dashoffset:0.50000001;stroke-opacity:1;display:inline;filter:url(#filter4768);enable-background:new"
           d="M 316.05693,91 L 323.83253,91 L 329.21687,95 L 310.62455,95 L 316.05693,91 z"
           id="path10918"
           sodipodi:nodetypes="ccccc"
           transform="matrix(0.666447,0,0,0.741913,100.76278,126.5244)" />
        <rect
           transform="matrix(0.4293482,0,0,0.4328354,176.60856,156.63063)"
           ry="1.4394537"
           rx="1.5812495"
           y="90.8125"
           x="297"
           height="4.1875"
           width="46"
           id="rect10920"
           style="opacity:0.06024098;fill:#2e3436;fill-opacity:1;fill-rule:nonzero;stroke:none;stroke-width:1;stroke-linecap:round;stroke-linejoin:miter;marker:none;marker-start:none;marker-mid:none;marker-end:none;stroke-miterlimit:4;stroke-dasharray:none;stroke-dashoffset:0;stroke-opacity:1;visibility:visible;display:inline;overflow:visible;filter:url(#filter6655);enable-background:accumulate" />
      </g>
      <g
         transform="translate(40,-3)"
         id="g10922"
         style="display:inline;enable-background:new">
        <path
           transform="translate(0,-1)"
           style="fill:url(#linearGradient3360);fill-opacity:1;stroke:url(#linearGradient3362);stroke-width:1.00000012;stroke-linecap:square;stroke-linejoin:round;stroke-miterlimit:4;stroke-dashoffset:0;stroke-opacity:1"
           d="M 311.90625,190.5 C 311.65546,190.58765 311.49085,190.82824 311.5,191.09375 L 311.5,194.90625 C 311.49973,194.91666 311.49973,194.92709 311.5,194.9375 L 310.34375,195.65625 C 310.11972,195.76524 309.9231,195.832 309.75,196 C 309.71672,196.0323 309.63787,196.09535 309.5625,196.25 C 309.48713,196.40465 309.5,196.55668 309.5,196.65625 C 309.5,196.65625 309.5,197.53125 309.5,197.53125 L 318.5,197.53125 C 318.5,197.53125 318.5,196.65625 318.5,196.65625 C 318.5,196.55668 318.51287,196.40465 318.4375,196.25 C 318.36213,196.09535 318.28328,196.0323 318.25,196 C 318.0769,195.832 317.88028,195.76524 317.65625,195.65625 L 316.5,194.9375 L 316.5,191.09375 C 316.49307,190.76875 316.23125,190.50693 315.90625,190.5 L 312.09375,190.5 C 312.03163,190.49029 311.96837,190.49029 311.90625,190.5 z"
           id="path10924"
           sodipodi:nodetypes="cccccssccccsscccccc" />
        <path
           sodipodi:type="inkscape:offset"
           inkscape:radius="-1.0625"
           inkscape:original="M 311.5 190.5 L 311.5 194.9375 L 310.34375 195.5 C 309.92978 195.70139 309.5 195.93734 309.5 196.5 C 309.5 197.06266 309.8834 197.53125 310.34375 197.53125 L 317.65625 197.53125 C 318.11661 197.53125 318.5 197.06266 318.5 196.5 C 318.5 195.93734 318.07021 195.70139 317.65625 195.5 L 316.5 194.9375 L 316.5 190.5 L 311.5 190.5 z "
           style="opacity:0.19634705;fill:none;fill-opacity:1;stroke:#ffffff;stroke-width:1;stroke-linecap:square;stroke-linejoin:round;stroke-miterlimit:4;stroke-dasharray:none;stroke-dashoffset:0;stroke-opacity:1;display:inline;enable-background:new"
           id="path10926"
           d="M 312.5625,191.5625 L 312.5625,194.9375 C 312.56834,195.348 312.33719,195.72515 311.96875,195.90625 L 310.8125,196.46875 L 317.1875,196.46875 L 316.03125,195.90625 C 315.66281,195.72515 315.43166,195.348 315.4375,194.9375 L 315.4375,191.5625 L 312.5625,191.5625 z"
           transform="translate(0,-1)" />
        <rect
           style="fill:#eeeeec;fill-opacity:1;stroke:none;stroke-width:0.99999994;stroke-linecap:round;stroke-linejoin:round;stroke-miterlimit:4;stroke-dasharray:none;stroke-dashoffset:0.50000001;stroke-opacity:1;display:inline;enable-background:new"
           id="rect10928"
           width="8"
           height="0.9999972"
           x="310"
           y="195"
           rx="0.4999986"
           ry="0.4999986" />
        <path
           sodipodi:type="arc"
           style="opacity:1;fill:#f9f9f9;fill-opacity:1;stroke:none;stroke-width:1;stroke-linecap:square;stroke-linejoin:round;stroke-miterlimit:4;stroke-dasharray:none;stroke-dashoffset:0;stroke-opacity:1"
           id="path10930"
           sodipodi:cx="310.57455"
           sodipodi:cy="195.50287"
           sodipodi:rx="0.50823301"
           sodipodi:ry="0.55242717"
           d="M 311.08279,195.50287 A 0.50823301,0.55242717 0 1 1 310.06632,195.50287 A 0.50823301,0.55242717 0 1 1 311.08279,195.50287 z"
           transform="matrix(1.2446752,0,0,1.1450853,-76.064424,-28.367455)" />
        <path
           sodipodi:type="arc"
           style="opacity:1;fill:#f9f9f9;fill-opacity:1;stroke:none;stroke-width:1;stroke-linecap:square;stroke-linejoin:round;stroke-miterlimit:4;stroke-dasharray:none;stroke-dashoffset:0;stroke-opacity:1;display:inline;enable-background:new"
           id="path10932"
           sodipodi:cx="310.57455"
           sodipodi:cy="195.50287"
           sodipodi:rx="0.50823301"
           sodipodi:ry="0.55242717"
           d="M 311.08279,195.50287 A 0.50823301,0.55242717 0 1 1 310.06632,195.50287 A 0.50823301,0.55242717 0 1 1 311.08279,195.50287 z"
           transform="matrix(1.2446752,0,0,1.1450853,-69.064424,-28.367455)" />
      </g>
      <g
         transform="matrix(0.9065634,0,0,0.857135,69.361684,25.358572)"
         id="g10934"
         style="display:inline;enable-background:new">
        <rect
           style="fill:url(#radialGradient3364);fill-opacity:1;stroke:url(#linearGradient3366);stroke-width:1.13442659;stroke-linecap:round;stroke-linejoin:round;stroke-miterlimit:4;stroke-dasharray:none;stroke-dashoffset:0.50000001;stroke-opacity:1;display:inline;enable-background:new"
           id="rect10936"
           width="21.005308"
           height="14.000017"
           x="303.49469"
           y="177.50002"
           rx="0.49595869"
           ry="0.4961288" />
        <rect
           style="opacity:0.15;fill:none;fill-opacity:1;stroke:#ffffff;stroke-width:1.13442647;stroke-linecap:round;stroke-linejoin:round;stroke-miterlimit:4;stroke-dasharray:none;stroke-dashoffset:0.50000001;stroke-opacity:1;display:inline;enable-background:new"
           id="rect10938"
           width="18.709473"
           height="11.66679"
           x="304.64554"
           y="178.66664"
           rx="0"
           ry="0" />
      </g>
      <g
         transform="matrix(0.8807362,0,0,0.7941824,77.430373,36.999487)"
         id="g10940"
         style="display:inline;enable-background:new">
        <g
           id="g10942">
          <rect
             style="fill:url(#radialGradient3368);fill-opacity:1;fill-rule:evenodd;stroke:#4b0096;stroke-width:1.19568527px;stroke-linecap:butt;stroke-linejoin:miter;stroke-opacity:1;display:inline;enable-background:new"
             id="rect10944"
             width="17.041948"
             height="10"
             x="305.5"
             y="179.5" />
          <rect
             y="180.12334"
             x="305.99994"
             height="8.7533131"
             width="16.000061"
             id="rect10946"
             style="opacity:0.15;fill:url(#linearGradient3370);fill-opacity:1;fill-rule:evenodd;stroke:none;stroke-width:0.19827586px;stroke-linecap:butt;stroke-linejoin:miter;stroke-opacity:1;display:inline;enable-background:new" />
        </g>
        <g
           id="g10948">
          <path
             sodipodi:nodetypes="ccccc"
             id="path10950"
             d="M 317.45292,180.14436 L 322,180.14436 L 322,190 L 311.99643,190 L 317.45292,180.14436 z"
             style="opacity:0.35616437;fill:url(#radialGradient3372);fill-opacity:1;stroke:none;stroke-width:1;stroke-linecap:round;stroke-linejoin:round;stroke-miterlimit:4;stroke-dashoffset:0.50000001;stroke-opacity:1;display:inline;enable-background:new" />
          <path
             sodipodi:nodetypes="ccccc"
             id="path10952"
             d="M 311.76717,180.12334 L 314.59738,180.12334 L 311.4688,187.32855 L 310.07798,187.24763 L 311.76717,180.12338 L 311.76717,180.12334 z"
             style="opacity:0.38942339;fill:url(#radialGradient3374);fill-opacity:1;stroke:none;display:inline;enable-background:new" />
        </g>
      </g>
      <g
         transform="translate(10,0)"
         id="g11303">
        <path
           sodipodi:type="inkscape:offset"
           inkscape:radius="2.1041079"
           inkscape:original="M 49.0625 377.90625 C 48.351795 377.97898 47.715484 378.40319 47.375 379.03125 L 33.09375 405.40625 C 32.921854 405.73057 32.838 406.08368 32.84375 406.4375 C 32.843921 406.44806 32.843422 406.45818 32.84375 406.46875 L 32.84375 409.46875 L 32.84375 409.78125 L 32.90625 409.78125 C 32.951585 410.04087 33.016408 410.29742 33.15625 410.53125 C 33.544315 411.18013 34.243936 411.5896 35 411.59375 L 255.84375 411.59375 C 256.60912 411.59549 257.32874 411.18979 257.71875 410.53125 C 257.85619 410.2992 257.92557 410.03943 257.96875 409.78125 C 258.01748 409.48989 258.03125 408.90625 258.03125 408.90625 L 258.03125 406.8125 C 258.03125 406.32053 257.99454 405.81869 257.75 405.375 L 242.90625 379 C 242.51767 378.31998 241.78319 377.89854 241 377.90625 L 49.28125 377.90625 C 49.208701 377.90258 49.135047 377.90258 49.0625 377.90625 z "
           style="fill:url(#linearGradient3376);fill-opacity:1;stroke:url(#linearGradient3378);stroke-width:12.34623909;stroke-linecap:square;stroke-linejoin:miter;stroke-miterlimit:4;stroke-dasharray:none;stroke-dashoffset:0.3612;stroke-opacity:1;display:inline;enable-background:new"
           id="path10956"
           d="M 48.84375,375.8125 C 47.435282,375.95664 46.206014,376.78657 45.53125,378.03125 L 31.25,404.40625 C 30.914755,405.03876 30.73848,405.75988 30.75,406.46875 C 30.748746,406.39129 30.746329,406.41294 30.75,406.53125 L 30.75,409.46875 L 30.75,409.78125 C 30.745943,410.21651 30.87696,410.64231 31.125,411 C 31.201261,411.21987 31.198308,411.38181 31.34375,411.625 C 32.103454,412.89529 33.491398,413.67922 35,413.6875 L 255.84375,413.6875 C 257.35566,413.69094 258.75604,412.9027 259.53125,411.59375 C 259.86135,411.03642 259.96546,410.51837 260.03125,410.125 C 260.14476,409.44634 260.125,408.96875 260.125,408.96875 C 260.12531,408.94792 260.12531,408.92708 260.125,408.90625 L 260.125,406.8125 C 260.125,406.21586 260.11907,405.29688 259.59375,404.34375 L 244.75,377.96875 C 244.73958,377.96867 244.72917,377.96867 244.71875,377.96875 C 243.94931,376.62222 242.5196,375.79723 240.96875,375.8125 L 49.375,375.8125 C 49.341697,375.81082 49.314423,375.81341 49.28125,375.8125 C 49.170672,375.80948 49.079762,375.80688 48.96875,375.8125 C 48.927093,375.81126 48.885407,375.81126 48.84375,375.8125 z"
           transform="matrix(8.2832523e-2,0,0,7.9200815e-2,331.95307,165.73561)" />
        <path
           style="fill:url(#linearGradient3381);fill-opacity:1;fill-rule:evenodd;stroke:none;stroke-width:1px;stroke-linecap:butt;stroke-linejoin:miter;stroke-opacity:1;display:inline;enable-background:new"
           d="M 337.44515,195 L 336.53707,197 L 346.24566,196.9975 L 345.98913,195 L 337.44515,195 z M 346.43296,195 L 346.57372,196.01298 L 348.47162,196.01298 L 348.20601,195 L 346.43296,195 z M 348.65041,195.31959 L 349.15894,196.9975 L 351.60225,196.9975 L 350.8213,195.31959 L 348.65041,195.31959 z M 346.70084,196.50425 L 346.76441,196.9975 L 348.75993,196.9975 L 348.63507,196.50425 L 346.70084,196.50425 z"
           id="path10970"
           sodipodi:nodetypes="cccccccccccccccccccc" />
        <g
           id="g10972"
           style="fill:url(#linearGradient3403);fill-opacity:1;display:inline;enable-background:new"
           transform="translate(30.13815,2.90019)">
          <rect
             ry="0.28125"
             rx="0.28125"
             y="193"
             x="307"
             height="1"
             width="1"
             id="rect10976"
             style="opacity:0.55363734;fill:url(#linearGradient3383);fill-opacity:1;stroke:none;stroke-width:1;stroke-linecap:round;stroke-linejoin:round;stroke-miterlimit:4;stroke-dasharray:none;stroke-dashoffset:0.3612;stroke-opacity:1;display:inline;enable-background:new" />
          <rect
             ry="0.28125"
             rx="0.28125"
             y="192"
             x="308"
             height="1"
             width="1"
             id="rect10980"
             style="opacity:0.55363734;fill:url(#linearGradient3385);fill-opacity:1;stroke:none;stroke-width:1;stroke-linecap:round;stroke-linejoin:round;stroke-miterlimit:4;stroke-dasharray:none;stroke-dashoffset:0.3612;stroke-opacity:1;display:inline;enable-background:new" />
          <rect
             ry="0.28125"
             rx="0.28125"
             y="192"
             x="310"
             height="1"
             width="1"
             id="rect10986"
             style="opacity:0.55363734;fill:url(#linearGradient3387);fill-opacity:1;stroke:none;stroke-width:1;stroke-linecap:round;stroke-linejoin:round;stroke-miterlimit:4;stroke-dasharray:none;stroke-dashoffset:0.3612;stroke-opacity:1;display:inline;enable-background:new" />
          <rect
             ry="0.28125"
             rx="0.28125"
             y="192"
             x="312"
             height="1"
             width="1"
             id="rect10988"
             style="opacity:0.55363734;fill:url(#linearGradient3389);fill-opacity:1;stroke:none;stroke-width:1;stroke-linecap:round;stroke-linejoin:round;stroke-miterlimit:4;stroke-dasharray:none;stroke-dashoffset:0.3612;stroke-opacity:1;display:inline;enable-background:new" />
          <rect
             ry="0.28125"
             rx="0.28125"
             y="193"
             x="315"
             height="1"
             width="1"
             id="rect10994"
             style="opacity:0.55363734;fill:url(#linearGradient3391);fill-opacity:1;stroke:none;stroke-width:1;stroke-linecap:round;stroke-linejoin:round;stroke-miterlimit:4;stroke-dasharray:none;stroke-dashoffset:0.3612;stroke-opacity:1;display:inline;enable-background:new" />
          <rect
             ry="0.28125"
             rx="0.28125"
             y="192"
             x="314"
             height="1"
             width="1"
             id="rect10996"
             style="opacity:0.55363734;fill:url(#linearGradient3393);fill-opacity:1;stroke:none;stroke-width:1;stroke-linecap:round;stroke-linejoin:round;stroke-miterlimit:4;stroke-dasharray:none;stroke-dashoffset:0.3612;stroke-opacity:1;display:inline;enable-background:new" />
          <rect
             ry="0.28125"
             rx="0.28125"
             y="192"
             x="317"
             height="1"
             width="1"
             id="rect10998"
             style="opacity:0.55363734;fill:url(#linearGradient3395);fill-opacity:1;stroke:none;stroke-width:1;stroke-linecap:round;stroke-linejoin:round;stroke-miterlimit:4;stroke-dasharray:none;stroke-dashoffset:0.3612;stroke-opacity:1;display:inline;enable-background:new" />
          <rect
             ry="0.28125"
             rx="0.28125"
             y="193"
             x="319"
             height="1"
             width="1"
             id="rect11000"
             style="opacity:0.55363734;fill:url(#linearGradient3397);fill-opacity:1;stroke:none;stroke-width:1;stroke-linecap:round;stroke-linejoin:round;stroke-miterlimit:4;stroke-dasharray:none;stroke-dashoffset:0.3612;stroke-opacity:1;display:inline;enable-background:new" />
          <rect
             ry="0.28125"
             rx="0.28125"
             y="192"
             x="320"
             height="1"
             width="1"
             id="rect11002"
             style="opacity:0.55363734;fill:url(#linearGradient3399);fill-opacity:1;stroke:none;stroke-width:1;stroke-linecap:round;stroke-linejoin:round;stroke-miterlimit:4;stroke-dasharray:none;stroke-dashoffset:0.3612;stroke-opacity:1;display:inline;enable-background:new" />
          <rect
             ry="0.28125"
             rx="0.28125"
             y="193"
             x="321"
             height="1"
             width="1"
             id="rect11004"
             style="opacity:0.55363734;fill:url(#linearGradient3401);fill-opacity:1;stroke:none;stroke-width:1;stroke-linecap:round;stroke-linejoin:round;stroke-miterlimit:4;stroke-dasharray:none;stroke-dashoffset:0.3612;stroke-opacity:1;display:inline;enable-background:new" />
        </g>
      </g>
    </g>
    <g
       style="display:inline;enable-background:new"
       id="g11119"
       transform="translate(-321.99886,-151)">
      <path
         sodipodi:nodetypes="css"
         id="path11121"
         d="M 357.94102,195.70409 C 358.5427,193.22259 364.5,195.61467 364.5,193.86735 C 364.5,191.06091 351.04873,193.94925 350.70587,192.03063"
         style="fill:none;fill-opacity:1;fill-rule:evenodd;stroke:url(#linearGradient11189);stroke-width:0.99999994;stroke-linecap:butt;stroke-linejoin:miter;stroke-miterlimit:4;stroke-dasharray:none;stroke-opacity:1;display:inline;enable-background:new" />
      <g
         transform="translate(40,-3)"
         id="g11123"
         style="display:inline;enable-background:new">
        <path
           style="opacity:0.52610438;fill:url(#linearGradient11191);fill-opacity:1;stroke:none;stroke-width:1;stroke-linecap:round;stroke-linejoin:round;stroke-miterlimit:4;stroke-dashoffset:0.50000001;stroke-opacity:1;display:inline;filter:url(#filter4768);enable-background:new"
           d="M 316.05693,91 L 323.83253,91 L 329.21687,95 L 310.62455,95 L 316.05693,91 z"
           id="path11125"
           sodipodi:nodetypes="ccccc"
           transform="matrix(0.666447,0,0,0.741913,100.76278,126.5244)" />
        <rect
           transform="matrix(0.4293482,0,0,0.4328354,176.60856,156.63063)"
           ry="1.4394537"
           rx="1.5812495"
           y="90.8125"
           x="297"
           height="4.1875"
           width="46"
           id="rect11127"
           style="opacity:0.06024098;fill:#2e3436;fill-opacity:1;fill-rule:nonzero;stroke:none;stroke-width:1;stroke-linecap:round;stroke-linejoin:miter;marker:none;marker-start:none;marker-mid:none;marker-end:none;stroke-miterlimit:4;stroke-dasharray:none;stroke-dashoffset:0;stroke-opacity:1;visibility:visible;display:inline;overflow:visible;filter:url(#filter6655);enable-background:accumulate" />
      </g>
      <g
         transform="translate(40,-3)"
         id="g11129"
         style="display:inline;enable-background:new">
        <path
           transform="translate(0,-1)"
           style="fill:url(#linearGradient11193);fill-opacity:1;stroke:url(#linearGradient11195);stroke-width:1.00000012;stroke-linecap:square;stroke-linejoin:round;stroke-miterlimit:4;stroke-dashoffset:0;stroke-opacity:1"
           d="M 311.90625,190.5 C 311.65546,190.58765 311.49085,190.82824 311.5,191.09375 L 311.5,194.90625 C 311.49973,194.91666 311.49973,194.92709 311.5,194.9375 L 310.34375,195.65625 C 310.11972,195.76524 309.9231,195.832 309.75,196 C 309.71672,196.0323 309.63787,196.09535 309.5625,196.25 C 309.48713,196.40465 309.5,196.55668 309.5,196.65625 C 309.5,196.65625 309.5,197.53125 309.5,197.53125 L 318.5,197.53125 C 318.5,197.53125 318.5,196.65625 318.5,196.65625 C 318.5,196.55668 318.51287,196.40465 318.4375,196.25 C 318.36213,196.09535 318.28328,196.0323 318.25,196 C 318.0769,195.832 317.88028,195.76524 317.65625,195.65625 L 316.5,194.9375 L 316.5,191.09375 C 316.49307,190.76875 316.23125,190.50693 315.90625,190.5 L 312.09375,190.5 C 312.03163,190.49029 311.96837,190.49029 311.90625,190.5 z"
           id="path11131"
           sodipodi:nodetypes="cccccssccccsscccccc" />
        <path
           sodipodi:type="inkscape:offset"
           inkscape:radius="-1.0625"
           inkscape:original="M 311.5 190.5 L 311.5 194.9375 L 310.34375 195.5 C 309.92978 195.70139 309.5 195.93734 309.5 196.5 C 309.5 197.06266 309.8834 197.53125 310.34375 197.53125 L 317.65625 197.53125 C 318.11661 197.53125 318.5 197.06266 318.5 196.5 C 318.5 195.93734 318.07021 195.70139 317.65625 195.5 L 316.5 194.9375 L 316.5 190.5 L 311.5 190.5 z "
           style="opacity:0.19634705;fill:none;fill-opacity:1;stroke:#ffffff;stroke-width:1;stroke-linecap:square;stroke-linejoin:round;stroke-miterlimit:4;stroke-dasharray:none;stroke-dashoffset:0;stroke-opacity:1;display:inline;enable-background:new"
           id="path11133"
           d="M 312.5625,191.5625 L 312.5625,194.9375 C 312.56834,195.348 312.33719,195.72515 311.96875,195.90625 L 310.8125,196.46875 L 317.1875,196.46875 L 316.03125,195.90625 C 315.66281,195.72515 315.43166,195.348 315.4375,194.9375 L 315.4375,191.5625 L 312.5625,191.5625 z"
           transform="translate(0,-1)" />
        <rect
           style="fill:#eeeeec;fill-opacity:1;stroke:none;stroke-width:0.99999994;stroke-linecap:round;stroke-linejoin:round;stroke-miterlimit:4;stroke-dasharray:none;stroke-dashoffset:0.50000001;stroke-opacity:1;display:inline;enable-background:new"
           id="rect11135"
           width="8"
           height="0.9999972"
           x="310"
           y="195"
           rx="0.4999986"
           ry="0.4999986" />
        <path
           sodipodi:type="arc"
           style="opacity:1;fill:#f9f9f9;fill-opacity:1;stroke:none;stroke-width:1;stroke-linecap:square;stroke-linejoin:round;stroke-miterlimit:4;stroke-dasharray:none;stroke-dashoffset:0;stroke-opacity:1"
           id="path11137"
           sodipodi:cx="310.57455"
           sodipodi:cy="195.50287"
           sodipodi:rx="0.50823301"
           sodipodi:ry="0.55242717"
           d="M 311.08279,195.50287 A 0.50823301,0.55242717 0 1 1 310.06632,195.50287 A 0.50823301,0.55242717 0 1 1 311.08279,195.50287 z"
           transform="matrix(1.2446752,0,0,1.1450853,-76.064424,-28.367455)" />
        <path
           sodipodi:type="arc"
           style="opacity:1;fill:#f9f9f9;fill-opacity:1;stroke:none;stroke-width:1;stroke-linecap:square;stroke-linejoin:round;stroke-miterlimit:4;stroke-dasharray:none;stroke-dashoffset:0;stroke-opacity:1;display:inline;enable-background:new"
           id="path11139"
           sodipodi:cx="310.57455"
           sodipodi:cy="195.50287"
           sodipodi:rx="0.50823301"
           sodipodi:ry="0.55242717"
           d="M 311.08279,195.50287 A 0.50823301,0.55242717 0 1 1 310.06632,195.50287 A 0.50823301,0.55242717 0 1 1 311.08279,195.50287 z"
           transform="matrix(1.2446752,0,0,1.1450853,-69.064424,-28.367455)" />
      </g>
      <g
         transform="matrix(0.9065634,0,0,0.857135,69.361684,25.358572)"
         id="g11141"
         style="display:inline;enable-background:new">
        <rect
           style="fill:url(#radialGradient11197);fill-opacity:1;stroke:url(#linearGradient11199);stroke-width:1.13442659;stroke-linecap:round;stroke-linejoin:round;stroke-miterlimit:4;stroke-dasharray:none;stroke-dashoffset:0.50000001;stroke-opacity:1;display:inline;enable-background:new"
           id="rect11143"
           width="21.005308"
           height="14.000017"
           x="303.49469"
           y="177.50002"
           rx="0.49595869"
           ry="0.4961288" />
        <rect
           style="opacity:0.15;fill:none;fill-opacity:1;stroke:#ffffff;stroke-width:1.13442647;stroke-linecap:round;stroke-linejoin:round;stroke-miterlimit:4;stroke-dasharray:none;stroke-dashoffset:0.50000001;stroke-opacity:1;display:inline;enable-background:new"
           id="rect11145"
           width="18.709473"
           height="11.66679"
           x="304.64554"
           y="178.66664"
           rx="0"
           ry="0" />
      </g>
      <g
         transform="matrix(0.8807362,0,0,0.7941824,77.430373,36.999487)"
         id="g11147"
         style="display:inline;enable-background:new">
        <g
           id="g11149">
          <rect
             style="fill:url(#radialGradient11201);fill-opacity:1;fill-rule:evenodd;stroke:#4b0096;stroke-width:1.19568527px;stroke-linecap:butt;stroke-linejoin:miter;stroke-opacity:1;display:inline;enable-background:new"
             id="rect11151"
             width="17.041948"
             height="10"
             x="305.5"
             y="179.5" />
          <rect
             y="180.12334"
             x="305.99994"
             height="8.7533131"
             width="16.000061"
             id="rect11153"
             style="opacity:0.15;fill:url(#linearGradient11203);fill-opacity:1;fill-rule:evenodd;stroke:none;stroke-width:0.19827586px;stroke-linecap:butt;stroke-linejoin:miter;stroke-opacity:1;display:inline;enable-background:new" />
        </g>
        <g
           id="g11155">
          <path
             sodipodi:nodetypes="ccccc"
             id="path11157"
             d="M 317.45292,180.14436 L 322,180.14436 L 322,190 L 311.99643,190 L 317.45292,180.14436 z"
             style="opacity:0.35616437;fill:url(#radialGradient11205);fill-opacity:1;stroke:none;stroke-width:1;stroke-linecap:round;stroke-linejoin:round;stroke-miterlimit:4;stroke-dashoffset:0.50000001;stroke-opacity:1;display:inline;enable-background:new" />
          <path
             sodipodi:nodetypes="ccccc"
             id="path11159"
             d="M 311.76717,180.12334 L 314.59738,180.12334 L 311.4688,187.32855 L 310.07798,187.24763 L 311.76717,180.12338 L 311.76717,180.12334 z"
             style="opacity:0.38942339;fill:url(#radialGradient11207);fill-opacity:1;stroke:none;display:inline;enable-background:new" />
        </g>
      </g>
      <g
         transform="translate(10,0)"
         id="g11161">
        <path
           sodipodi:type="inkscape:offset"
           inkscape:radius="2.1041079"
           inkscape:original="M 49.0625 377.90625 C 48.351795 377.97898 47.715484 378.40319 47.375 379.03125 L 33.09375 405.40625 C 32.921854 405.73057 32.838 406.08368 32.84375 406.4375 C 32.843921 406.44806 32.843422 406.45818 32.84375 406.46875 L 32.84375 409.46875 L 32.84375 409.78125 L 32.90625 409.78125 C 32.951585 410.04087 33.016408 410.29742 33.15625 410.53125 C 33.544315 411.18013 34.243936 411.5896 35 411.59375 L 255.84375 411.59375 C 256.60912 411.59549 257.32874 411.18979 257.71875 410.53125 C 257.85619 410.2992 257.92557 410.03943 257.96875 409.78125 C 258.01748 409.48989 258.03125 408.90625 258.03125 408.90625 L 258.03125 406.8125 C 258.03125 406.32053 257.99454 405.81869 257.75 405.375 L 242.90625 379 C 242.51767 378.31998 241.78319 377.89854 241 377.90625 L 49.28125 377.90625 C 49.208701 377.90258 49.135047 377.90258 49.0625 377.90625 z "
           style="fill:url(#linearGradient11209);fill-opacity:1;stroke:url(#linearGradient11211);stroke-width:12.34623909;stroke-linecap:square;stroke-linejoin:miter;stroke-miterlimit:4;stroke-dasharray:none;stroke-dashoffset:0.3612;stroke-opacity:1;display:inline;enable-background:new"
           id="path11163"
           d="M 48.84375,375.8125 C 47.435282,375.95664 46.206014,376.78657 45.53125,378.03125 L 31.25,404.40625 C 30.914755,405.03876 30.73848,405.75988 30.75,406.46875 C 30.748746,406.39129 30.746329,406.41294 30.75,406.53125 L 30.75,409.46875 L 30.75,409.78125 C 30.745943,410.21651 30.87696,410.64231 31.125,411 C 31.201261,411.21987 31.198308,411.38181 31.34375,411.625 C 32.103454,412.89529 33.491398,413.67922 35,413.6875 L 255.84375,413.6875 C 257.35566,413.69094 258.75604,412.9027 259.53125,411.59375 C 259.86135,411.03642 259.96546,410.51837 260.03125,410.125 C 260.14476,409.44634 260.125,408.96875 260.125,408.96875 C 260.12531,408.94792 260.12531,408.92708 260.125,408.90625 L 260.125,406.8125 C 260.125,406.21586 260.11907,405.29688 259.59375,404.34375 L 244.75,377.96875 C 244.73958,377.96867 244.72917,377.96867 244.71875,377.96875 C 243.94931,376.62222 242.5196,375.79723 240.96875,375.8125 L 49.375,375.8125 C 49.341697,375.81082 49.314423,375.81341 49.28125,375.8125 C 49.170672,375.80948 49.079762,375.80688 48.96875,375.8125 C 48.927093,375.81126 48.885407,375.81126 48.84375,375.8125 z"
           transform="matrix(8.2832523e-2,0,0,7.9200815e-2,331.95307,165.73561)" />
        <path
           style="fill:url(#linearGradient11213);fill-opacity:1;fill-rule:evenodd;stroke:none;stroke-width:1px;stroke-linecap:butt;stroke-linejoin:miter;stroke-opacity:1;display:inline;enable-background:new"
           d="M 337.44515,195 L 336.53707,197 L 346.24566,196.9975 L 345.98913,195 L 337.44515,195 z M 346.43296,195 L 346.57372,196.01298 L 348.47162,196.01298 L 348.20601,195 L 346.43296,195 z M 348.65041,195.31959 L 349.15894,196.9975 L 351.60225,196.9975 L 350.8213,195.31959 L 348.65041,195.31959 z M 346.70084,196.50425 L 346.76441,196.9975 L 348.75993,196.9975 L 348.63507,196.50425 L 346.70084,196.50425 z"
           id="path11165"
           sodipodi:nodetypes="cccccccccccccccccccc" />
        <g
           id="g11167"
           style="fill:url(#linearGradient11235);fill-opacity:1;display:inline;enable-background:new"
           transform="translate(30.13815,2.90019)">
          <rect
             ry="0.28125"
             rx="0.28125"
             y="193"
             x="307"
             height="1"
             width="1"
             id="rect11169"
             style="opacity:0.55363734;fill:url(#linearGradient11215);fill-opacity:1;stroke:none;stroke-width:1;stroke-linecap:round;stroke-linejoin:round;stroke-miterlimit:4;stroke-dasharray:none;stroke-dashoffset:0.3612;stroke-opacity:1;display:inline;enable-background:new" />
          <rect
             ry="0.28125"
             rx="0.28125"
             y="192"
             x="308"
             height="1"
             width="1"
             id="rect11171"
             style="opacity:0.55363734;fill:url(#linearGradient11217);fill-opacity:1;stroke:none;stroke-width:1;stroke-linecap:round;stroke-linejoin:round;stroke-miterlimit:4;stroke-dasharray:none;stroke-dashoffset:0.3612;stroke-opacity:1;display:inline;enable-background:new" />
          <rect
             ry="0.28125"
             rx="0.28125"
             y="192"
             x="310"
             height="1"
             width="1"
             id="rect11173"
             style="opacity:0.55363734;fill:url(#linearGradient11219);fill-opacity:1;stroke:none;stroke-width:1;stroke-linecap:round;stroke-linejoin:round;stroke-miterlimit:4;stroke-dasharray:none;stroke-dashoffset:0.3612;stroke-opacity:1;display:inline;enable-background:new" />
          <rect
             ry="0.28125"
             rx="0.28125"
             y="192"
             x="312"
             height="1"
             width="1"
             id="rect11175"
             style="opacity:0.55363734;fill:url(#linearGradient11221);fill-opacity:1;stroke:none;stroke-width:1;stroke-linecap:round;stroke-linejoin:round;stroke-miterlimit:4;stroke-dasharray:none;stroke-dashoffset:0.3612;stroke-opacity:1;display:inline;enable-background:new" />
          <rect
             ry="0.28125"
             rx="0.28125"
             y="193"
             x="315"
             height="1"
             width="1"
             id="rect11177"
             style="opacity:0.55363734;fill:url(#linearGradient11223);fill-opacity:1;stroke:none;stroke-width:1;stroke-linecap:round;stroke-linejoin:round;stroke-miterlimit:4;stroke-dasharray:none;stroke-dashoffset:0.3612;stroke-opacity:1;display:inline;enable-background:new" />
          <rect
             ry="0.28125"
             rx="0.28125"
             y="192"
             x="314"
             height="1"
             width="1"
             id="rect11179"
             style="opacity:0.55363734;fill:url(#linearGradient11225);fill-opacity:1;stroke:none;stroke-width:1;stroke-linecap:round;stroke-linejoin:round;stroke-miterlimit:4;stroke-dasharray:none;stroke-dashoffset:0.3612;stroke-opacity:1;display:inline;enable-background:new" />
          <rect
             ry="0.28125"
             rx="0.28125"
             y="192"
             x="317"
             height="1"
             width="1"
             id="rect11181"
             style="opacity:0.55363734;fill:url(#linearGradient11227);fill-opacity:1;stroke:none;stroke-width:1;stroke-linecap:round;stroke-linejoin:round;stroke-miterlimit:4;stroke-dasharray:none;stroke-dashoffset:0.3612;stroke-opacity:1;display:inline;enable-background:new" />
          <rect
             ry="0.28125"
             rx="0.28125"
             y="193"
             x="319"
             height="1"
             width="1"
             id="rect11183"
             style="opacity:0.55363734;fill:url(#linearGradient11229);fill-opacity:1;stroke:none;stroke-width:1;stroke-linecap:round;stroke-linejoin:round;stroke-miterlimit:4;stroke-dasharray:none;stroke-dashoffset:0.3612;stroke-opacity:1;display:inline;enable-background:new" />
          <rect
             ry="0.28125"
             rx="0.28125"
             y="192"
             x="320"
             height="1"
             width="1"
             id="rect11185"
             style="opacity:0.55363734;fill:url(#linearGradient11231);fill-opacity:1;stroke:none;stroke-width:1;stroke-linecap:round;stroke-linejoin:round;stroke-miterlimit:4;stroke-dasharray:none;stroke-dashoffset:0.3612;stroke-opacity:1;display:inline;enable-background:new" />
          <rect
             ry="0.28125"
             rx="0.28125"
             y="193"
             x="321"
             height="1"
             width="1"
             id="rect11187"
             style="opacity:0.55363734;fill:url(#linearGradient11233);fill-opacity:1;stroke:none;stroke-width:1;stroke-linecap:round;stroke-linejoin:round;stroke-miterlimit:4;stroke-dasharray:none;stroke-dashoffset:0.3612;stroke-opacity:1;display:inline;enable-background:new" />
        </g>
      </g>
    </g>
  </g>
</svg>
