<?xml version="1.0" encoding="UTF-8" standalone="no"?>
<!-- Created with Inkscape (http://www.inkscape.org/) -->
<svg
   xmlns:dc="http://purl.org/dc/elements/1.1/"
   xmlns:cc="http://creativecommons.org/ns#"
   xmlns:rdf="http://www.w3.org/1999/02/22-rdf-syntax-ns#"
   xmlns:svg="http://www.w3.org/2000/svg"
   xmlns="http://www.w3.org/2000/svg"
   xmlns:xlink="http://www.w3.org/1999/xlink"
   xmlns:sodipodi="http://sodipodi.sourceforge.net/DTD/sodipodi-0.dtd"
   xmlns:inkscape="http://www.inkscape.org/namespaces/inkscape"
   width="48px"
   height="48px"
   id="svg7526"
   sodipodi:version="0.32"
   inkscape:version="0.46"
   sodipodi:docname="drawing-2.svg"
   inkscape:output_extension="org.inkscape.output.svg.inkscape">
  <defs
     id="defs7528">
    <linearGradient
       id="linearGradient10176"
       gradientUnits="userSpaceOnUse"
       x1="71.999496"
       y1="14.2578"
       x2="71.999496"
       y2="19.9583"
       gradientTransform="matrix(1.0033404,0,0,1,-8.2374684,8)">
      <stop
         offset="0.00445589"
         style="stop-color:#feebd6;stop-opacity:0;"
         id="stop10178" />
      <stop
         id="stop10180"
         style="stop-color:#f5f5f5;stop-opacity:0.53"
         offset="0.46138024" />
      <stop
         offset="1"
         style="stop-color:#f5f5f5;stop-opacity:0"
         id="stop10182" />
    </linearGradient>
    <linearGradient
       inkscape:collect="always"
       xlink:href="#linearGradient10176"
       id="linearGradient9649"
       gradientUnits="userSpaceOnUse"
       gradientTransform="matrix(0.4550303,0,0,0.942809,-5.399878,-22.279208)"
       x1="7.2379346"
       y1="36.005047"
       x2="132.86028"
       y2="35.857735" />
    <linearGradient
       inkscape:collect="always"
       id="linearGradient9087">
      <stop
         style="stop-color:#00af00;stop-opacity:1"
         offset="0"
         id="stop9089" />
      <stop
         style="stop-color:#00af00;stop-opacity:1"
         offset="1"
         id="stop9091" />
    </linearGradient>
    <linearGradient
       inkscape:collect="always"
       xlink:href="#linearGradient9087"
       id="linearGradient9647"
       gradientUnits="userSpaceOnUse"
       x1="163.02567"
       y1="17"
       x2="162.99203"
       y2="45"
       gradientTransform="translate(-133.9995,-6.9999956)" />
    <linearGradient
       id="linearGradient9073">
      <stop
         id="stop9075"
         offset="0"
         style="stop-color:#00af00;stop-opacity:1" />
      <stop
         id="stop9077"
         offset="1"
         style="stop-color:#00af00;stop-opacity:1" />
    </linearGradient>
    <linearGradient
       inkscape:collect="always"
       xlink:href="#linearGradient9073"
       id="linearGradient9645"
       gradientUnits="userSpaceOnUse"
       gradientTransform="matrix(0.3515659,0,0,0.3552688,14.060973,-107.34001)"
       x1="28.272148"
       y1="324.68878"
       x2="28.272144"
       y2="409.09872" />
    <linearGradient
       gradientTransform="matrix(1.0033404,0,0,1,-8.2374684,8)"
       y2="19.9583"
       x2="71.999496"
       y1="14.2578"
       x1="71.999496"
       gradientUnits="userSpaceOnUse"
       id="linearGradient9101">
      <stop
         id="stop9103"
         style="stop-color:#00af00;stop-opacity:0"
         offset="0.25" />
      <stop
         id="stop9105"
         style="stop-color:#00af00;stop-opacity:1"
         offset="1" />
    </linearGradient>
    <linearGradient
       inkscape:collect="always"
       xlink:href="#linearGradient9101"
       id="linearGradient9133"
       gradientUnits="userSpaceOnUse"
       gradientTransform="matrix(0.3707962,0,0,0.1666666,-2.696087,6.6666714)"
       x1="71.999496"
       y1="14.2578"
       x2="71.999496"
       y2="19.9583" />
    <linearGradient
       id="linearGradient17648">
      <stop
         id="stop17650"
         offset="0"
         style="stop-color:#ffffff;stop-opacity:0.6" />
      <stop
         id="stop17652"
         offset="1"
         style="stop-color:#ffffff;stop-opacity:0;" />
    </linearGradient>
    <linearGradient
       inkscape:collect="always"
       xlink:href="#linearGradient17648"
       id="linearGradient17646"
       gradientUnits="userSpaceOnUse"
       x1="23.959301"
       y1="10"
       x2="23.984924"
       y2="41.999912"
       gradientTransform="translate(4.9301119e-4,-4.9999316)" />
    <linearGradient
       inkscape:collect="always"
       id="linearGradient6293">
      <stop
         style="stop-color:#888a85;stop-opacity:1"
         offset="0"
         id="stop6295" />
      <stop
         style="stop-color:#555753;stop-opacity:0"
         offset="1"
         id="stop6297" />
    </linearGradient>
    <linearGradient
       inkscape:collect="always"
       xlink:href="#linearGradient6293"
       id="linearGradient17644"
       gradientUnits="userSpaceOnUse"
       x1="25.0625"
       y1="8.9999352"
       x2="25.0625"
       y2="28.082869"
       gradientTransform="translate(4.9301119e-4,-4.9999316)" />
    <linearGradient
       id="linearGradient9347">
      <stop
         id="stop9349"
         offset="0.0000000"
         style="stop-color:#7a7a7a;stop-opacity:1.0000000;" />
      <stop
         id="stop9351"
         offset="0.19801980"
         style="stop-color:#ebebeb;stop-opacity:1" />
      <stop
         id="stop9353"
         offset="0.59900987"
         style="stop-color:#b9b9b9;stop-opacity:1" />
      <stop
         id="stop9355"
         offset="1.0000000"
         style="stop-color:#878787;stop-opacity:1" />
    </linearGradient>
    <linearGradient
       inkscape:collect="always"
       xlink:href="#linearGradient9347"
       id="linearGradient7755"
       gradientUnits="userSpaceOnUse"
       gradientTransform="matrix(0.7312763,0,0,0.6969978,6.8684642,14.121769)"
       x1="23.100046"
       y1="38.296745"
       x2="23.143667"
       y2="46.03775" />
    <linearGradient
       id="linearGradient178">
      <stop
         style="stop-color:#ffffff;stop-opacity:0.0000000;"
         offset="0.0000000"
         id="stop179" />
      <stop
         style="stop-color:#d9d9d9;stop-opacity:1"
         offset="0.10827128"
         id="stop180" />
      <stop
         style="stop-color:#d9d9d9;stop-opacity:1"
         offset="0.92053902"
         id="stop181" />
      <stop
         style="stop-color:#ffffff;stop-opacity:0.0000000;"
         offset="1.0000000"
         id="stop182" />
    </linearGradient>
    <linearGradient
       inkscape:collect="always"
       xlink:href="#linearGradient178"
       id="linearGradient7832"
       gradientUnits="userSpaceOnUse"
       gradientTransform="matrix(3.1119049,0,0,9.1235758e-2,28.948795,19.750004)"
       x1="1.6422368"
       y1="117.8271"
       x2="15.343062"
       y2="117.8271" />
    <linearGradient
       inkscape:collect="always"
       xlink:href="#linearGradient272"
       id="linearGradient7834"
       gradientUnits="userSpaceOnUse"
       gradientTransform="matrix(9.3885418,0,0,0.2235361,29.130383,-45.865211)"
       x1="0.61210024"
       y1="372.57819"
       x2="5.0856376"
       y2="372.57819" />
    <linearGradient
       id="linearGradient272">
      <stop
         style="stop-color:#474747;stop-opacity:0.0000000;"
         offset="0.0000000"
         id="stop273" />
      <stop
         style="stop-color:#474747;stop-opacity:1.0000000;"
         offset="0.10000000"
         id="stop275" />
      <stop
         style="stop-color:#474747;stop-opacity:1.0000000;"
         offset="0.89999998"
         id="stop276" />
      <stop
         style="stop-color:#474747;stop-opacity:0.0000000;"
         offset="1.0000000"
         id="stop274" />
    </linearGradient>
    <linearGradient
       inkscape:collect="always"
       xlink:href="#linearGradient272"
       id="linearGradient7830"
       gradientUnits="userSpaceOnUse"
       gradientTransform="matrix(9.3885424,0,0,0.2235366,29.130395,-51.784906)"
       x1="0.61210024"
       y1="372.57819"
       x2="5.0856376"
       y2="372.57819" />
    <linearGradient
       inkscape:collect="always"
       id="linearGradient6704">
      <stop
         style="stop-color:#000000;stop-opacity:1;"
         offset="0"
         id="stop6706" />
      <stop
         style="stop-color:#000000;stop-opacity:0;"
         offset="1"
         id="stop6708" />
    </linearGradient>
    <radialGradient
       inkscape:collect="always"
       xlink:href="#linearGradient6704"
       id="radialGradient7753"
       gradientUnits="userSpaceOnUse"
       gradientTransform="matrix(1,0,0,0.1166667,0,348.72344)"
       cx="1120.375"
       cy="394.78125"
       fx="1120.375"
       fy="394.78125"
       r="20.625" />
  </defs>
  <sodipodi:namedview
     id="base"
     pagecolor="#ffffff"
     bordercolor="#666666"
     borderopacity="1.0"
     inkscape:pageopacity="0.0"
     inkscape:pageshadow="2"
     inkscape:zoom="7"
     inkscape:cx="24"
     inkscape:cy="24"
     inkscape:current-layer="layer1"
     showgrid="true"
     inkscape:grid-bbox="true"
     inkscape:document-units="px"
     inkscape:window-width="641"
     inkscape:window-height="688"
     inkscape:window-x="404"
     inkscape:window-y="411" />
  <metadata
     id="metadata7531">
    <rdf:RDF>
      <cc:Work
         rdf:about="">
        <dc:format>image/svg+xml</dc:format>
        <dc:type
           rdf:resource="http://purl.org/dc/dcmitype/StillImage" />
      </cc:Work>
    </rdf:RDF>
  </metadata>
  <g
     id="layer1"
     inkscape:label="Layer 1"
     inkscape:groupmode="layer">
    <rect
       style="fill:#d9d9d9;fill-opacity:1;stroke:#707070;stroke-width:1;stroke-miterlimit:4;stroke-dasharray:none;stroke-opacity:1"
       id="rect8955"
       width="2.9998591"
       height="2.9998591"
       x="22.500496"
       y="37.500168" />
    <path
       sodipodi:type="arc"
       style="opacity:0.3;fill:url(#radialGradient7753);fill-opacity:1;fill-rule:evenodd;stroke:none;display:inline;enable-background:new"
       id="path6774"
       sodipodi:cx="1120.375"
       sodipodi:cy="394.78125"
       sodipodi:rx="20.625"
       sodipodi:ry="2.40625"
       d="M 1141,394.78125 A 20.625,2.40625 0 1 1 1099.75,394.78125 A 20.625,2.40625 0 1 1 1141,394.78125 z"
       transform="matrix(1.0181815,0,0,1.2467532,-1116.7447,-447.19479)" />
    <g
       style="display:inline;enable-background:new"
       id="g7753"
       transform="translate(-31.876607,12.999559)">
      <rect
         style="opacity:0.65;fill:url(#linearGradient7830);fill-opacity:1;fill-rule:nonzero;stroke:none;stroke-width:1;marker:none;visibility:visible;display:block;overflow:visible"
         id="rect8601"
         width="41.999989"
         height="1"
         x="34.877113"
         y="31" />
      <rect
         style="opacity:0.65;fill:url(#linearGradient7834);fill-opacity:1;fill-rule:nonzero;stroke:none;stroke-width:1;marker:none;visibility:visible;display:block;overflow:visible"
         id="rect8603"
         width="41.999989"
         height="1"
         x="34.877102"
         y="29" />
      <rect
         style="fill:url(#linearGradient7832);fill-opacity:1;fill-rule:nonzero;stroke:none;stroke-width:1;marker:none;visibility:visible;display:block;overflow:visible"
         id="rect8605"
         width="41.5"
         height="1"
         x="34.627102"
         y="30" />
      <g
         transform="matrix(0.544365,0,0,0.9411763,42.076688,-8.6470511)"
         id="g8613"
         style="fill:#ffffff;fill-opacity:0.72023806" />
    </g>
    <path
       sodipodi:nodetypes="ccccccccccc"
       style="fill:url(#linearGradient7755);fill-opacity:1;fill-rule:nonzero;stroke:#555753;stroke-width:1.00006688;stroke-linecap:butt;stroke-linejoin:miter;marker:none;stroke-miterlimit:4;stroke-dasharray:none;stroke-dashoffset:0;stroke-opacity:1;visibility:visible;display:block;overflow:visible;enable-background:new"
       d="M 21.779213,40.50006 L 18.545815,40.50006 C 17.963443,40.50006 17.500527,40.9271 17.500527,41.464335 L 17.500527,45.535418 C 17.500527,46.072648 17.963443,46.499993 18.545815,46.499993 L 29.455169,46.499993 C 30.037536,46.499993 30.500459,46.072648 30.500459,45.535418 L 30.500459,41.464335 C 30.500459,40.9271 30.037536,40.50006 29.455169,40.50006 L 26.634004,40.50006 L 21.779213,40.50006 z"
       id="path8607" />
    <rect
       style="fill:#ffffff;fill-opacity:0.72023806;fill-rule:nonzero;stroke:none;stroke-width:1.13999999;marker:none;visibility:visible;display:block;overflow:visible;enable-background:new"
       id="rect8615"
       width="8"
       height="1.5"
       x="21.000496"
       y="41.250027"
       rx="0.49999997"
       ry="0.5" />
    <path
       sodipodi:type="arc"
       style="fill:#ffffff;fill-opacity:0.72023806;fill-rule:nonzero;stroke:none;stroke-width:1.13999999;marker:none;visibility:visible;display:block;overflow:visible;enable-background:new"
       id="path8617"
       sodipodi:cx="18.46875"
       sodipodi:cy="40.625"
       sodipodi:rx="0.53125"
       sodipodi:ry="0.53125"
       d="M 19,40.625 A 0.53125,0.53125 0 1 1 17.9375,40.625 A 0.53125,0.53125 0 1 1 19,40.625 z"
       transform="matrix(1.4117647,0,0,1.4117647,-6.573036,-15.352915)" />
    <path
       d="M 44.500495,9.5000034 C 44.510046,8.0061514 44.008307,7.5000684 42.500495,7.5000684 L 19.500495,7.5000684 L 17.000495,5.0000684 C 16.734219,4.7406644 16.376979,4.5000034 16.000495,4.5000034 L 5.5004932,4.5000034 C 4.0131522,4.5000034 3.4692432,5.0164724 3.5004932,6.5000044 L 3.5004932,37.500004 L 44.500495,37.500004 L 44.500495,9.5000034 z"
       id="path15"
       style="fill:#eeeeec;fill-opacity:1;stroke:url(#linearGradient17644);stroke-width:0.99986976;stroke-miterlimit:4;stroke-dasharray:none"
       sodipodi:nodetypes="cccccccccc" />
    <path
       d="M 43.500495,9.5000674 C 43.492367,8.5865544 43.445053,8.5111164 42.500495,8.5000674 L 19.000495,8.5000674 L 16.500495,6.0000684 C 16.061316,5.3837614 15.951425,5.5313184 15.000495,5.5000684 L 5.0004922,5.5000684 C 4.2861412,5.5000684 4.5004922,5.8123844 4.5004922,6.5000684 L 4.5004932,36.500004 L 43.500495,36.500004 L 43.500495,9.5000674 z"
       id="path7263"
       style="opacity:1;fill:none;fill-opacity:1;stroke:url(#linearGradient17646);stroke-width:0.9999525;stroke-miterlimit:4;stroke-dasharray:none;stroke-opacity:1"
       sodipodi:nodetypes="cccccccccc" />
    <path
       style="opacity:0.5;fill:url(#linearGradient9133);fill-opacity:1;display:inline;enable-background:new"
       id="path39053"
       d="M 4.0012352,9.0000044 C 4.0043232,9.2916704 4.0074112,9.6258374 4.0104992,10.000004 L 43.991231,10.000004 C 43.994319,9.6258374 43.997407,9.2916704 44.000495,9.0000044 L 4.0004942,9.0000044 L 4.0012352,9.0000044 z" />
    <path
       d="M 45.250495,36.500004 C 45.220125,37.085488 44.582545,37.500213 44.000495,37.500213 L 4.0004952,37.500213 C 3.4184552,37.500213 2.781185,37.085488 2.750495,36.500004 L 1.500495,11.500004 C 1.458155,10.915587 1.918445,10.499795 2.500495,10.499795 L 45.500495,10.499795 C 46.082545,10.499795 46.544935,10.915587 46.500495,11.500004 L 45.250495,36.500004 L 45.250495,36.500004 z"
       id="path39063"
       style="opacity:0.9;fill:url(#linearGradient9645);fill-opacity:1;stroke:url(#linearGradient9647);stroke-width:0.99958181;stroke-miterlimit:4;stroke-dasharray:none;display:inline;enable-background:new"
       sodipodi:nodetypes="cccccccccc" />
    <rect
       style="fill:url(#linearGradient9649);fill-opacity:1;stroke:none;display:inline;enable-background:new"
       id="rect3521-5"
       width="44"
       height="1"
       x="2.0004914"
       y="11.000007"
       rx="0"
       ry="0" />
  </g>
</svg>
