<?xml version="1.0" encoding="UTF-8" standalone="no"?>
<!-- Created with Inkscape (http://www.inkscape.org/) -->
<svg
   xmlns:dc="http://purl.org/dc/elements/1.1/"
   xmlns:cc="http://creativecommons.org/ns#"
   xmlns:rdf="http://www.w3.org/1999/02/22-rdf-syntax-ns#"
   xmlns:svg="http://www.w3.org/2000/svg"
   xmlns="http://www.w3.org/2000/svg"
   xmlns:xlink="http://www.w3.org/1999/xlink"
   xmlns:sodipodi="http://sodipodi.sourceforge.net/DTD/sodipodi-0.dtd"
   xmlns:inkscape="http://www.inkscape.org/namespaces/inkscape"
   width="48px"
   height="48px"
   id="svg7517"
   sodipodi:version="0.32"
   inkscape:version="0.46"
   sodipodi:docname="drawing.svg"
   inkscape:output_extension="org.inkscape.output.svg.inkscape">
  <defs
     id="defs7519">
    <linearGradient
       inkscape:collect="always"
       xlink:href="#linearGradient8598"
       id="linearGradient7515"
       gradientUnits="userSpaceOnUse"
       gradientTransform="matrix(0.1,0,0,0.9938523,-23.528572,13.104512)"
       x1="64.571419"
       y1="11.012297"
       x2="-213.82544"
       y2="11.034804" />
    <linearGradient
       inkscape:collect="always"
       xlink:href="#linearGradient8598"
       id="linearGradient7511"
       gradientUnits="userSpaceOnUse"
       gradientTransform="matrix(0.1,0,0,0.9938523,-23.600001,2.1045116)"
       x1="64.571442"
       y1="21.02474"
       x2="-213.99998"
       y2="21.096659" />
    <linearGradient
       inkscape:collect="always"
       xlink:href="#linearGradient8598"
       id="linearGradient7507"
       gradientUnits="userSpaceOnUse"
       gradientTransform="matrix(0.1,0,0,0.9938523,-35.635714,13.033083)"
       x1="185.64284"
       y1="11.084167"
       x2="-92.754021"
       y2="11.106675" />
    <linearGradient
       inkscape:collect="always"
       xlink:href="#linearGradient8598"
       id="linearGradient7503"
       gradientUnits="userSpaceOnUse"
       gradientTransform="matrix(0.1,0,0,0.9938523,-35.671428,2.1045116)"
       x1="185.28571"
       y1="21.02474"
       x2="-93.285721"
       y2="21.096659" />
    <linearGradient
       inkscape:collect="always"
       xlink:href="#linearGradient8598"
       id="linearGradient7499"
       gradientUnits="userSpaceOnUse"
       gradientTransform="matrix(0.1,0,0,0.9938523,-25.671429,13.104512)"
       x1="85.999992"
       y1="11.012297"
       x2="-192.39687"
       y2="11.034804" />
    <linearGradient
       inkscape:collect="always"
       xlink:href="#linearGradient8598"
       id="linearGradient7495"
       gradientUnits="userSpaceOnUse"
       gradientTransform="matrix(0.1,0,0,0.9938523,-25.528572,2.1402256)"
       x1="83.857155"
       y1="20.988806"
       x2="-194.71428"
       y2="21.060724" />
    <linearGradient
       inkscape:collect="always"
       xlink:href="#linearGradient8598"
       id="linearGradient7451"
       gradientUnits="userSpaceOnUse"
       gradientTransform="matrix(0.1,0,0,0.9938523,-27.6,2.1045146)"
       x1="104.57143"
       y1="21.024738"
       x2="-174"
       y2="21.096657" />
    <linearGradient
       inkscape:collect="always"
       xlink:href="#linearGradient8598"
       id="linearGradient7449"
       gradientUnits="userSpaceOnUse"
       gradientTransform="matrix(0.1,0,0,0.9938523,-27.600001,13.104513)"
       x1="105.28571"
       y1="11.012296"
       x2="-173.11115"
       y2="11.034803" />
    <linearGradient
       inkscape:collect="always"
       xlink:href="#linearGradient8598"
       id="linearGradient7441"
       gradientUnits="userSpaceOnUse"
       gradientTransform="matrix(0.1,0,0,0.9938523,-33.599999,2.1045136)"
       x1="164.57143"
       y1="21.024738"
       x2="-114.00001"
       y2="21.096657" />
    <linearGradient
       inkscape:collect="always"
       xlink:href="#linearGradient8598"
       id="linearGradient7439"
       gradientUnits="userSpaceOnUse"
       gradientTransform="matrix(0.1,0,0,0.9938523,-31.599998,2.1045146)"
       x1="144.57141"
       y1="21.024738"
       x2="-134.00002"
       y2="21.096657" />
    <linearGradient
       inkscape:collect="always"
       xlink:href="#linearGradient8598"
       id="linearGradient7437"
       gradientUnits="userSpaceOnUse"
       gradientTransform="matrix(0.1,0,0,0.9938523,-29.599998,2.1045146)"
       x1="124.57141"
       y1="21.024738"
       x2="-154.00002"
       y2="21.096657" />
    <linearGradient
       inkscape:collect="always"
       xlink:href="#linearGradient8598"
       id="linearGradient7435"
       gradientUnits="userSpaceOnUse"
       gradientTransform="matrix(0.1,0,0,0.9938523,-29.599999,13.104514)"
       x1="125.28569"
       y1="11.012295"
       x2="-153.11118"
       y2="11.034802" />
    <linearGradient
       inkscape:collect="always"
       xlink:href="#linearGradient8598"
       id="linearGradient7433"
       gradientUnits="userSpaceOnUse"
       gradientTransform="matrix(0.1,0,0,0.9938523,-31.599999,13.104514)"
       x1="145.28569"
       y1="11.012295"
       x2="-133.11118"
       y2="11.034802" />
    <linearGradient
       inkscape:collect="always"
       xlink:href="#linearGradient8598"
       id="linearGradient7431"
       gradientUnits="userSpaceOnUse"
       gradientTransform="matrix(0.1,0,0,0.9938523,-33.599999,13.104514)"
       x1="165.28569"
       y1="11.012295"
       x2="-113.11117"
       y2="11.034802" />
    <linearGradient
       inkscape:collect="always"
       xlink:href="#linearGradient8598"
       id="linearGradient7429"
       gradientUnits="userSpaceOnUse"
       gradientTransform="matrix(1.5,0,0,0.9938523,-45.000001,12.104514)"
       x1="18.73016"
       y1="12.11281"
       x2="-0.0705617"
       y2="12.067882" />
    <linearGradient
       inkscape:collect="always"
       xlink:href="#linearGradient8598"
       id="linearGradient7427"
       gradientUnits="userSpaceOnUse"
       gradientTransform="matrix(1.5,0,0,0.9938523,-44.999999,3.1045136)"
       x1="18.730158"
       y1="21.168482"
       x2="-0.070563033"
       y2="21.123554" />
    <linearGradient
       inkscape:collect="always"
       id="linearGradient8598">
      <stop
         style="stop-color:#ffffff;stop-opacity:1;"
         offset="0"
         id="stop8600" />
      <stop
         style="stop-color:#ffffff;stop-opacity:0;"
         offset="1"
         id="stop8602" />
    </linearGradient>
    <linearGradient
       inkscape:collect="always"
       xlink:href="#linearGradient8598"
       id="linearGradient7425"
       gradientUnits="userSpaceOnUse"
       gradientTransform="matrix(0.8,0,0,0.9938523,15.199998,12.104514)"
       x1="11.000003"
       y1="5.0378203"
       x2="11.000003"
       y2="33.066071" />
    <linearGradient
       inkscape:collect="always"
       id="linearGradient8372">
      <stop
         style="stop-color:#ffffff;stop-opacity:1;"
         offset="0"
         id="stop8374" />
      <stop
         style="stop-color:#ffffff;stop-opacity:0;"
         offset="1"
         id="stop8376" />
    </linearGradient>
    <linearGradient
       inkscape:collect="always"
       xlink:href="#linearGradient8372"
       id="linearGradient7423"
       gradientUnits="userSpaceOnUse"
       gradientTransform="translate(13.99996,17.000041)"
       x1="9.999999"
       y1="0.071468621"
       x2="9.999999"
       y2="27.92452" />
    <linearGradient
       id="linearGradient10176"
       gradientUnits="userSpaceOnUse"
       x1="71.999496"
       y1="14.2578"
       x2="71.999496"
       y2="19.9583"
       gradientTransform="matrix(1.0033404,0,0,1,-8.2374684,8)">
      <stop
         offset="0.00445589"
         style="stop-color:#feebd6;stop-opacity:0;"
         id="stop10178" />
      <stop
         id="stop10180"
         style="stop-color:#f5f5f5;stop-opacity:0.53"
         offset="0.46138024" />
      <stop
         offset="1"
         style="stop-color:#f5f5f5;stop-opacity:0"
         id="stop10182" />
    </linearGradient>
    <linearGradient
       inkscape:collect="always"
       xlink:href="#linearGradient10176"
       id="linearGradient9649"
       gradientUnits="userSpaceOnUse"
       gradientTransform="matrix(0.4550303,0,0,0.942809,-5.4003734,-18.279212)"
       x1="7.2379346"
       y1="36.005047"
       x2="132.86028"
       y2="35.857735" />
    <linearGradient
       inkscape:collect="always"
       id="linearGradient9087">
      <stop
         style="stop-color:#795548;stop-opacity:1"
         offset="0"
         id="stop9089" />
      <stop
         style="stop-color:#795548;stop-opacity:1"
         offset="1"
         id="stop9091" />
    </linearGradient>
    <linearGradient
       inkscape:collect="always"
       xlink:href="#linearGradient9087"
       id="linearGradient9647"
       gradientUnits="userSpaceOnUse"
       x1="163.02567"
       y1="17"
       x2="162.99203"
       y2="45"
       gradientTransform="translate(-134,-3.0000003)" />
    <linearGradient
       id="linearGradient9073">
      <stop
         id="stop9075"
         offset="0"
         style="stop-color:#795548;stop-opacity:1" />
      <stop
         id="stop9077"
         offset="1"
         style="stop-color:#795548;stop-opacity:1" />
    </linearGradient>
    <linearGradient
       inkscape:collect="always"
       xlink:href="#linearGradient9073"
       id="linearGradient9645"
       gradientUnits="userSpaceOnUse"
       gradientTransform="matrix(0.3515659,0,0,0.3552688,14.060478,-103.34001)"
       x1="28.272148"
       y1="324.68878"
       x2="28.272144"
       y2="409.09872" />
    <linearGradient
       gradientTransform="matrix(1.0033404,0,0,1,-8.2374684,8)"
       y2="19.9583"
       x2="71.999496"
       y1="14.2578"
       x1="71.999496"
       gradientUnits="userSpaceOnUse"
       id="linearGradient9101">
      <stop
         id="stop9103"
         style="stop-color:#795548;stop-opacity:0"
         offset="0.25" />
      <stop
         id="stop9105"
         style="stop-color:#795548;stop-opacity:1"
         offset="1" />
    </linearGradient>
    <linearGradient
       inkscape:collect="always"
       xlink:href="#linearGradient9101"
       id="linearGradient9133"
       gradientUnits="userSpaceOnUse"
       gradientTransform="matrix(0.3707962,0,0,0.1666666,-2.6965824,10.666667)"
       x1="71.999496"
       y1="14.2578"
       x2="71.999496"
       y2="19.9583" />
    <radialGradient
       inkscape:collect="always"
       xlink:href="#linearGradient5060"
       id="radialGradient2099"
       gradientUnits="userSpaceOnUse"
       gradientTransform="matrix(-2.774389,0,0,1.969706,112.7623,-872.8854)"
       cx="605.71429"
       cy="486.64789"
       fx="605.71429"
       fy="486.64789"
       r="117.14286" />
    <linearGradient
       inkscape:collect="always"
       id="linearGradient5060">
      <stop
         style="stop-color:black;stop-opacity:1;"
         offset="0"
         id="stop5062" />
      <stop
         style="stop-color:black;stop-opacity:0;"
         offset="1"
         id="stop5064" />
    </linearGradient>
    <radialGradient
       inkscape:collect="always"
       xlink:href="#linearGradient5060"
       id="radialGradient2097"
       gradientUnits="userSpaceOnUse"
       gradientTransform="matrix(2.774389,0,0,1.969706,-1891.633,-872.8854)"
       cx="605.71429"
       cy="486.64789"
       fx="605.71429"
       fy="486.64789"
       r="117.14286" />
    <linearGradient
       id="linearGradient5048">
      <stop
         style="stop-color:black;stop-opacity:0;"
         offset="0"
         id="stop5050" />
      <stop
         id="stop5056"
         offset="0.5"
         style="stop-color:black;stop-opacity:1;" />
      <stop
         style="stop-color:black;stop-opacity:0;"
         offset="1"
         id="stop5052" />
    </linearGradient>
    <linearGradient
       inkscape:collect="always"
       xlink:href="#linearGradient5048"
       id="linearGradient2095"
       gradientUnits="userSpaceOnUse"
       gradientTransform="matrix(2.774389,0,0,1.969706,-1892.179,-872.8854)"
       x1="302.85715"
       y1="366.64789"
       x2="302.85715"
       y2="609.50507" />
    <linearGradient
       id="linearGradient17648">
      <stop
         id="stop17650"
         offset="0"
         style="stop-color:#ffffff;stop-opacity:0.6" />
      <stop
         id="stop17652"
         offset="1"
         style="stop-color:#ffffff;stop-opacity:0;" />
    </linearGradient>
    <linearGradient
       inkscape:collect="always"
       xlink:href="#linearGradient17648"
       id="linearGradient17646"
       gradientUnits="userSpaceOnUse"
       x1="23.959301"
       y1="10"
       x2="23.984924"
       y2="41.999912"
       gradientTransform="translate(-2.3577825e-6,-0.9999363)" />
    <linearGradient
       inkscape:collect="always"
       id="linearGradient6293">
      <stop
         style="stop-color:#888a85;stop-opacity:1"
         offset="0"
         id="stop6295" />
      <stop
         style="stop-color:#555753;stop-opacity:0"
         offset="1"
         id="stop6297" />
    </linearGradient>
    <linearGradient
       inkscape:collect="always"
       xlink:href="#linearGradient6293"
       id="linearGradient17644"
       gradientUnits="userSpaceOnUse"
       x1="25.0625"
       y1="8.9999352"
       x2="25.0625"
       y2="28.082869"
       gradientTransform="translate(-2.3577825e-6,-0.9999363)" />
  </defs>
  <sodipodi:namedview
     id="base"
     pagecolor="#ffffff"
     bordercolor="#666666"
     borderopacity="1.0"
     inkscape:pageopacity="0.0"
     inkscape:pageshadow="2"
     inkscape:zoom="7"
     inkscape:cx="24"
     inkscape:cy="24"
     inkscape:current-layer="layer1"
     showgrid="true"
     inkscape:grid-bbox="true"
     inkscape:document-units="px"
     inkscape:window-width="641"
     inkscape:window-height="688"
     inkscape:window-x="1000"
     inkscape:window-y="25" />
  <metadata
     id="metadata7522">
    <rdf:RDF>
      <cc:Work
         rdf:about="">
        <dc:format>image/svg+xml</dc:format>
        <dc:type
           rdf:resource="http://purl.org/dc/dcmitype/StillImage" />
      </cc:Work>
    </rdf:RDF>
  </metadata>
  <g
     id="layer1"
     inkscape:label="Layer 1"
     inkscape:groupmode="layer">
    <path
       d="M 44.5,13.499999 C 44.509551,12.006147 44.007812,11.500064 42.5,11.500064 L 19.5,11.500064 L 17,9.0000639 C 16.733724,8.7406599 16.376484,8.4999989 16,8.4999989 L 5.4999973,8.4999989 C 4.0126566,8.4999989 3.4687476,9.0164679 3.4999976,10.5 L 3.4999976,41.5 L 44.5,41.5 L 44.5,13.499999 z"
       id="path15"
       style="fill:#eeeeec;fill-opacity:1;stroke:url(#linearGradient17644);stroke-width:0.99986976;stroke-miterlimit:4;stroke-dasharray:none"
       sodipodi:nodetypes="cccccccccc" />
    <path
       d="M 43.5,13.500063 C 43.491872,12.58655 43.444558,12.511112 42.5,12.500063 L 19,12.500063 L 16.5,10.000064 C 16.060821,9.3837569 15.95093,9.5313139 15,9.5000639 L 4.9999966,9.5000639 C 4.2856456,9.5000639 4.4999966,9.8123799 4.4999966,10.500064 L 4.4999976,40.5 L 43.5,40.5 L 43.5,13.500063 z"
       id="path7263"
       style="opacity:1;fill:none;fill-opacity:1;stroke:url(#linearGradient17646);stroke-width:0.9999525;stroke-miterlimit:4;stroke-dasharray:none;stroke-opacity:1"
       sodipodi:nodetypes="cccccccccc" />
    <g
       id="g13071"
       transform="matrix(2.3640267e-2,0,0,2.1950125e-2,45.026494,37.807815)"
       style="display:inline">
      <rect
         y="-150.69685"
         x="-1559.2523"
         height="478.35718"
         width="1339.6335"
         id="rect13073"
         style="opacity:0.40206185;fill:url(#linearGradient2095);fill-opacity:1;fill-rule:nonzero;stroke:none;stroke-width:1;stroke-linecap:round;stroke-linejoin:miter;marker:none;marker-start:none;marker-mid:none;marker-end:none;stroke-miterlimit:4;stroke-dasharray:none;stroke-dashoffset:0;stroke-opacity:1;visibility:visible;display:inline;overflow:visible" />
      <path
         sodipodi:nodetypes="cccc"
         id="path13075"
         d="M -219.61876,-150.68038 C -219.61876,-150.68038 -219.61876,327.65041 -219.61876,327.65041 C -76.744594,328.55086 125.78146,220.48075 125.78138,88.454235 C 125.78138,-43.572302 -33.655436,-150.68036 -219.61876,-150.68038 z"
         style="opacity:0.40206185;fill:url(#radialGradient2097);fill-opacity:1;fill-rule:nonzero;stroke:none;stroke-width:1;stroke-linecap:round;stroke-linejoin:miter;marker:none;marker-start:none;marker-mid:none;marker-end:none;stroke-miterlimit:4;stroke-dasharray:none;stroke-dashoffset:0;stroke-opacity:1;visibility:visible;display:inline;overflow:visible" />
      <path
         style="opacity:0.40206185;fill:url(#radialGradient2099);fill-opacity:1;fill-rule:nonzero;stroke:none;stroke-width:1;stroke-linecap:round;stroke-linejoin:miter;marker:none;marker-start:none;marker-mid:none;marker-end:none;stroke-miterlimit:4;stroke-dasharray:none;stroke-dashoffset:0;stroke-opacity:1;visibility:visible;display:inline;overflow:visible"
         d="M -1559.2523,-150.68038 C -1559.2523,-150.68038 -1559.2523,327.65041 -1559.2523,327.65041 C -1702.1265,328.55086 -1904.6525,220.48075 -1904.6525,88.454235 C -1904.6525,-43.572302 -1745.2157,-150.68036 -1559.2523,-150.68038 z"
         id="path13077"
         sodipodi:nodetypes="cccc" />
    </g>
    <path
       style="opacity:0.5;fill:url(#linearGradient9133);fill-opacity:1;display:inline;enable-background:new"
       id="path39053"
       d="M 4.0007396,13 C 4.0038276,13.291666 4.0069156,13.625833 4.0100036,14 L 43.990736,14 C 43.993824,13.625833 43.996912,13.291666 44,13 L 3.9999986,13 L 4.0007396,13 z" />
    <path
       d="M 45.25,40.5 C 45.21963,41.085484 44.58205,41.500209 44,41.500209 L 3.9999996,41.500209 C 3.4179596,41.500209 2.7806896,41.085484 2.7499996,40.5 L 1.4999996,15.5 C 1.4576596,14.915583 1.9179496,14.499791 2.4999996,14.499791 L 45.5,14.499791 C 46.08205,14.499791 46.54444,14.915583 46.5,15.5 L 45.25,40.5 L 45.25,40.5 z"
       id="path39063"
       style="opacity:0.9;fill:url(#linearGradient9645);fill-opacity:1;stroke:url(#linearGradient9647);stroke-width:0.99958181;stroke-miterlimit:4;stroke-dasharray:none;display:inline;enable-background:new"
       sodipodi:nodetypes="cccccccccc" />
    <rect
       style="fill:url(#linearGradient9649);fill-opacity:1;stroke:none;display:inline;enable-background:new"
       id="rect3521-5"
       width="44"
       height="1"
       x="1.9999968"
       y="15"
       rx="0"
       ry="0" />
    <path
       style="fill:none;fill-opacity:1;stroke:url(#linearGradient7423);stroke-width:0.99991763;stroke-linecap:round;stroke-linejoin:round;stroke-miterlimit:4;stroke-opacity:1"
       d="M 17.499959,20.5 L 30.49996,20.5 L 30.49996,36.500041 L 17.499959,36.500041 L 17.499959,20.5 z"
       id="rect7600"
       sodipodi:nodetypes="ccccc" />
    <rect
       style="fill:url(#linearGradient7425);fill-opacity:1;stroke:none;stroke-width:1;stroke-linecap:round;stroke-linejoin:round;stroke-miterlimit:4;stroke-dasharray:none;stroke-dashoffset:0;stroke-opacity:1"
       id="rect8412"
       width="8"
       height="1"
       x="20"
       y="28"
       rx="0"
       ry="0" />
    <rect
       style="fill:url(#linearGradient7427);fill-opacity:1;stroke:none;stroke-width:1;stroke-linecap:round;stroke-linejoin:round;stroke-miterlimit:4;stroke-dasharray:none;stroke-dashoffset:0;stroke-opacity:1"
       id="rect7225"
       width="15"
       height="1"
       x="-36"
       y="19.000002"
       rx="0"
       ry="0"
       transform="matrix(0,-1,1,0,0,0)" />
    <rect
       style="fill:url(#linearGradient7429);fill-opacity:1;stroke:none;stroke-width:1;stroke-linecap:round;stroke-linejoin:round;stroke-miterlimit:4;stroke-dasharray:none;stroke-dashoffset:0;stroke-opacity:1"
       id="rect7245"
       width="15"
       height="1"
       x="-36"
       y="27.999998"
       rx="0"
       ry="0"
       transform="matrix(0,-1,1,0,0,0)" />
    <rect
       style="fill:url(#linearGradient7431);fill-opacity:1;stroke:none;stroke-width:1;stroke-linecap:round;stroke-linejoin:round;stroke-miterlimit:4;stroke-dasharray:none;stroke-dashoffset:0;stroke-opacity:1"
       id="rect7251"
       width="1"
       height="1"
       x="-33"
       y="28.999998"
       rx="0"
       ry="0"
       transform="matrix(0,-1,1,0,0,0)" />
    <rect
       style="fill:url(#linearGradient7433);fill-opacity:1;stroke:none;stroke-width:1;stroke-linecap:round;stroke-linejoin:round;stroke-miterlimit:4;stroke-dasharray:none;stroke-dashoffset:0;stroke-opacity:1"
       id="rect7263"
       width="1"
       height="1"
       x="-30.999998"
       y="28.999998"
       rx="0"
       ry="0"
       transform="matrix(0,-1,1,0,0,0)" />
    <rect
       style="fill:url(#linearGradient7435);fill-opacity:1;stroke:none;stroke-width:1;stroke-linecap:round;stroke-linejoin:round;stroke-miterlimit:4;stroke-dasharray:none;stroke-dashoffset:0;stroke-opacity:1"
       id="rect7267"
       width="1"
       height="1"
       x="-28.999998"
       y="28.999998"
       rx="0"
       ry="0"
       transform="matrix(0,-1,1,0,0,0)" />
    <rect
       style="fill:url(#linearGradient7437);fill-opacity:1;stroke:none;stroke-width:1;stroke-linecap:round;stroke-linejoin:round;stroke-miterlimit:4;stroke-dasharray:none;stroke-dashoffset:0;stroke-opacity:1"
       id="rect7271"
       width="1"
       height="1"
       x="-28.999998"
       y="18.000002"
       rx="0"
       ry="0"
       transform="matrix(0,-1,1,0,0,0)" />
    <rect
       style="fill:url(#linearGradient7439);fill-opacity:1;stroke:none;stroke-width:1;stroke-linecap:round;stroke-linejoin:round;stroke-miterlimit:4;stroke-dasharray:none;stroke-dashoffset:0;stroke-opacity:1"
       id="rect7275"
       width="1"
       height="1"
       x="-30.999998"
       y="18.000002"
       rx="0"
       ry="0"
       transform="matrix(0,-1,1,0,0,0)" />
    <rect
       style="fill:url(#linearGradient7441);fill-opacity:1;stroke:none;stroke-width:1;stroke-linecap:round;stroke-linejoin:round;stroke-miterlimit:4;stroke-dasharray:none;stroke-dashoffset:0;stroke-opacity:1"
       id="rect7279"
       width="1"
       height="1"
       x="-33"
       y="18.000002"
       rx="0"
       ry="0"
       transform="matrix(0,-1,1,0,0,0)" />
    <rect
       style="fill:url(#linearGradient7449);fill-opacity:1;stroke:none;stroke-width:1;stroke-linecap:round;stroke-linejoin:round;stroke-miterlimit:4;stroke-dasharray:none;stroke-dashoffset:0;stroke-opacity:1"
       id="rect7445"
       width="1"
       height="1"
       x="-27"
       y="28.999998"
       rx="0"
       ry="0"
       transform="matrix(0,-1,1,0,0,0)" />
    <rect
       style="fill:url(#linearGradient7451);fill-opacity:1;stroke:none;stroke-width:1;stroke-linecap:round;stroke-linejoin:round;stroke-miterlimit:4;stroke-dasharray:none;stroke-dashoffset:0;stroke-opacity:1"
       id="rect7447"
       width="1"
       height="1"
       x="-27"
       y="18.000002"
       rx="0"
       ry="0"
       transform="matrix(0,-1,1,0,0,0)" />
    <rect
       style="fill:url(#linearGradient7495);fill-opacity:1;stroke:none;stroke-width:1;stroke-linecap:round;stroke-linejoin:round;stroke-miterlimit:4;stroke-dasharray:none;stroke-dashoffset:0;stroke-opacity:1"
       id="rect7493"
       width="1"
       height="1"
       x="-24.928572"
       y="18.035713"
       rx="0"
       ry="0"
       transform="matrix(0,-1,1,0,0,0)" />
    <rect
       style="fill:url(#linearGradient7499);fill-opacity:1;stroke:none;stroke-width:1;stroke-linecap:round;stroke-linejoin:round;stroke-miterlimit:4;stroke-dasharray:none;stroke-dashoffset:0;stroke-opacity:1"
       id="rect7497"
       width="1"
       height="1"
       x="-25.071428"
       y="29"
       rx="0"
       ry="0"
       transform="matrix(0,-1,1,0,0,0)" />
    <rect
       style="fill:url(#linearGradient7503);fill-opacity:1;stroke:none;stroke-width:1;stroke-linecap:round;stroke-linejoin:round;stroke-miterlimit:4;stroke-dasharray:none;stroke-dashoffset:0;stroke-opacity:1"
       id="rect7501"
       width="1"
       height="1"
       x="-35.07143"
       y="18"
       rx="0"
       ry="0"
       transform="matrix(0,-1,1,0,0,0)" />
    <rect
       style="fill:url(#linearGradient7507);fill-opacity:1;stroke:none;stroke-width:1;stroke-linecap:round;stroke-linejoin:round;stroke-miterlimit:4;stroke-dasharray:none;stroke-dashoffset:0;stroke-opacity:1"
       id="rect7505"
       width="1"
       height="1"
       x="-35.035713"
       y="28.928572"
       rx="0"
       ry="0"
       transform="matrix(0,-1,1,0,0,0)" />
    <rect
       style="fill:url(#linearGradient7511);fill-opacity:1;stroke:none;stroke-width:1;stroke-linecap:round;stroke-linejoin:round;stroke-miterlimit:4;stroke-dasharray:none;stroke-dashoffset:0;stroke-opacity:1"
       id="rect7509"
       width="1"
       height="1"
       x="-23"
       y="18"
       rx="0"
       ry="0"
       transform="matrix(0,-1,1,0,0,0)" />
    <rect
       style="fill:url(#linearGradient7515);fill-opacity:1;stroke:none;stroke-width:1;stroke-linecap:round;stroke-linejoin:round;stroke-miterlimit:4;stroke-dasharray:none;stroke-dashoffset:0;stroke-opacity:1"
       id="rect7513"
       width="1"
       height="1"
       x="-22.928572"
       y="29"
       rx="0"
       ry="0"
       transform="matrix(0,-1,1,0,0,0)" />
  </g>
</svg>
