<?xml version="1.0" encoding="UTF-8" standalone="no"?>
<!-- Created with Inkscape (http://www.inkscape.org/) -->
<svg
   xmlns:dc="http://purl.org/dc/elements/1.1/"
   xmlns:cc="http://creativecommons.org/ns#"
   xmlns:rdf="http://www.w3.org/1999/02/22-rdf-syntax-ns#"
   xmlns:svg="http://www.w3.org/2000/svg"
   xmlns="http://www.w3.org/2000/svg"
   xmlns:xlink="http://www.w3.org/1999/xlink"
   xmlns:sodipodi="http://sodipodi.sourceforge.net/DTD/sodipodi-0.dtd"
   xmlns:inkscape="http://www.inkscape.org/namespaces/inkscape"
   width="48px"
   height="48px"
   id="svg7896"
   sodipodi:version="0.32"
   inkscape:version="0.46"
   sodipodi:docname="drawing-1.svg"
   inkscape:output_extension="org.inkscape.output.svg.inkscape">
  <defs
     id="defs7898">
    <linearGradient
       inkscape:collect="always"
       xlink:href="#linearGradient2558"
       id="linearGradient9918"
       gradientUnits="userSpaceOnUse"
       gradientTransform="matrix(0.9990622,0,0,0.9999999,-10.984063,8.0000018)"
       x1="19.99296"
       y1="15.046281"
       x2="19.99296"
       y2="16" />
    <linearGradient
       inkscape:collect="always"
       xlink:href="#linearGradient2823"
       id="linearGradient9916"
       gradientUnits="userSpaceOnUse"
       gradientTransform="matrix(0.2887767,0,0,0.6000371,1.130845,16.799528)"
       x1="24.92893"
       y1="12.001067"
       x2="24.92893"
       y2="10.868282" />
    <linearGradient
       inkscape:collect="always"
       id="linearGradient3801">
      <stop
         style="stop-color:#888a85;stop-opacity:1;"
         offset="0"
         id="stop3803" />
      <stop
         style="stop-color:#555753"
         offset="1"
         id="stop3805" />
    </linearGradient>
    <linearGradient
       id="linearGradient2558">
      <stop
         style="stop-color:#2e3436;stop-opacity:1"
         offset="0"
         id="stop2560" />
      <stop
         style="stop-color:#555753"
         offset="1"
         id="stop2562" />
    </linearGradient>
    <linearGradient
       inkscape:collect="always"
       xlink:href="#linearGradient2558"
       id="linearGradient9920"
       gradientUnits="userSpaceOnUse"
       gradientTransform="matrix(0.9990622,0,0,0.9999999,-10.984062,5.0000048)"
       x1="19.99296"
       y1="15.046281"
       x2="19.99296"
       y2="16" />
    <linearGradient
       id="linearGradient2823">
      <stop
         style="stop-color:#d7d7d7;stop-opacity:1;"
         offset="0"
         id="stop2825" />
      <stop
         style="stop-color:#f6f6f6;stop-opacity:1;"
         offset="1"
         id="stop2827" />
    </linearGradient>
    <linearGradient
       inkscape:collect="always"
       xlink:href="#linearGradient2823"
       id="linearGradient9922"
       gradientUnits="userSpaceOnUse"
       gradientTransform="matrix(0.2887767,0,0,0.6000371,1.130845,13.799531)"
       x1="24.92893"
       y1="12.001067"
       x2="24.92893"
       y2="10.868282" />
    <linearGradient
       id="linearGradient3942">
      <stop
         id="stop3944"
         offset="0"
         style="stop-color:#888a85;stop-opacity:1" />
      <stop
         id="stop3946"
         offset="1"
         style="stop-color:#eeeeec;stop-opacity:0.3" />
    </linearGradient>
    <linearGradient
       inkscape:collect="always"
       xlink:href="#linearGradient3942"
       id="linearGradient2694"
       gradientUnits="userSpaceOnUse"
       x1="53.5625"
       y1="2.5644305"
       x2="53.5625"
       y2="37.256325"
       gradientTransform="matrix(0.4453511,0,0,0.4750025,-21.172497,16.945786)" />
    <linearGradient
       inkscape:collect="always"
       id="linearGradient14071">
      <stop
         style="stop-color:#ffffff;stop-opacity:1;"
         offset="0"
         id="stop14073" />
      <stop
         style="stop-color:#ffffff;stop-opacity:0.3"
         offset="1"
         id="stop14075" />
    </linearGradient>
    <linearGradient
       inkscape:collect="always"
       xlink:href="#linearGradient14071"
       id="linearGradient14077"
       x1="16"
       y1="3.0000002"
       x2="16"
       y2="29.9375"
       gradientUnits="userSpaceOnUse"
       gradientTransform="matrix(0.8666715,0,0,0.8400028,-4.866748,13.559958)" />
    <linearGradient
       id="linearGradient4175"
       inkscape:collect="always">
      <stop
         id="stop4177"
         offset="0"
         style="stop-color:#babdb6;stop-opacity:1" />
      <stop
         id="stop4179"
         offset="1"
         style="stop-color:#eeeeec;stop-opacity:1" />
    </linearGradient>
    <linearGradient
       inkscape:collect="always"
       xlink:href="#linearGradient4175"
       id="linearGradient2710"
       gradientUnits="userSpaceOnUse"
       x1="65.624947"
       y1="12.256448"
       x2="65.624947"
       y2="62.520607"
       gradientTransform="matrix(0.4952402,0,0,0.5215553,-23.500125,16.266759)" />
    <linearGradient
       inkscape:collect="always"
       id="linearGradient14152">
      <stop
         style="stop-color:#888a85;stop-opacity:1;"
         offset="0"
         id="stop14154" />
      <stop
         style="stop-color:#555753;stop-opacity:1"
         offset="1"
         id="stop14156" />
    </linearGradient>
    <linearGradient
       inkscape:collect="always"
       xlink:href="#linearGradient14152"
       id="linearGradient14158"
       x1="16"
       y1="-0.018847911"
       x2="16"
       y2="29.999989"
       gradientUnits="userSpaceOnUse"
       gradientTransform="matrix(0.8823711,0,0,0.8615199,-5.117941,13.085328)" />
    <linearGradient
       id="linearGradient3859">
      <stop
         id="stop3861"
         offset="0"
         style="stop-color:#888a85;stop-opacity:1" />
      <stop
         id="stop3037"
         offset="0.2693038"
         style="stop-color:#babdb6;stop-opacity:1" />
      <stop
         style="stop-color:#eeeeec;stop-opacity:1"
         offset="0.88648254"
         id="stop3039" />
      <stop
         id="stop3863"
         offset="1"
         style="stop-color:#888a85;stop-opacity:1" />
    </linearGradient>
    <linearGradient
       inkscape:collect="always"
       xlink:href="#linearGradient3859"
       id="linearGradient2714"
       gradientUnits="userSpaceOnUse"
       x1="78.658432"
       y1="6.2098842"
       x2="53.964245"
       y2="6.2032428"
       gradientTransform="matrix(0.5370958,0,0,0.5500443,-26.160566,15.673336)" />
    <linearGradient
       inkscape:collect="always"
       xlink:href="#linearGradient7758"
       id="linearGradient9224"
       gradientUnits="userSpaceOnUse"
       x1="307.53125"
       y1="193.1875"
       x2="307.53125"
       y2="189.11911" />
    <linearGradient
       inkscape:collect="always"
       xlink:href="#linearGradient7758"
       id="linearGradient9222"
       gradientUnits="userSpaceOnUse"
       x1="307.53125"
       y1="193.1875"
       x2="307.53125"
       y2="189.11911" />
    <linearGradient
       inkscape:collect="always"
       xlink:href="#linearGradient7758"
       id="linearGradient9220"
       gradientUnits="userSpaceOnUse"
       x1="307.53125"
       y1="193.1875"
       x2="307.53125"
       y2="189.11911" />
    <linearGradient
       inkscape:collect="always"
       xlink:href="#linearGradient7758"
       id="linearGradient9218"
       gradientUnits="userSpaceOnUse"
       gradientTransform="translate(0,1)"
       x1="307.53125"
       y1="193.1875"
       x2="307.53125"
       y2="189.11911" />
    <linearGradient
       inkscape:collect="always"
       xlink:href="#linearGradient7758"
       id="linearGradient9216"
       gradientUnits="userSpaceOnUse"
       x1="307.53125"
       y1="193.1875"
       x2="307.53125"
       y2="189.11911" />
    <linearGradient
       inkscape:collect="always"
       xlink:href="#linearGradient7758"
       id="linearGradient9214"
       gradientUnits="userSpaceOnUse"
       x1="307.53125"
       y1="193.1875"
       x2="307.53125"
       y2="189.11911" />
    <linearGradient
       inkscape:collect="always"
       xlink:href="#linearGradient7758"
       id="linearGradient9212"
       gradientUnits="userSpaceOnUse"
       x1="307.53125"
       y1="193.1875"
       x2="307.53125"
       y2="189.11911" />
    <linearGradient
       inkscape:collect="always"
       xlink:href="#linearGradient7758"
       id="linearGradient9210"
       gradientUnits="userSpaceOnUse"
       x1="307.53125"
       y1="193.1875"
       x2="307.53125"
       y2="189.11911" />
    <linearGradient
       inkscape:collect="always"
       xlink:href="#linearGradient7758"
       id="linearGradient9208"
       gradientUnits="userSpaceOnUse"
       x1="307.53125"
       y1="193.1875"
       x2="307.53125"
       y2="189.11911" />
    <linearGradient
       inkscape:collect="always"
       xlink:href="#linearGradient7758"
       id="linearGradient9206"
       gradientUnits="userSpaceOnUse"
       x1="307.53125"
       y1="193.1875"
       x2="307.53125"
       y2="189.11911" />
    <linearGradient
       inkscape:collect="always"
       xlink:href="#linearGradient7758"
       id="linearGradient9226"
       gradientUnits="userSpaceOnUse"
       x1="307.53125"
       y1="193.1875"
       x2="307.53125"
       y2="189.11911" />
    <linearGradient
       inkscape:collect="always"
       xlink:href="#linearGradient4574"
       id="linearGradient9204"
       gradientUnits="userSpaceOnUse"
       gradientTransform="matrix(0.3586948,0,0,0.4000001,229.28732,160.2)"
       x1="316.18286"
       y1="83.224533"
       x2="316.18286"
       y2="90.819603" />
    <linearGradient
       inkscape:collect="always"
       xlink:href="#linearGradient4538"
       id="linearGradient9202"
       gradientUnits="userSpaceOnUse"
       x1="110.53181"
       y1="416.36923"
       x2="110.53181"
       y2="368.06689" />
    <linearGradient
       inkscape:collect="always"
       xlink:href="#linearGradient11187"
       id="linearGradient9200"
       gradientUnits="userSpaceOnUse"
       x1="169.53629"
       y1="406.25653"
       x2="169.53629"
       y2="381.70447" />
    <radialGradient
       inkscape:collect="always"
       xlink:href="#linearGradient4788-7"
       id="radialGradient9198"
       gradientUnits="userSpaceOnUse"
       gradientTransform="matrix(-0.8608208,3.7279326e-7,4.195139e-2,-0.6045406,586.48445,215.18657)"
       cx="326.0206"
       cy="58"
       fx="326.0206"
       fy="58"
       r="12.5" />
    <radialGradient
       inkscape:collect="always"
       xlink:href="#linearGradient4788"
       id="radialGradient9196"
       gradientUnits="userSpaceOnUse"
       gradientTransform="matrix(2.9199174,2.523046e-8,0,0.6246709,-639.95678,143.91344)"
       cx="327.5"
       cy="58"
       fx="327.5"
       fy="58"
       r="12.5" />
    <linearGradient
       inkscape:collect="always"
       xlink:href="#linearGradient5687"
       id="linearGradient9194"
       gradientUnits="userSpaceOnUse"
       gradientTransform="matrix(7.6923313e-2,0,0,7.0591222e-2,302.61531,175.04077)"
       x1="88"
       y1="44.5"
       x2="178"
       y2="202.5" />
    <linearGradient
       id="linearGradient7403">
      <stop
         id="stop7405"
         offset="0"
         style="stop-color:#608b7d;stop-opacity:1" />
      <stop
         id="stop7407"
         offset="1"
         style="stop-color:#608b7d;stop-opacity:1" />
    </linearGradient>
    <radialGradient
       inkscape:collect="always"
       xlink:href="#linearGradient7403"
       id="radialGradient9192"
       gradientUnits="userSpaceOnUse"
       gradientTransform="matrix(1.1011252,0,0,0.4728361,287.58732,172.07816)"
       cx="24.006104"
       cy="37.921711"
       fx="24.006104"
       fy="37.921711"
       r="19.00016" />
    <linearGradient
       inkscape:collect="always"
       xlink:href="#linearGradient5538"
       id="linearGradient9190"
       gradientUnits="userSpaceOnUse"
       gradientTransform="matrix(0.4667846,0,0,0.4669448,164.62624,152.04321)"
       x1="315.04031"
       y1="89.236771"
       x2="291.66104"
       y2="45.183807" />
    <radialGradient
       inkscape:collect="always"
       xlink:href="#linearGradient4654"
       id="radialGradient9188"
       gradientUnits="userSpaceOnUse"
       gradientTransform="matrix(0.525761,1.962839,-0.5015999,0.1344494,175.37799,-445.23546)"
       cx="314.30969"
       cy="61.654819"
       fx="314.30969"
       fy="61.654819"
       r="23" />
    <linearGradient
       inkscape:collect="always"
       xlink:href="#linearGradient3380"
       id="linearGradient9186"
       gradientUnits="userSpaceOnUse"
       gradientTransform="translate(-20,0)"
       x1="336.5625"
       y1="192.875"
       x2="336.5625"
       y2="196.99327" />
    <linearGradient
       inkscape:collect="always"
       xlink:href="#linearGradient4693"
       id="linearGradient9184"
       gradientUnits="userSpaceOnUse"
       gradientTransform="translate(-20,0)"
       x1="333.5625"
       y1="192.91261"
       x2="333.5625"
       y2="196.26506" />
    <linearGradient
       inkscape:collect="always"
       xlink:href="#linearGradient4772"
       id="linearGradient9182"
       gradientUnits="userSpaceOnUse"
       x1="327.91971"
       y1="93.75"
       x2="327.91971"
       y2="88.849144" />
    <linearGradient
       inkscape:collect="always"
       xlink:href="#linearGradient3847"
       id="linearGradient9180"
       gradientUnits="userSpaceOnUse"
       gradientTransform="matrix(0.6443737,0,0,0.9724074,143.7467,121.28233)"
       x1="328.62787"
       y1="74.43293"
       x2="327.47882"
       y2="67.36187" />
    <radialGradient
       inkscape:collect="always"
       xlink:href="#linearGradient5060"
       id="radialGradient8836"
       gradientUnits="userSpaceOnUse"
       gradientTransform="matrix(-2.774389,0,0,1.969706,112.7623,-872.8854)"
       cx="605.71429"
       cy="486.64789"
       fx="605.71429"
       fy="486.64789"
       r="117.14286" />
    <linearGradient
       inkscape:collect="always"
       id="linearGradient5060">
      <stop
         style="stop-color:black;stop-opacity:1;"
         offset="0"
         id="stop5062" />
      <stop
         style="stop-color:black;stop-opacity:0;"
         offset="1"
         id="stop5064" />
    </linearGradient>
    <radialGradient
       inkscape:collect="always"
       xlink:href="#linearGradient5060"
       id="radialGradient8834"
       gradientUnits="userSpaceOnUse"
       gradientTransform="matrix(2.774389,0,0,1.969706,-1891.633,-872.8854)"
       cx="605.71429"
       cy="486.64789"
       fx="605.71429"
       fy="486.64789"
       r="117.14286" />
    <linearGradient
       id="linearGradient5048">
      <stop
         style="stop-color:black;stop-opacity:0;"
         offset="0"
         id="stop5050" />
      <stop
         id="stop5056"
         offset="0.5"
         style="stop-color:black;stop-opacity:1;" />
      <stop
         style="stop-color:black;stop-opacity:0;"
         offset="1"
         id="stop5052" />
    </linearGradient>
    <linearGradient
       inkscape:collect="always"
       xlink:href="#linearGradient5048"
       id="linearGradient8832"
       gradientUnits="userSpaceOnUse"
       gradientTransform="matrix(2.774389,0,0,1.969706,-1892.179,-872.8854)"
       x1="302.85715"
       y1="366.64789"
       x2="302.85715"
       y2="609.50507" />
    <linearGradient
       inkscape:collect="always"
       id="linearGradient4391">
      <stop
         style="stop-color:#608b7d;stop-opacity:1"
         offset="0"
         id="stop4393" />
      <stop
         style="stop-color:#608b7d;stop-opacity:0"
         offset="1"
         id="stop4395" />
    </linearGradient>
    <linearGradient
       inkscape:collect="always"
       xlink:href="#linearGradient4391"
       id="linearGradient2656"
       gradientUnits="userSpaceOnUse"
       gradientTransform="matrix(-0.909091,0,0,1,28.045459,9.0389628)"
       x1="6.5030808"
       y1="24.500002"
       x2="0.055013988"
       y2="24.500002" />
    <linearGradient
       id="linearGradient2809">
      <stop
         style="stop-color:#d3d7cf;stop-opacity:1;"
         offset="0"
         id="stop2811" />
      <stop
         style="stop-color:#eeeeec;stop-opacity:0;"
         offset="1"
         id="stop2813" />
    </linearGradient>
    <linearGradient
       inkscape:collect="always"
       xlink:href="#linearGradient2809"
       id="linearGradient2654"
       gradientUnits="userSpaceOnUse"
       gradientTransform="matrix(-0.909091,0,0,1,28.954549,6.0389728)"
       x1="7.5030818"
       y1="27.499998"
       x2="1.0550151"
       y2="27.499998" />
    <linearGradient
       inkscape:collect="always"
       xlink:href="#linearGradient7758"
       id="linearGradient3401"
       gradientUnits="userSpaceOnUse"
       x1="307.53125"
       y1="193.1875"
       x2="307.53125"
       y2="189.11911" />
    <linearGradient
       inkscape:collect="always"
       xlink:href="#linearGradient7758"
       id="linearGradient3399"
       gradientUnits="userSpaceOnUse"
       x1="307.53125"
       y1="193.1875"
       x2="307.53125"
       y2="189.11911" />
    <linearGradient
       inkscape:collect="always"
       xlink:href="#linearGradient7758"
       id="linearGradient3397"
       gradientUnits="userSpaceOnUse"
       x1="307.53125"
       y1="193.1875"
       x2="307.53125"
       y2="189.11911" />
    <linearGradient
       inkscape:collect="always"
       xlink:href="#linearGradient7758"
       id="linearGradient3395"
       gradientUnits="userSpaceOnUse"
       gradientTransform="translate(0,1)"
       x1="307.53125"
       y1="193.1875"
       x2="307.53125"
       y2="189.11911" />
    <linearGradient
       inkscape:collect="always"
       xlink:href="#linearGradient7758"
       id="linearGradient3393"
       gradientUnits="userSpaceOnUse"
       x1="307.53125"
       y1="193.1875"
       x2="307.53125"
       y2="189.11911" />
    <linearGradient
       inkscape:collect="always"
       xlink:href="#linearGradient7758"
       id="linearGradient3391"
       gradientUnits="userSpaceOnUse"
       x1="307.53125"
       y1="193.1875"
       x2="307.53125"
       y2="189.11911" />
    <linearGradient
       inkscape:collect="always"
       xlink:href="#linearGradient7758"
       id="linearGradient3389"
       gradientUnits="userSpaceOnUse"
       x1="307.53125"
       y1="193.1875"
       x2="307.53125"
       y2="189.11911" />
    <linearGradient
       inkscape:collect="always"
       xlink:href="#linearGradient7758"
       id="linearGradient3387"
       gradientUnits="userSpaceOnUse"
       x1="307.53125"
       y1="193.1875"
       x2="307.53125"
       y2="189.11911" />
    <linearGradient
       inkscape:collect="always"
       xlink:href="#linearGradient7758"
       id="linearGradient3385"
       gradientUnits="userSpaceOnUse"
       x1="307.53125"
       y1="193.1875"
       x2="307.53125"
       y2="189.11911" />
    <linearGradient
       inkscape:collect="always"
       xlink:href="#linearGradient7758"
       id="linearGradient3383"
       gradientUnits="userSpaceOnUse"
       x1="307.53125"
       y1="193.1875"
       x2="307.53125"
       y2="189.11911" />
    <linearGradient
       inkscape:collect="always"
       id="linearGradient7758">
      <stop
         style="stop-color:#babdb6;stop-opacity:1;"
         offset="0"
         id="stop7760" />
      <stop
         style="stop-color:#babdb6;stop-opacity:0;"
         offset="1"
         id="stop7762" />
    </linearGradient>
    <linearGradient
       inkscape:collect="always"
       xlink:href="#linearGradient7758"
       id="linearGradient3403"
       gradientUnits="userSpaceOnUse"
       x1="307.53125"
       y1="193.1875"
       x2="307.53125"
       y2="189.11911" />
    <linearGradient
       inkscape:collect="always"
       id="linearGradient4574">
      <stop
         style="stop-color:#2e3436;stop-opacity:1"
         offset="0"
         id="stop4576" />
      <stop
         style="stop-color:#888a85;stop-opacity:1"
         offset="1"
         id="stop4578" />
    </linearGradient>
    <linearGradient
       inkscape:collect="always"
       xlink:href="#linearGradient4574"
       id="linearGradient3381"
       gradientUnits="userSpaceOnUse"
       gradientTransform="matrix(0.3586948,0,0,0.4000001,229.28732,160.2)"
       x1="316.18286"
       y1="83.224533"
       x2="316.18286"
       y2="90.819603" />
    <linearGradient
       inkscape:collect="always"
       id="linearGradient4538">
      <stop
         style="stop-color:#555753;stop-opacity:1;"
         offset="0"
         id="stop4540" />
      <stop
         style="stop-color:#888a85;stop-opacity:1"
         offset="1"
         id="stop4542" />
    </linearGradient>
    <linearGradient
       inkscape:collect="always"
       xlink:href="#linearGradient4538"
       id="linearGradient3378"
       gradientUnits="userSpaceOnUse"
       x1="110.53181"
       y1="416.36923"
       x2="110.53181"
       y2="368.06689" />
    <linearGradient
       inkscape:collect="always"
       id="linearGradient11187">
      <stop
         style="stop-color:#ffffff;stop-opacity:1"
         offset="0"
         id="stop11189" />
      <stop
         style="stop-color:#d3d7cf;stop-opacity:1"
         offset="1"
         id="stop11191" />
    </linearGradient>
    <linearGradient
       inkscape:collect="always"
       xlink:href="#linearGradient11187"
       id="linearGradient3376"
       gradientUnits="userSpaceOnUse"
       x1="169.53629"
       y1="406.25653"
       x2="169.53629"
       y2="381.70447" />
    <linearGradient
       inkscape:collect="always"
       id="linearGradient4788-7">
      <stop
         style="stop-color:#ffffff;stop-opacity:1;"
         offset="0"
         id="stop4790-8" />
      <stop
         style="stop-color:#ffffff;stop-opacity:0;"
         offset="1"
         id="stop4792-6" />
    </linearGradient>
    <radialGradient
       inkscape:collect="always"
       xlink:href="#linearGradient4788-7"
       id="radialGradient3374"
       gradientUnits="userSpaceOnUse"
       gradientTransform="matrix(-0.8608208,3.7279326e-7,4.195139e-2,-0.6045406,586.48445,215.18657)"
       cx="326.0206"
       cy="58"
       fx="326.0206"
       fy="58"
       r="12.5" />
    <linearGradient
       inkscape:collect="always"
       id="linearGradient4788">
      <stop
         style="stop-color:#ffffff;stop-opacity:1;"
         offset="0"
         id="stop4790" />
      <stop
         style="stop-color:#ffffff;stop-opacity:0;"
         offset="1"
         id="stop4792" />
    </linearGradient>
    <radialGradient
       inkscape:collect="always"
       xlink:href="#linearGradient4788"
       id="radialGradient3372"
       gradientUnits="userSpaceOnUse"
       gradientTransform="matrix(2.9199174,2.523046e-8,0,0.6246709,-639.95678,143.91344)"
       cx="327.5"
       cy="58"
       fx="327.5"
       fy="58"
       r="12.5" />
    <linearGradient
       inkscape:collect="always"
       id="linearGradient5687">
      <stop
         style="stop-color:#ffffff;stop-opacity:1;"
         offset="0"
         id="stop5689" />
      <stop
         style="stop-color:#ffffff;stop-opacity:0;"
         offset="1"
         id="stop5691" />
    </linearGradient>
    <linearGradient
       inkscape:collect="always"
       xlink:href="#linearGradient5687"
       id="linearGradient3370"
       gradientUnits="userSpaceOnUse"
       gradientTransform="matrix(7.6923313e-2,0,0,7.0591222e-2,302.61531,175.04077)"
       x1="88"
       y1="44.5"
       x2="178"
       y2="202.5" />
    <linearGradient
       id="linearGradient2711">
      <stop
         style="stop-color:#608b7d;stop-opacity:1"
         offset="0"
         id="stop2713" />
      <stop
         style="stop-color:#608b7d;stop-opacity:1"
         offset="1"
         id="stop2715" />
    </linearGradient>
    <radialGradient
       inkscape:collect="always"
       xlink:href="#linearGradient2711"
       id="radialGradient3368"
       gradientUnits="userSpaceOnUse"
       gradientTransform="matrix(1.1011252,0,0,0.4728361,287.58732,172.07816)"
       cx="24.006104"
       cy="37.921711"
       fx="24.006104"
       fy="37.921711"
       r="19.00016" />
    <linearGradient
       id="linearGradient5538"
       inkscape:collect="always">
      <stop
         id="stop5540"
         offset="0"
         style="stop-color:#555753;stop-opacity:1;" />
      <stop
         id="stop5542"
         offset="1"
         style="stop-color:#babdb6;stop-opacity:1" />
    </linearGradient>
    <linearGradient
       inkscape:collect="always"
       xlink:href="#linearGradient5538"
       id="linearGradient3366"
       gradientUnits="userSpaceOnUse"
       gradientTransform="matrix(0.4667846,0,0,0.4669448,164.62624,152.04321)"
       x1="315.04031"
       y1="89.236771"
       x2="291.66104"
       y2="45.183807" />
    <linearGradient
       inkscape:collect="always"
       id="linearGradient4654">
      <stop
         style="stop-color:#eeeeec;stop-opacity:1"
         offset="0"
         id="stop4656" />
      <stop
         style="stop-color:#babdb6;stop-opacity:1"
         offset="1"
         id="stop4658" />
    </linearGradient>
    <radialGradient
       inkscape:collect="always"
       xlink:href="#linearGradient4654"
       id="radialGradient3364"
       gradientUnits="userSpaceOnUse"
       gradientTransform="matrix(0.525761,1.962839,-0.5015999,0.1344494,175.37799,-445.23546)"
       cx="314.30969"
       cy="61.654819"
       fx="314.30969"
       fy="61.654819"
       r="23" />
    <linearGradient
       id="linearGradient3380">
      <stop
         style="stop-color:#555753;stop-opacity:1"
         offset="0"
         id="stop3382" />
      <stop
         id="stop3410"
         offset="0.47892022"
         style="stop-color:#babdb6;stop-opacity:1" />
      <stop
         style="stop-color:#888a85;stop-opacity:1"
         offset="0.76858371"
         id="stop3412" />
      <stop
         style="stop-color:#555753;stop-opacity:1"
         offset="1"
         id="stop3384" />
    </linearGradient>
    <linearGradient
       inkscape:collect="always"
       xlink:href="#linearGradient3380"
       id="linearGradient3362"
       gradientUnits="userSpaceOnUse"
       gradientTransform="translate(-20,0)"
       x1="336.5625"
       y1="192.875"
       x2="336.5625"
       y2="196.99327" />
    <linearGradient
       id="linearGradient4693">
      <stop
         id="stop4695"
         offset="0"
         style="stop-color:#555753;stop-opacity:1" />
      <stop
         style="stop-color:#babdb6;stop-opacity:1"
         offset="0.30146292"
         id="stop4701" />
      <stop
         id="stop3408"
         offset="0.48027775"
         style="stop-color:#eeeeec;stop-opacity:1" />
      <stop
         style="stop-color:#ffffff;stop-opacity:1"
         offset="0.64304489"
         id="stop4699" />
      <stop
         id="stop4697"
         offset="1"
         style="stop-color:#555753;stop-opacity:1" />
    </linearGradient>
    <linearGradient
       inkscape:collect="always"
       xlink:href="#linearGradient4693"
       id="linearGradient3360"
       gradientUnits="userSpaceOnUse"
       gradientTransform="translate(-20,0)"
       x1="333.5625"
       y1="192.91261"
       x2="333.5625"
       y2="196.26506" />
    <filter
       height="2.3388599"
       y="-0.66942997"
       width="1.1218799"
       x="-0.060939956"
       id="filter6655"
       inkscape:collect="always">
      <feGaussianBlur
         id="feGaussianBlur6657"
         stdDeviation="1.1680158"
         inkscape:collect="always" />
    </filter>
    <filter
       inkscape:collect="always"
       id="filter4768"
       x="-0.11389347"
       width="1.2277869"
       y="-0.56768775"
       height="2.1353755">
      <feGaussianBlur
         inkscape:collect="always"
         stdDeviation="0.94614625"
         id="feGaussianBlur4770" />
    </filter>
    <linearGradient
       inkscape:collect="always"
       id="linearGradient4772">
      <stop
         style="stop-color:#000000;stop-opacity:1;"
         offset="0"
         id="stop4774" />
      <stop
         style="stop-color:#000000;stop-opacity:0;"
         offset="1"
         id="stop4776" />
    </linearGradient>
    <linearGradient
       inkscape:collect="always"
       xlink:href="#linearGradient4772"
       id="linearGradient3358"
       gradientUnits="userSpaceOnUse"
       x1="327.91971"
       y1="93.75"
       x2="327.91971"
       y2="88.849144" />
    <linearGradient
       inkscape:collect="always"
       id="linearGradient3847">
      <stop
         style="stop-color:#babdb6;stop-opacity:1;"
         offset="0"
         id="stop3849" />
      <stop
         style="stop-color:#babdb6;stop-opacity:0;"
         offset="1"
         id="stop3851" />
    </linearGradient>
    <linearGradient
       inkscape:collect="always"
       xlink:href="#linearGradient3847"
       id="linearGradient3356"
       gradientUnits="userSpaceOnUse"
       gradientTransform="matrix(0.6443737,0,0,0.9724074,143.7467,121.28233)"
       x1="328.62787"
       y1="74.43293"
       x2="327.47882"
       y2="67.36187" />
    <linearGradient
       inkscape:collect="always"
       xlink:href="#linearGradient3801"
       id="linearGradient8172"
       gradientUnits="userSpaceOnUse"
       gradientTransform="translate(-14.000001,7.0000078)"
       x1="18.707483"
       y1="26.762754"
       x2="18.5"
       y2="26.146259" />
  </defs>
  <sodipodi:namedview
     id="base"
     pagecolor="#ffffff"
     bordercolor="#666666"
     borderopacity="1.0"
     inkscape:pageopacity="0.0"
     inkscape:pageshadow="2"
     inkscape:zoom="7"
     inkscape:cx="24"
     inkscape:cy="24"
     inkscape:current-layer="layer1"
     showgrid="true"
     inkscape:grid-bbox="true"
     inkscape:document-units="px"
     inkscape:window-width="641"
     inkscape:window-height="690"
     inkscape:window-x="725"
     inkscape:window-y="220" />
  <metadata
     id="metadata7901">
    <rdf:RDF>
      <cc:Work
         rdf:about="">
        <dc:format>image/svg+xml</dc:format>
        <dc:type
           rdf:resource="http://purl.org/dc/dcmitype/StillImage" />
      </cc:Work>
    </rdf:RDF>
  </metadata>
  <g
     id="layer1"
     inkscape:label="Layer 1"
     inkscape:groupmode="layer">
    <g
       style="display:inline;enable-background:new"
       id="g12317"
       transform="translate(-324.99887,-169)">
      <path
         sodipodi:nodetypes="css"
         id="path12313"
         d="M 357.94102,195.70409 C 358.5427,193.22259 364.5,195.61467 364.5,193.86735 C 364.5,191.06091 351.04873,193.94925 350.70587,192.03063"
         style="fill:none;fill-opacity:1;fill-rule:evenodd;stroke:url(#linearGradient3356);stroke-width:0.99999994;stroke-linecap:butt;stroke-linejoin:miter;stroke-miterlimit:4;stroke-dasharray:none;stroke-opacity:1;display:inline;enable-background:new" />
      <g
         transform="translate(40,-3)"
         id="g10916"
         style="display:inline;enable-background:new">
        <path
           style="opacity:0.52610438;fill:url(#linearGradient3358);fill-opacity:1;stroke:none;stroke-width:1;stroke-linecap:round;stroke-linejoin:round;stroke-miterlimit:4;stroke-dashoffset:0.50000001;stroke-opacity:1;display:inline;filter:url(#filter4768);enable-background:new"
           d="M 316.05693,91 L 323.83253,91 L 329.21687,95 L 310.62455,95 L 316.05693,91 z"
           id="path10918"
           sodipodi:nodetypes="ccccc"
           transform="matrix(0.666447,0,0,0.741913,100.76278,126.5244)" />
        <rect
           transform="matrix(0.4293482,0,0,0.4328354,176.60856,156.63063)"
           ry="1.4394537"
           rx="1.5812495"
           y="90.8125"
           x="297"
           height="4.1875"
           width="46"
           id="rect10920"
           style="opacity:0.06024098;fill:#2e3436;fill-opacity:1;fill-rule:nonzero;stroke:none;stroke-width:1;stroke-linecap:round;stroke-linejoin:miter;marker:none;marker-start:none;marker-mid:none;marker-end:none;stroke-miterlimit:4;stroke-dasharray:none;stroke-dashoffset:0;stroke-opacity:1;visibility:visible;display:inline;overflow:visible;filter:url(#filter6655);enable-background:accumulate" />
      </g>
      <g
         transform="translate(40,-3)"
         id="g10922"
         style="display:inline;enable-background:new">
        <path
           transform="translate(0,-1)"
           style="fill:url(#linearGradient3360);fill-opacity:1;stroke:url(#linearGradient3362);stroke-width:1.00000012;stroke-linecap:square;stroke-linejoin:round;stroke-miterlimit:4;stroke-dashoffset:0;stroke-opacity:1"
           d="M 311.90625,190.5 C 311.65546,190.58765 311.49085,190.82824 311.5,191.09375 L 311.5,194.90625 C 311.49973,194.91666 311.49973,194.92709 311.5,194.9375 L 310.34375,195.65625 C 310.11972,195.76524 309.9231,195.832 309.75,196 C 309.71672,196.0323 309.63787,196.09535 309.5625,196.25 C 309.48713,196.40465 309.5,196.55668 309.5,196.65625 C 309.5,196.65625 309.5,197.53125 309.5,197.53125 L 318.5,197.53125 C 318.5,197.53125 318.5,196.65625 318.5,196.65625 C 318.5,196.55668 318.51287,196.40465 318.4375,196.25 C 318.36213,196.09535 318.28328,196.0323 318.25,196 C 318.0769,195.832 317.88028,195.76524 317.65625,195.65625 L 316.5,194.9375 L 316.5,191.09375 C 316.49307,190.76875 316.23125,190.50693 315.90625,190.5 L 312.09375,190.5 C 312.03163,190.49029 311.96837,190.49029 311.90625,190.5 z"
           id="path10924"
           sodipodi:nodetypes="cccccssccccsscccccc" />
        <path
           sodipodi:type="inkscape:offset"
           inkscape:radius="-1.0625"
           inkscape:original="M 311.5 190.5 L 311.5 194.9375 L 310.34375 195.5 C 309.92978 195.70139 309.5 195.93734 309.5 196.5 C 309.5 197.06266 309.8834 197.53125 310.34375 197.53125 L 317.65625 197.53125 C 318.11661 197.53125 318.5 197.06266 318.5 196.5 C 318.5 195.93734 318.07021 195.70139 317.65625 195.5 L 316.5 194.9375 L 316.5 190.5 L 311.5 190.5 z "
           style="opacity:0.19634705;fill:none;fill-opacity:1;stroke:#ffffff;stroke-width:1;stroke-linecap:square;stroke-linejoin:round;stroke-miterlimit:4;stroke-dasharray:none;stroke-dashoffset:0;stroke-opacity:1;display:inline;enable-background:new"
           id="path10926"
           d="M 312.5625,191.5625 L 312.5625,194.9375 C 312.56834,195.348 312.33719,195.72515 311.96875,195.90625 L 310.8125,196.46875 L 317.1875,196.46875 L 316.03125,195.90625 C 315.66281,195.72515 315.43166,195.348 315.4375,194.9375 L 315.4375,191.5625 L 312.5625,191.5625 z"
           transform="translate(0,-1)" />
        <rect
           style="fill:#eeeeec;fill-opacity:1;stroke:none;stroke-width:0.99999994;stroke-linecap:round;stroke-linejoin:round;stroke-miterlimit:4;stroke-dasharray:none;stroke-dashoffset:0.50000001;stroke-opacity:1;display:inline;enable-background:new"
           id="rect10928"
           width="8"
           height="0.9999972"
           x="310"
           y="195"
           rx="0.4999986"
           ry="0.4999986" />
        <path
           sodipodi:type="arc"
           style="opacity:1;fill:#f9f9f9;fill-opacity:1;stroke:none;stroke-width:1;stroke-linecap:square;stroke-linejoin:round;stroke-miterlimit:4;stroke-dasharray:none;stroke-dashoffset:0;stroke-opacity:1"
           id="path10930"
           sodipodi:cx="310.57455"
           sodipodi:cy="195.50287"
           sodipodi:rx="0.50823301"
           sodipodi:ry="0.55242717"
           d="M 311.08279,195.50287 A 0.50823301,0.55242717 0 1 1 310.06632,195.50287 A 0.50823301,0.55242717 0 1 1 311.08279,195.50287 z"
           transform="matrix(1.2446752,0,0,1.1450853,-76.064424,-28.367455)" />
        <path
           sodipodi:type="arc"
           style="opacity:1;fill:#f9f9f9;fill-opacity:1;stroke:none;stroke-width:1;stroke-linecap:square;stroke-linejoin:round;stroke-miterlimit:4;stroke-dasharray:none;stroke-dashoffset:0;stroke-opacity:1;display:inline;enable-background:new"
           id="path10932"
           sodipodi:cx="310.57455"
           sodipodi:cy="195.50287"
           sodipodi:rx="0.50823301"
           sodipodi:ry="0.55242717"
           d="M 311.08279,195.50287 A 0.50823301,0.55242717 0 1 1 310.06632,195.50287 A 0.50823301,0.55242717 0 1 1 311.08279,195.50287 z"
           transform="matrix(1.2446752,0,0,1.1450853,-69.064424,-28.367455)" />
      </g>
      <g
         transform="matrix(0.9065634,0,0,0.857135,69.361684,25.358572)"
         id="g10934"
         style="display:inline;enable-background:new">
        <rect
           style="fill:url(#radialGradient3364);fill-opacity:1;stroke:url(#linearGradient3366);stroke-width:1.13442659;stroke-linecap:round;stroke-linejoin:round;stroke-miterlimit:4;stroke-dasharray:none;stroke-dashoffset:0.50000001;stroke-opacity:1;display:inline;enable-background:new"
           id="rect10936"
           width="21.005308"
           height="14.000017"
           x="303.49469"
           y="177.50002"
           rx="0.49595869"
           ry="0.4961288" />
        <rect
           style="opacity:0.15;fill:none;fill-opacity:1;stroke:#ffffff;stroke-width:1.13442647;stroke-linecap:round;stroke-linejoin:round;stroke-miterlimit:4;stroke-dasharray:none;stroke-dashoffset:0.50000001;stroke-opacity:1;display:inline;enable-background:new"
           id="rect10938"
           width="18.709473"
           height="11.66679"
           x="304.64554"
           y="178.66664"
           rx="0"
           ry="0" />
      </g>
      <g
         transform="matrix(0.8807362,0,0,0.7941824,77.430373,36.999487)"
         id="g10940"
         style="display:inline;enable-background:new">
        <g
           id="g10942">
          <rect
             style="fill:url(#radialGradient3368);fill-opacity:1;fill-rule:evenodd;stroke:#608b7d;stroke-width:1.19568527px;stroke-linecap:butt;stroke-linejoin:miter;stroke-opacity:1;display:inline;enable-background:new"
             id="rect10944"
             width="17.041948"
             height="10"
             x="305.5"
             y="179.5" />
          <rect
             y="180.12334"
             x="305.99994"
             height="8.7533131"
             width="16.000061"
             id="rect10946"
             style="opacity:0.15;fill:url(#linearGradient3370);fill-opacity:1;fill-rule:evenodd;stroke:none;stroke-width:0.19827586px;stroke-linecap:butt;stroke-linejoin:miter;stroke-opacity:1;display:inline;enable-background:new" />
        </g>
        <g
           id="g10948">
          <path
             sodipodi:nodetypes="ccccc"
             id="path10950"
             d="M 317.45292,180.14436 L 322,180.14436 L 322,190 L 311.99643,190 L 317.45292,180.14436 z"
             style="opacity:0.35616437;fill:url(#radialGradient3372);fill-opacity:1;stroke:none;stroke-width:1;stroke-linecap:round;stroke-linejoin:round;stroke-miterlimit:4;stroke-dashoffset:0.50000001;stroke-opacity:1;display:inline;enable-background:new" />
          <path
             sodipodi:nodetypes="ccccc"
             id="path10952"
             d="M 311.76717,180.12334 L 314.59738,180.12334 L 311.4688,187.32855 L 310.07798,187.24763 L 311.76717,180.12338 L 311.76717,180.12334 z"
             style="opacity:0.38942339;fill:url(#radialGradient3374);fill-opacity:1;stroke:none;display:inline;enable-background:new" />
        </g>
      </g>
      <g
         transform="translate(10,0)"
         id="g11303">
        <path
           sodipodi:type="inkscape:offset"
           inkscape:radius="2.1041079"
           inkscape:original="M 49.0625 377.90625 C 48.351795 377.97898 47.715484 378.40319 47.375 379.03125 L 33.09375 405.40625 C 32.921854 405.73057 32.838 406.08368 32.84375 406.4375 C 32.843921 406.44806 32.843422 406.45818 32.84375 406.46875 L 32.84375 409.46875 L 32.84375 409.78125 L 32.90625 409.78125 C 32.951585 410.04087 33.016408 410.29742 33.15625 410.53125 C 33.544315 411.18013 34.243936 411.5896 35 411.59375 L 255.84375 411.59375 C 256.60912 411.59549 257.32874 411.18979 257.71875 410.53125 C 257.85619 410.2992 257.92557 410.03943 257.96875 409.78125 C 258.01748 409.48989 258.03125 408.90625 258.03125 408.90625 L 258.03125 406.8125 C 258.03125 406.32053 257.99454 405.81869 257.75 405.375 L 242.90625 379 C 242.51767 378.31998 241.78319 377.89854 241 377.90625 L 49.28125 377.90625 C 49.208701 377.90258 49.135047 377.90258 49.0625 377.90625 z "
           style="fill:url(#linearGradient3376);fill-opacity:1;stroke:url(#linearGradient3378);stroke-width:12.34623909;stroke-linecap:square;stroke-linejoin:miter;stroke-miterlimit:4;stroke-dasharray:none;stroke-dashoffset:0.3612;stroke-opacity:1;display:inline;enable-background:new"
           id="path10956"
           d="M 48.84375,375.8125 C 47.435282,375.95664 46.206014,376.78657 45.53125,378.03125 L 31.25,404.40625 C 30.914755,405.03876 30.73848,405.75988 30.75,406.46875 C 30.748746,406.39129 30.746329,406.41294 30.75,406.53125 L 30.75,409.46875 L 30.75,409.78125 C 30.745943,410.21651 30.87696,410.64231 31.125,411 C 31.201261,411.21987 31.198308,411.38181 31.34375,411.625 C 32.103454,412.89529 33.491398,413.67922 35,413.6875 L 255.84375,413.6875 C 257.35566,413.69094 258.75604,412.9027 259.53125,411.59375 C 259.86135,411.03642 259.96546,410.51837 260.03125,410.125 C 260.14476,409.44634 260.125,408.96875 260.125,408.96875 C 260.12531,408.94792 260.12531,408.92708 260.125,408.90625 L 260.125,406.8125 C 260.125,406.21586 260.11907,405.29688 259.59375,404.34375 L 244.75,377.96875 C 244.73958,377.96867 244.72917,377.96867 244.71875,377.96875 C 243.94931,376.62222 242.5196,375.79723 240.96875,375.8125 L 49.375,375.8125 C 49.341697,375.81082 49.314423,375.81341 49.28125,375.8125 C 49.170672,375.80948 49.079762,375.80688 48.96875,375.8125 C 48.927093,375.81126 48.885407,375.81126 48.84375,375.8125 z"
           transform="matrix(8.2832523e-2,0,0,7.9200815e-2,331.95307,165.73561)" />
        <path
           style="fill:url(#linearGradient3381);fill-opacity:1;fill-rule:evenodd;stroke:none;stroke-width:1px;stroke-linecap:butt;stroke-linejoin:miter;stroke-opacity:1;display:inline;enable-background:new"
           d="M 337.44515,195 L 336.53707,197 L 346.24566,196.9975 L 345.98913,195 L 337.44515,195 z M 346.43296,195 L 346.57372,196.01298 L 348.47162,196.01298 L 348.20601,195 L 346.43296,195 z M 348.65041,195.31959 L 349.15894,196.9975 L 351.60225,196.9975 L 350.8213,195.31959 L 348.65041,195.31959 z M 346.70084,196.50425 L 346.76441,196.9975 L 348.75993,196.9975 L 348.63507,196.50425 L 346.70084,196.50425 z"
           id="path10970"
           sodipodi:nodetypes="cccccccccccccccccccc" />
        <g
           id="g10972"
           style="fill:url(#linearGradient3403);fill-opacity:1;display:inline;enable-background:new"
           transform="translate(30.13815,2.90019)">
          <rect
             ry="0.28125"
             rx="0.28125"
             y="193"
             x="307"
             height="1"
             width="1"
             id="rect10976"
             style="opacity:0.55363734;fill:url(#linearGradient3383);fill-opacity:1;stroke:none;stroke-width:1;stroke-linecap:round;stroke-linejoin:round;stroke-miterlimit:4;stroke-dasharray:none;stroke-dashoffset:0.3612;stroke-opacity:1;display:inline;enable-background:new" />
          <rect
             ry="0.28125"
             rx="0.28125"
             y="192"
             x="308"
             height="1"
             width="1"
             id="rect10980"
             style="opacity:0.55363734;fill:url(#linearGradient3385);fill-opacity:1;stroke:none;stroke-width:1;stroke-linecap:round;stroke-linejoin:round;stroke-miterlimit:4;stroke-dasharray:none;stroke-dashoffset:0.3612;stroke-opacity:1;display:inline;enable-background:new" />
          <rect
             ry="0.28125"
             rx="0.28125"
             y="192"
             x="310"
             height="1"
             width="1"
             id="rect10986"
             style="opacity:0.55363734;fill:url(#linearGradient3387);fill-opacity:1;stroke:none;stroke-width:1;stroke-linecap:round;stroke-linejoin:round;stroke-miterlimit:4;stroke-dasharray:none;stroke-dashoffset:0.3612;stroke-opacity:1;display:inline;enable-background:new" />
          <rect
             ry="0.28125"
             rx="0.28125"
             y="192"
             x="312"
             height="1"
             width="1"
             id="rect10988"
             style="opacity:0.55363734;fill:url(#linearGradient3389);fill-opacity:1;stroke:none;stroke-width:1;stroke-linecap:round;stroke-linejoin:round;stroke-miterlimit:4;stroke-dasharray:none;stroke-dashoffset:0.3612;stroke-opacity:1;display:inline;enable-background:new" />
          <rect
             ry="0.28125"
             rx="0.28125"
             y="193"
             x="315"
             height="1"
             width="1"
             id="rect10994"
             style="opacity:0.55363734;fill:url(#linearGradient3391);fill-opacity:1;stroke:none;stroke-width:1;stroke-linecap:round;stroke-linejoin:round;stroke-miterlimit:4;stroke-dasharray:none;stroke-dashoffset:0.3612;stroke-opacity:1;display:inline;enable-background:new" />
          <rect
             ry="0.28125"
             rx="0.28125"
             y="192"
             x="314"
             height="1"
             width="1"
             id="rect10996"
             style="opacity:0.55363734;fill:url(#linearGradient3393);fill-opacity:1;stroke:none;stroke-width:1;stroke-linecap:round;stroke-linejoin:round;stroke-miterlimit:4;stroke-dasharray:none;stroke-dashoffset:0.3612;stroke-opacity:1;display:inline;enable-background:new" />
          <rect
             ry="0.28125"
             rx="0.28125"
             y="192"
             x="317"
             height="1"
             width="1"
             id="rect10998"
             style="opacity:0.55363734;fill:url(#linearGradient3395);fill-opacity:1;stroke:none;stroke-width:1;stroke-linecap:round;stroke-linejoin:round;stroke-miterlimit:4;stroke-dasharray:none;stroke-dashoffset:0.3612;stroke-opacity:1;display:inline;enable-background:new" />
          <rect
             ry="0.28125"
             rx="0.28125"
             y="193"
             x="319"
             height="1"
             width="1"
             id="rect11000"
             style="opacity:0.55363734;fill:url(#linearGradient3397);fill-opacity:1;stroke:none;stroke-width:1;stroke-linecap:round;stroke-linejoin:round;stroke-miterlimit:4;stroke-dasharray:none;stroke-dashoffset:0.3612;stroke-opacity:1;display:inline;enable-background:new" />
          <rect
             ry="0.28125"
             rx="0.28125"
             y="192"
             x="320"
             height="1"
             width="1"
             id="rect11002"
             style="opacity:0.55363734;fill:url(#linearGradient3399);fill-opacity:1;stroke:none;stroke-width:1;stroke-linecap:round;stroke-linejoin:round;stroke-miterlimit:4;stroke-dasharray:none;stroke-dashoffset:0.3612;stroke-opacity:1;display:inline;enable-background:new" />
          <rect
             ry="0.28125"
             rx="0.28125"
             y="193"
             x="321"
             height="1"
             width="1"
             id="rect11004"
             style="opacity:0.55363734;fill:url(#linearGradient3401);fill-opacity:1;stroke:none;stroke-width:1;stroke-linecap:round;stroke-linejoin:round;stroke-miterlimit:4;stroke-dasharray:none;stroke-dashoffset:0.3612;stroke-opacity:1;display:inline;enable-background:new" />
        </g>
      </g>
    </g>
    <path
       style="fill:url(#linearGradient2654);fill-opacity:1;stroke:url(#linearGradient2656);stroke-width:1;stroke-linecap:round;stroke-linejoin:miter;stroke-miterlimit:4;stroke-dasharray:none;stroke-opacity:1"
       d="M 28.499999,32.53897 L 18.499995,32.53897 L 18.499995,34.538967 L 28.499999,34.538967"
       id="path6845"
       sodipodi:nodetypes="cccc" />
    <g
       id="g2235"
       transform="matrix(8.865102e-3,0,0,1.858481e-2,16.884939,34.800683)"
       style="opacity:1;display:inline">
      <rect
         y="-150.69685"
         x="-1559.2523"
         height="478.35718"
         width="1339.6335"
         id="rect2237"
         style="opacity:0.40206185;fill:url(#linearGradient8832);fill-opacity:1;fill-rule:nonzero;stroke:none;stroke-width:1;stroke-linecap:round;stroke-linejoin:miter;marker:none;marker-start:none;marker-mid:none;marker-end:none;stroke-miterlimit:4;stroke-dasharray:none;stroke-dashoffset:0;stroke-opacity:1;visibility:visible;display:inline;overflow:visible" />
      <path
         sodipodi:nodetypes="cccc"
         id="path2239"
         d="M -219.61876,-150.68038 C -219.61876,-150.68038 -219.61876,327.65041 -219.61876,327.65041 C -76.744594,328.55086 125.78146,220.48075 125.78138,88.454235 C 125.78138,-43.572302 -33.655436,-150.68036 -219.61876,-150.68038 z"
         style="opacity:0.40206185;fill:url(#radialGradient8834);fill-opacity:1;fill-rule:nonzero;stroke:none;stroke-width:1;stroke-linecap:round;stroke-linejoin:miter;marker:none;marker-start:none;marker-mid:none;marker-end:none;stroke-miterlimit:4;stroke-dasharray:none;stroke-dashoffset:0;stroke-opacity:1;visibility:visible;display:inline;overflow:visible" />
      <path
         style="opacity:0.40206185;fill:url(#radialGradient8836);fill-opacity:1;fill-rule:nonzero;stroke:none;stroke-width:1;stroke-linecap:round;stroke-linejoin:miter;marker:none;marker-start:none;marker-mid:none;marker-end:none;stroke-miterlimit:4;stroke-dasharray:none;stroke-dashoffset:0;stroke-opacity:1;visibility:visible;display:inline;overflow:visible"
         d="M -1559.2523,-150.68038 C -1559.2523,-150.68038 -1559.2523,327.65041 -1559.2523,327.65041 C -1702.1265,328.55086 -1904.6525,220.48075 -1904.6525,88.454235 C -1904.6525,-43.572302 -1745.2157,-150.68036 -1559.2523,-150.68038 z"
         id="path2241"
         sodipodi:nodetypes="cccc" />
    </g>
    <path
       sodipodi:type="arc"
       style="fill:#d0d0ca;fill-opacity:1;stroke:#608b7d;stroke-width:1.31249964;stroke-linecap:round;stroke-linejoin:miter;stroke-miterlimit:4;stroke-dasharray:none;stroke-opacity:1"
       id="path6851"
       sodipodi:cx="35.625"
       sodipodi:cy="27.5625"
       sodipodi:rx="2.625"
       sodipodi:ry="2.625"
       d="M 38.25,27.5625 A 2.625,2.625 0 1 1 33,27.5625 A 2.625,2.625 0 1 1 38.25,27.5625 z"
       transform="matrix(0.761905,0,0,0.761905,-10.611613,12.538973)" />
    <g
       style="display:inline;enable-background:new"
       id="g9110"
       transform="translate(-317.99887,-158)">
      <path
         sodipodi:nodetypes="css"
         id="path9112"
         d="M 357.94102,195.70409 C 358.5427,193.22259 364.5,195.61467 364.5,193.86735 C 364.5,191.06091 351.04873,193.94925 350.70587,192.03063"
         style="fill:none;fill-opacity:1;fill-rule:evenodd;stroke:url(#linearGradient9180);stroke-width:0.99999994;stroke-linecap:butt;stroke-linejoin:miter;stroke-miterlimit:4;stroke-dasharray:none;stroke-opacity:1;display:inline;enable-background:new" />
      <g
         transform="translate(40,-3)"
         id="g9114"
         style="display:inline;enable-background:new">
        <path
           style="opacity:0.52610438;fill:url(#linearGradient9182);fill-opacity:1;stroke:none;stroke-width:1;stroke-linecap:round;stroke-linejoin:round;stroke-miterlimit:4;stroke-dashoffset:0.50000001;stroke-opacity:1;display:inline;filter:url(#filter4768);enable-background:new"
           d="M 316.05693,91 L 323.83253,91 L 329.21687,95 L 310.62455,95 L 316.05693,91 z"
           id="path9116"
           sodipodi:nodetypes="ccccc"
           transform="matrix(0.666447,0,0,0.741913,100.76278,126.5244)" />
        <rect
           transform="matrix(0.4293482,0,0,0.4328354,176.60856,156.63063)"
           ry="1.4394537"
           rx="1.5812495"
           y="90.8125"
           x="297"
           height="4.1875"
           width="46"
           id="rect9118"
           style="opacity:0.06024098;fill:#2e3436;fill-opacity:1;fill-rule:nonzero;stroke:none;stroke-width:1;stroke-linecap:round;stroke-linejoin:miter;marker:none;marker-start:none;marker-mid:none;marker-end:none;stroke-miterlimit:4;stroke-dasharray:none;stroke-dashoffset:0;stroke-opacity:1;visibility:visible;display:inline;overflow:visible;filter:url(#filter6655);enable-background:accumulate" />
      </g>
      <g
         transform="translate(40,-3)"
         id="g9120"
         style="display:inline;enable-background:new">
        <path
           transform="translate(0,-1)"
           style="fill:url(#linearGradient9184);fill-opacity:1;stroke:url(#linearGradient9186);stroke-width:1.00000012;stroke-linecap:square;stroke-linejoin:round;stroke-miterlimit:4;stroke-dashoffset:0;stroke-opacity:1"
           d="M 311.90625,190.5 C 311.65546,190.58765 311.49085,190.82824 311.5,191.09375 L 311.5,194.90625 C 311.49973,194.91666 311.49973,194.92709 311.5,194.9375 L 310.34375,195.65625 C 310.11972,195.76524 309.9231,195.832 309.75,196 C 309.71672,196.0323 309.63787,196.09535 309.5625,196.25 C 309.48713,196.40465 309.5,196.55668 309.5,196.65625 C 309.5,196.65625 309.5,197.53125 309.5,197.53125 L 318.5,197.53125 C 318.5,197.53125 318.5,196.65625 318.5,196.65625 C 318.5,196.55668 318.51287,196.40465 318.4375,196.25 C 318.36213,196.09535 318.28328,196.0323 318.25,196 C 318.0769,195.832 317.88028,195.76524 317.65625,195.65625 L 316.5,194.9375 L 316.5,191.09375 C 316.49307,190.76875 316.23125,190.50693 315.90625,190.5 L 312.09375,190.5 C 312.03163,190.49029 311.96837,190.49029 311.90625,190.5 z"
           id="path9122"
           sodipodi:nodetypes="cccccssccccsscccccc" />
        <path
           sodipodi:type="inkscape:offset"
           inkscape:radius="-1.0625"
           inkscape:original="M 311.5 190.5 L 311.5 194.9375 L 310.34375 195.5 C 309.92978 195.70139 309.5 195.93734 309.5 196.5 C 309.5 197.06266 309.8834 197.53125 310.34375 197.53125 L 317.65625 197.53125 C 318.11661 197.53125 318.5 197.06266 318.5 196.5 C 318.5 195.93734 318.07021 195.70139 317.65625 195.5 L 316.5 194.9375 L 316.5 190.5 L 311.5 190.5 z "
           style="opacity:0.19634705;fill:none;fill-opacity:1;stroke:#ffffff;stroke-width:1;stroke-linecap:square;stroke-linejoin:round;stroke-miterlimit:4;stroke-dasharray:none;stroke-dashoffset:0;stroke-opacity:1;display:inline;enable-background:new"
           id="path9124"
           d="M 312.5625,191.5625 L 312.5625,194.9375 C 312.56834,195.348 312.33719,195.72515 311.96875,195.90625 L 310.8125,196.46875 L 317.1875,196.46875 L 316.03125,195.90625 C 315.66281,195.72515 315.43166,195.348 315.4375,194.9375 L 315.4375,191.5625 L 312.5625,191.5625 z"
           transform="translate(0,-1)" />
        <rect
           style="fill:#eeeeec;fill-opacity:1;stroke:none;stroke-width:0.99999994;stroke-linecap:round;stroke-linejoin:round;stroke-miterlimit:4;stroke-dasharray:none;stroke-dashoffset:0.50000001;stroke-opacity:1;display:inline;enable-background:new"
           id="rect9126"
           width="8"
           height="0.9999972"
           x="310"
           y="195"
           rx="0.4999986"
           ry="0.4999986" />
        <path
           sodipodi:type="arc"
           style="opacity:1;fill:#f9f9f9;fill-opacity:1;stroke:none;stroke-width:1;stroke-linecap:square;stroke-linejoin:round;stroke-miterlimit:4;stroke-dasharray:none;stroke-dashoffset:0;stroke-opacity:1"
           id="path9128"
           sodipodi:cx="310.57455"
           sodipodi:cy="195.50287"
           sodipodi:rx="0.50823301"
           sodipodi:ry="0.55242717"
           d="M 311.08279,195.50287 A 0.50823301,0.55242717 0 1 1 310.06632,195.50287 A 0.50823301,0.55242717 0 1 1 311.08279,195.50287 z"
           transform="matrix(1.2446752,0,0,1.1450853,-76.064424,-28.367455)" />
        <path
           sodipodi:type="arc"
           style="opacity:1;fill:#f9f9f9;fill-opacity:1;stroke:none;stroke-width:1;stroke-linecap:square;stroke-linejoin:round;stroke-miterlimit:4;stroke-dasharray:none;stroke-dashoffset:0;stroke-opacity:1;display:inline;enable-background:new"
           id="path9130"
           sodipodi:cx="310.57455"
           sodipodi:cy="195.50287"
           sodipodi:rx="0.50823301"
           sodipodi:ry="0.55242717"
           d="M 311.08279,195.50287 A 0.50823301,0.55242717 0 1 1 310.06632,195.50287 A 0.50823301,0.55242717 0 1 1 311.08279,195.50287 z"
           transform="matrix(1.2446752,0,0,1.1450853,-69.064424,-28.367455)" />
      </g>
      <g
         transform="matrix(0.9065634,0,0,0.857135,69.361684,25.358572)"
         id="g9132"
         style="display:inline;enable-background:new">
        <rect
           style="fill:url(#radialGradient9188);fill-opacity:1;stroke:url(#linearGradient9190);stroke-width:1.13442659;stroke-linecap:round;stroke-linejoin:round;stroke-miterlimit:4;stroke-dasharray:none;stroke-dashoffset:0.50000001;stroke-opacity:1;display:inline;enable-background:new"
           id="rect9134"
           width="21.005308"
           height="14.000017"
           x="303.49469"
           y="177.50002"
           rx="0.49595869"
           ry="0.4961288" />
        <rect
           style="opacity:0.15;fill:none;fill-opacity:1;stroke:#ffffff;stroke-width:1.13442647;stroke-linecap:round;stroke-linejoin:round;stroke-miterlimit:4;stroke-dasharray:none;stroke-dashoffset:0.50000001;stroke-opacity:1;display:inline;enable-background:new"
           id="rect9136"
           width="18.709473"
           height="11.66679"
           x="304.64554"
           y="178.66664"
           rx="0"
           ry="0" />
      </g>
      <g
         transform="matrix(0.8807362,0,0,0.7941824,77.430373,36.999487)"
         id="g9138"
         style="display:inline;enable-background:new">
        <g
           id="g9140">
          <rect
             style="fill:url(#radialGradient9192);fill-opacity:1;fill-rule:evenodd;stroke:#608b7d;stroke-width:1.19568527px;stroke-linecap:butt;stroke-linejoin:miter;stroke-opacity:1;display:inline;enable-background:new"
             id="rect9142"
             width="17.041948"
             height="10"
             x="305.5"
             y="179.5" />
          <rect
             y="180.12334"
             x="305.99994"
             height="8.7533131"
             width="16.000061"
             id="rect9144"
             style="opacity:0.15;fill:url(#linearGradient9194);fill-opacity:1;fill-rule:evenodd;stroke:none;stroke-width:0.19827586px;stroke-linecap:butt;stroke-linejoin:miter;stroke-opacity:1;display:inline;enable-background:new" />
        </g>
        <g
           id="g9146">
          <path
             sodipodi:nodetypes="ccccc"
             id="path9148"
             d="M 317.45292,180.14436 L 322,180.14436 L 322,190 L 311.99643,190 L 317.45292,180.14436 z"
             style="opacity:0.35616437;fill:url(#radialGradient9196);fill-opacity:1;stroke:none;stroke-width:1;stroke-linecap:round;stroke-linejoin:round;stroke-miterlimit:4;stroke-dashoffset:0.50000001;stroke-opacity:1;display:inline;enable-background:new" />
          <path
             sodipodi:nodetypes="ccccc"
             id="path9150"
             d="M 311.76717,180.12334 L 314.59738,180.12334 L 311.4688,187.32855 L 310.07798,187.24763 L 311.76717,180.12338 L 311.76717,180.12334 z"
             style="opacity:0.38942339;fill:url(#radialGradient9198);fill-opacity:1;stroke:none;display:inline;enable-background:new" />
        </g>
      </g>
      <g
         transform="translate(10,0)"
         id="g9152">
        <path
           sodipodi:type="inkscape:offset"
           inkscape:radius="2.1041079"
           inkscape:original="M 49.0625 377.90625 C 48.351795 377.97898 47.715484 378.40319 47.375 379.03125 L 33.09375 405.40625 C 32.921854 405.73057 32.838 406.08368 32.84375 406.4375 C 32.843921 406.44806 32.843422 406.45818 32.84375 406.46875 L 32.84375 409.46875 L 32.84375 409.78125 L 32.90625 409.78125 C 32.951585 410.04087 33.016408 410.29742 33.15625 410.53125 C 33.544315 411.18013 34.243936 411.5896 35 411.59375 L 255.84375 411.59375 C 256.60912 411.59549 257.32874 411.18979 257.71875 410.53125 C 257.85619 410.2992 257.92557 410.03943 257.96875 409.78125 C 258.01748 409.48989 258.03125 408.90625 258.03125 408.90625 L 258.03125 406.8125 C 258.03125 406.32053 257.99454 405.81869 257.75 405.375 L 242.90625 379 C 242.51767 378.31998 241.78319 377.89854 241 377.90625 L 49.28125 377.90625 C 49.208701 377.90258 49.135047 377.90258 49.0625 377.90625 z "
           style="fill:url(#linearGradient9200);fill-opacity:1;stroke:url(#linearGradient9202);stroke-width:12.34623909;stroke-linecap:square;stroke-linejoin:miter;stroke-miterlimit:4;stroke-dasharray:none;stroke-dashoffset:0.3612;stroke-opacity:1;display:inline;enable-background:new"
           id="path9154"
           d="M 48.84375,375.8125 C 47.435282,375.95664 46.206014,376.78657 45.53125,378.03125 L 31.25,404.40625 C 30.914755,405.03876 30.73848,405.75988 30.75,406.46875 C 30.748746,406.39129 30.746329,406.41294 30.75,406.53125 L 30.75,409.46875 L 30.75,409.78125 C 30.745943,410.21651 30.87696,410.64231 31.125,411 C 31.201261,411.21987 31.198308,411.38181 31.34375,411.625 C 32.103454,412.89529 33.491398,413.67922 35,413.6875 L 255.84375,413.6875 C 257.35566,413.69094 258.75604,412.9027 259.53125,411.59375 C 259.86135,411.03642 259.96546,410.51837 260.03125,410.125 C 260.14476,409.44634 260.125,408.96875 260.125,408.96875 C 260.12531,408.94792 260.12531,408.92708 260.125,408.90625 L 260.125,406.8125 C 260.125,406.21586 260.11907,405.29688 259.59375,404.34375 L 244.75,377.96875 C 244.73958,377.96867 244.72917,377.96867 244.71875,377.96875 C 243.94931,376.62222 242.5196,375.79723 240.96875,375.8125 L 49.375,375.8125 C 49.341697,375.81082 49.314423,375.81341 49.28125,375.8125 C 49.170672,375.80948 49.079762,375.80688 48.96875,375.8125 C 48.927093,375.81126 48.885407,375.81126 48.84375,375.8125 z"
           transform="matrix(8.2832523e-2,0,0,7.9200815e-2,331.95307,165.73561)" />
        <path
           style="fill:url(#linearGradient9204);fill-opacity:1;fill-rule:evenodd;stroke:none;stroke-width:1px;stroke-linecap:butt;stroke-linejoin:miter;stroke-opacity:1;display:inline;enable-background:new"
           d="M 337.44515,195 L 336.53707,197 L 346.24566,196.9975 L 345.98913,195 L 337.44515,195 z M 346.43296,195 L 346.57372,196.01298 L 348.47162,196.01298 L 348.20601,195 L 346.43296,195 z M 348.65041,195.31959 L 349.15894,196.9975 L 351.60225,196.9975 L 350.8213,195.31959 L 348.65041,195.31959 z M 346.70084,196.50425 L 346.76441,196.9975 L 348.75993,196.9975 L 348.63507,196.50425 L 346.70084,196.50425 z"
           id="path9156"
           sodipodi:nodetypes="cccccccccccccccccccc" />
        <g
           id="g9158"
           style="fill:url(#linearGradient9226);fill-opacity:1;display:inline;enable-background:new"
           transform="translate(30.13815,2.90019)">
          <rect
             ry="0.28125"
             rx="0.28125"
             y="193"
             x="307"
             height="1"
             width="1"
             id="rect9160"
             style="opacity:0.55363734;fill:url(#linearGradient9206);fill-opacity:1;stroke:none;stroke-width:1;stroke-linecap:round;stroke-linejoin:round;stroke-miterlimit:4;stroke-dasharray:none;stroke-dashoffset:0.3612;stroke-opacity:1;display:inline;enable-background:new" />
          <rect
             ry="0.28125"
             rx="0.28125"
             y="192"
             x="308"
             height="1"
             width="1"
             id="rect9162"
             style="opacity:0.55363734;fill:url(#linearGradient9208);fill-opacity:1;stroke:none;stroke-width:1;stroke-linecap:round;stroke-linejoin:round;stroke-miterlimit:4;stroke-dasharray:none;stroke-dashoffset:0.3612;stroke-opacity:1;display:inline;enable-background:new" />
          <rect
             ry="0.28125"
             rx="0.28125"
             y="192"
             x="310"
             height="1"
             width="1"
             id="rect9164"
             style="opacity:0.55363734;fill:url(#linearGradient9210);fill-opacity:1;stroke:none;stroke-width:1;stroke-linecap:round;stroke-linejoin:round;stroke-miterlimit:4;stroke-dasharray:none;stroke-dashoffset:0.3612;stroke-opacity:1;display:inline;enable-background:new" />
          <rect
             ry="0.28125"
             rx="0.28125"
             y="192"
             x="312"
             height="1"
             width="1"
             id="rect9166"
             style="opacity:0.55363734;fill:url(#linearGradient9212);fill-opacity:1;stroke:none;stroke-width:1;stroke-linecap:round;stroke-linejoin:round;stroke-miterlimit:4;stroke-dasharray:none;stroke-dashoffset:0.3612;stroke-opacity:1;display:inline;enable-background:new" />
          <rect
             ry="0.28125"
             rx="0.28125"
             y="193"
             x="315"
             height="1"
             width="1"
             id="rect9168"
             style="opacity:0.55363734;fill:url(#linearGradient9214);fill-opacity:1;stroke:none;stroke-width:1;stroke-linecap:round;stroke-linejoin:round;stroke-miterlimit:4;stroke-dasharray:none;stroke-dashoffset:0.3612;stroke-opacity:1;display:inline;enable-background:new" />
          <rect
             ry="0.28125"
             rx="0.28125"
             y="192"
             x="314"
             height="1"
             width="1"
             id="rect9170"
             style="opacity:0.55363734;fill:url(#linearGradient9216);fill-opacity:1;stroke:none;stroke-width:1;stroke-linecap:round;stroke-linejoin:round;stroke-miterlimit:4;stroke-dasharray:none;stroke-dashoffset:0.3612;stroke-opacity:1;display:inline;enable-background:new" />
          <rect
             ry="0.28125"
             rx="0.28125"
             y="192"
             x="317"
             height="1"
             width="1"
             id="rect9172"
             style="opacity:0.55363734;fill:url(#linearGradient9218);fill-opacity:1;stroke:none;stroke-width:1;stroke-linecap:round;stroke-linejoin:round;stroke-miterlimit:4;stroke-dasharray:none;stroke-dashoffset:0.3612;stroke-opacity:1;display:inline;enable-background:new" />
          <rect
             ry="0.28125"
             rx="0.28125"
             y="193"
             x="319"
             height="1"
             width="1"
             id="rect9174"
             style="opacity:0.55363734;fill:url(#linearGradient9220);fill-opacity:1;stroke:none;stroke-width:1;stroke-linecap:round;stroke-linejoin:round;stroke-miterlimit:4;stroke-dasharray:none;stroke-dashoffset:0.3612;stroke-opacity:1;display:inline;enable-background:new" />
          <rect
             ry="0.28125"
             rx="0.28125"
             y="192"
             x="320"
             height="1"
             width="1"
             id="rect9176"
             style="opacity:0.55363734;fill:url(#linearGradient9222);fill-opacity:1;stroke:none;stroke-width:1;stroke-linecap:round;stroke-linejoin:round;stroke-miterlimit:4;stroke-dasharray:none;stroke-dashoffset:0.3612;stroke-opacity:1;display:inline;enable-background:new" />
          <rect
             ry="0.28125"
             rx="0.28125"
             y="193"
             x="321"
             height="1"
             width="1"
             id="rect9178"
             style="opacity:0.55363734;fill:url(#linearGradient9224);fill-opacity:1;stroke:none;stroke-width:1;stroke-linecap:round;stroke-linejoin:round;stroke-miterlimit:4;stroke-dasharray:none;stroke-dashoffset:0.3612;stroke-opacity:1;display:inline;enable-background:new" />
        </g>
      </g>
    </g>
    <path
       style="fill:url(#linearGradient2714);fill-opacity:1;fill-rule:nonzero;stroke:url(#linearGradient14158);stroke-width:0.99968821;stroke-linecap:round;stroke-linejoin:round;marker:none;marker-start:none;marker-mid:none;marker-end:none;stroke-miterlimit:4;stroke-dasharray:none;stroke-dashoffset:1.4;stroke-opacity:1;visibility:visible;display:inline;overflow:visible"
       d="M 5.0581017,13.499854 C 4.6584717,13.499854 4.3068927,13.672184 4.0510477,13.946764 L 1.785175,16.310031 C 1.609209,16.630988 1.499843,16.997245 1.499843,17.392932 L 1.499844,36.282798 C 1.499844,37.511221 2.465507,38.500163 3.66501,38.500164 L 14.334991,38.500164 C 15.534496,38.500163 16.500156,37.511221 16.500156,36.282798 L 16.500155,17.392932 C 16.500155,16.997245 16.390791,16.630988 16.214823,16.310031 L 13.948953,13.946764 C 13.693107,13.672184 13.34153,13.499854 12.941898,13.499854 L 5.0581017,13.499854 z"
       id="path2371"
       sodipodi:nodetypes="ccccccccccccc" />
    <rect
       style="fill:url(#linearGradient2710);fill-opacity:1;fill-rule:nonzero;stroke:url(#linearGradient14077);stroke-width:0.99992472;stroke-linecap:round;stroke-linejoin:miter;marker:none;marker-start:none;marker-mid:none;marker-end:none;stroke-miterlimit:4;stroke-dasharray:none;stroke-dashoffset:1.4;stroke-opacity:1;visibility:visible;display:inline;overflow:visible"
       id="rect2377"
       width="13.000075"
       height="21.000074"
       x="2.4999619"
       y="16.499973"
       rx="0.97365665"
       ry="1.0486374" />
    <rect
       style="opacity:0.8;fill:none;fill-opacity:1;fill-rule:nonzero;stroke:url(#linearGradient2694);stroke-width:0.99989355;stroke-linecap:round;stroke-linejoin:miter;marker:none;marker-start:none;marker-mid:none;marker-end:none;stroke-miterlimit:4;stroke-dasharray:none;stroke-dashoffset:1.4;stroke-opacity:1;visibility:visible;display:inline;overflow:visible"
       id="rect2379"
       width="11.000107"
       height="19.000107"
       x="3.4999466"
       y="17.499956"
       rx="0.13661154"
       ry="0.1239199" />
    <rect
       style="fill:url(#linearGradient9922);fill-opacity:1;fill-rule:nonzero;stroke:#b2b2b2;stroke-width:0.99980718;stroke-linecap:round;stroke-linejoin:round;marker:none;marker-start:none;marker-mid:none;marker-end:none;stroke-miterlimit:4;stroke-dasharray:none;stroke-dashoffset:0;stroke-opacity:1;visibility:visible;display:inline;overflow:visible"
       id="rect2716"
       width="9.0001926"
       height="3.0001926"
       x="4.4999027"
       y="19.499914"
       rx="0"
       ry="0" />
    <rect
       rx="0.30823955"
       ry="0.30867347"
       y="20.50001"
       x="6.4999981"
       height="1"
       width="6"
       id="rect14522"
       style="opacity:0.5;fill:#ffffff;fill-opacity:1;fill-rule:nonzero;stroke:none;stroke-width:1;stroke-linecap:round;stroke-linejoin:miter;marker:none;marker-start:none;marker-mid:none;marker-end:none;stroke-miterlimit:4;stroke-dasharray:none;stroke-dashoffset:0;stroke-opacity:1;visibility:visible;display:inline;overflow:visible" />
    <rect
       rx="0.30838406"
       ry="0.30867347"
       y="20.00001"
       x="5.9999981"
       height="1"
       width="6"
       id="rect14524"
       style="fill:url(#linearGradient9920);fill-opacity:1;fill-rule:nonzero;stroke:none;stroke-width:1;stroke-linecap:round;stroke-linejoin:miter;marker:none;marker-start:none;marker-mid:none;marker-end:none;stroke-miterlimit:4;stroke-dasharray:none;stroke-dashoffset:0;stroke-opacity:1;visibility:visible;display:inline;overflow:visible" />
    <rect
       style="fill:#eeeeec;fill-opacity:1;stroke:#b2b2b2;stroke-width:0.99999958;stroke-linecap:round;stroke-linejoin:round;stroke-miterlimit:4;stroke-dasharray:none;stroke-opacity:1"
       id="rect8315"
       width="4.0000095"
       height="1.9999981"
       x="9.4999981"
       y="28.500011"
       rx="0"
       ry="0" />
    <g
       id="g2794"
       style="opacity:0.48627451;display:inline"
       transform="translate(-14.000001,7.0000078)">
      <rect
         ry="0.23384352"
         rx="0.23384354"
         y="26.5"
         x="18"
         height="1"
         width="1.5"
         id="rect2729"
         style="opacity:1;fill:#ffffff;fill-opacity:1;fill-rule:nonzero;stroke:none;stroke-width:1;stroke-linecap:round;stroke-linejoin:miter;marker:none;marker-start:none;marker-mid:none;marker-end:none;stroke-miterlimit:4;stroke-dasharray:none;stroke-dashoffset:0;stroke-opacity:1;visibility:visible;display:inline;overflow:visible" />
      <rect
         ry="0.23384352"
         rx="0.23384354"
         y="26.5"
         x="20"
         height="1"
         width="1.5"
         id="rect2766"
         style="opacity:1;fill:#ffffff;fill-opacity:1;fill-rule:nonzero;stroke:none;stroke-width:1;stroke-linecap:round;stroke-linejoin:miter;marker:none;marker-start:none;marker-mid:none;marker-end:none;stroke-miterlimit:4;stroke-dasharray:none;stroke-dashoffset:0;stroke-opacity:1;visibility:visible;display:inline;overflow:visible" />
      <rect
         ry="0.23384352"
         rx="0.23384354"
         y="26.5"
         x="22"
         height="1"
         width="1.5"
         id="rect2768"
         style="opacity:1;fill:#ffffff;fill-opacity:1;fill-rule:nonzero;stroke:none;stroke-width:1;stroke-linecap:round;stroke-linejoin:miter;marker:none;marker-start:none;marker-mid:none;marker-end:none;stroke-miterlimit:4;stroke-dasharray:none;stroke-dashoffset:0;stroke-opacity:1;visibility:visible;display:inline;overflow:visible" />
      <rect
         ry="0.23384352"
         rx="0.23384354"
         y="28.5"
         x="18"
         height="1"
         width="1.5"
         id="rect2770"
         style="opacity:1;fill:#ffffff;fill-opacity:1;fill-rule:nonzero;stroke:none;stroke-width:1;stroke-linecap:round;stroke-linejoin:miter;marker:none;marker-start:none;marker-mid:none;marker-end:none;stroke-miterlimit:4;stroke-dasharray:none;stroke-dashoffset:0;stroke-opacity:1;visibility:visible;display:inline;overflow:visible" />
      <rect
         ry="0.23384352"
         rx="0.23384354"
         y="28.5"
         x="20"
         height="1"
         width="1.5"
         id="rect2772"
         style="opacity:1;fill:#ffffff;fill-opacity:1;fill-rule:nonzero;stroke:none;stroke-width:1;stroke-linecap:round;stroke-linejoin:miter;marker:none;marker-start:none;marker-mid:none;marker-end:none;stroke-miterlimit:4;stroke-dasharray:none;stroke-dashoffset:0;stroke-opacity:1;visibility:visible;display:inline;overflow:visible" />
      <rect
         ry="0.23384352"
         rx="0.23384354"
         y="28.5"
         x="22"
         height="1"
         width="1.5"
         id="rect2774"
         style="opacity:1;fill:#ffffff;fill-opacity:1;fill-rule:nonzero;stroke:none;stroke-width:1;stroke-linecap:round;stroke-linejoin:miter;marker:none;marker-start:none;marker-mid:none;marker-end:none;stroke-miterlimit:4;stroke-dasharray:none;stroke-dashoffset:0;stroke-opacity:1;visibility:visible;display:inline;overflow:visible" />
    </g>
    <rect
       style="opacity:1;fill:url(#linearGradient8172);fill-opacity:1;fill-rule:nonzero;stroke:none;stroke-width:1;stroke-linecap:round;stroke-linejoin:miter;marker:none;marker-start:none;marker-mid:none;marker-end:none;stroke-miterlimit:4;stroke-dasharray:none;stroke-dashoffset:0;stroke-opacity:1;visibility:visible;display:inline;overflow:visible"
       id="rect2570"
       width="1"
       height="1"
       x="3.9999981"
       y="33.000008"
       rx="0.23384354"
       ry="0.23384354" />
    <use
       style="display:inline"
       x="0"
       y="0"
       xlink:href="#rect2570"
       id="use3741"
       transform="translate(1.9999997,7.6726203e-7)"
       width="48"
       height="48" />
    <use
       style="display:inline"
       x="0"
       y="0"
       xlink:href="#rect2570"
       id="use3767"
       transform="translate(-3.12945e-7,2.0000008)"
       width="48"
       height="48" />
    <use
       style="display:inline"
       x="0"
       y="0"
       xlink:href="#rect2570"
       id="use3769"
       transform="translate(1.9999997,2.0000008)"
       width="48"
       height="48" />
    <use
       style="display:inline"
       x="0"
       y="0"
       xlink:href="#rect2570"
       id="use3775"
       transform="translate(3.9999997,7.6726203e-7)"
       width="48"
       height="48" />
    <use
       style="display:inline"
       x="0"
       y="0"
       xlink:href="#rect2570"
       id="use3781"
       transform="translate(3.9999997,2.0000008)"
       width="48"
       height="48" />
    <path
       sodipodi:type="arc"
       style="opacity:1;fill:#a7cc5c;fill-opacity:1;fill-rule:nonzero;stroke:#789e2d;stroke-width:1.00769317;stroke-linecap:round;stroke-linejoin:round;marker:none;marker-start:none;marker-mid:none;marker-end:none;stroke-miterlimit:4;stroke-dasharray:none;stroke-dashoffset:1.4;stroke-opacity:1;visibility:visible;display:inline;overflow:visible"
       id="path3586"
       sodipodi:cx="3.4765625"
       sodipodi:cy="19.382812"
       sodipodi:rx="0.9921875"
       sodipodi:ry="1.0234375"
       d="M 4.46875,19.382812 A 0.9921875,1.0234375 0 1 1 2.484375,19.382812 A 0.9921875,1.0234375 0 1 1 4.46875,19.382812 z"
       transform="matrix(1.007874,0,0,0.977097,1.996062,10.56112)" />
    <rect
       style="fill:url(#linearGradient9916);fill-opacity:1;fill-rule:nonzero;stroke:#b2b2b2;stroke-width:0.99980718;stroke-linecap:round;stroke-linejoin:round;marker:none;marker-start:none;marker-mid:none;marker-end:none;stroke-miterlimit:4;stroke-dasharray:none;stroke-dashoffset:0;stroke-opacity:1;visibility:visible;display:inline;overflow:visible"
       id="rect9910"
       width="9.0001926"
       height="3.0001926"
       x="4.4999027"
       y="22.499914"
       rx="0"
       ry="0" />
    <rect
       rx="0.30823955"
       ry="0.30867347"
       y="23.50001"
       x="6.4999981"
       height="1"
       width="6"
       id="rect9912"
       style="opacity:0.5;fill:#ffffff;fill-opacity:1;fill-rule:nonzero;stroke:none;stroke-width:1;stroke-linecap:round;stroke-linejoin:miter;marker:none;marker-start:none;marker-mid:none;marker-end:none;stroke-miterlimit:4;stroke-dasharray:none;stroke-dashoffset:0;stroke-opacity:1;visibility:visible;display:inline;overflow:visible" />
    <rect
       rx="0.30838406"
       ry="0.30867347"
       y="23.00001"
       x="5.9999981"
       height="1"
       width="6"
       id="rect9914"
       style="fill:url(#linearGradient9918);fill-opacity:1;fill-rule:nonzero;stroke:none;stroke-width:1;stroke-linecap:round;stroke-linejoin:miter;marker:none;marker-start:none;marker-mid:none;marker-end:none;stroke-miterlimit:4;stroke-dasharray:none;stroke-dashoffset:0;stroke-opacity:1;visibility:visible;display:inline;overflow:visible" />
  </g>
</svg>
