<?xml version="1.0" encoding="UTF-8" standalone="no"?>
<!-- Created with Inkscape (http://www.inkscape.org/) -->
<svg
   xmlns:dc="http://purl.org/dc/elements/1.1/"
   xmlns:cc="http://creativecommons.org/ns#"
   xmlns:rdf="http://www.w3.org/1999/02/22-rdf-syntax-ns#"
   xmlns:svg="http://www.w3.org/2000/svg"
   xmlns="http://www.w3.org/2000/svg"
   xmlns:xlink="http://www.w3.org/1999/xlink"
   xmlns:sodipodi="http://sodipodi.sourceforge.net/DTD/sodipodi-0.dtd"
   xmlns:inkscape="http://www.inkscape.org/namespaces/inkscape"
   width="48px"
   height="48px"
   id="svg7250"
   sodipodi:version="0.32"
   inkscape:version="0.46"
   sodipodi:docname="drawing.svg"
   inkscape:output_extension="org.inkscape.output.svg.inkscape">
  <defs
     id="defs7252">
    <linearGradient
       inkscape:collect="always"
       xlink:href="#linearGradient4305-4-8"
       id="linearGradient7808"
       gradientUnits="userSpaceOnUse"
       gradientTransform="matrix(0.3102479,0,0,0.942809,7.9543067,-7.2792126)"
       x1="7.2379346"
       y1="36.005047"
       x2="132.86028"
       y2="35.857735" />
    <linearGradient
       gradientTransform="matrix(1.0033404,0,0,1,-8.2374684,8)"
       y2="19.9583"
       x2="71.999496"
       y1="14.2578"
       x1="71.999496"
       gradientUnits="userSpaceOnUse"
       id="linearGradient10580">
      <stop
         id="stop10582"
         style="stop-color:#006900;stop-opacity:0"
         offset="0.25" />
      <stop
         id="stop10584"
         style="stop-color:#006900;stop-opacity:1"
         offset="1" />
    </linearGradient>
    <linearGradient
       inkscape:collect="always"
       xlink:href="#linearGradient10580"
       id="linearGradient7810"
       gradientUnits="userSpaceOnUse"
       gradientTransform="matrix(0.2402106,0,0,0.1666666,12.625548,20.333332)"
       x1="65.306877"
       y1="22"
       x2="65.306877"
       y2="28.003984" />
    <linearGradient
       inkscape:collect="always"
       id="linearGradient10572">
      <stop
         style="stop-color:#006900;stop-opacity:1"
         offset="0"
         id="stop10574" />
      <stop
         style="stop-color:#006900;stop-opacity:1"
         offset="1"
         id="stop10576" />
    </linearGradient>
    <linearGradient
       inkscape:collect="always"
       xlink:href="#linearGradient10572"
       id="linearGradient7814"
       gradientUnits="userSpaceOnUse"
       gradientTransform="matrix(0.9997295,0,0,1.0000073,-121.95958,-39.000537)"
       x1="151"
       y1="64"
       x2="150.99998"
       y2="83" />
    <linearGradient
       id="linearGradient10566">
      <stop
         style="stop-color:#006900;stop-opacity:1"
         offset="0"
         id="stop10568" />
      <stop
         style="stop-color:#006900;stop-opacity:1"
         offset="1"
         id="stop10570" />
    </linearGradient>
    <linearGradient
       inkscape:collect="always"
       xlink:href="#linearGradient10566"
       id="linearGradient7812"
       gradientUnits="userSpaceOnUse"
       gradientTransform="matrix(0.2421199,0,0,0.2368403,21.154605,-53.058011)"
       x1="28.272753"
       y1="325.34204"
       x2="28.272074"
       y2="409.80386" />
    <linearGradient
       inkscape:collect="always"
       xlink:href="#linearGradient17648"
       id="linearGradient7816"
       gradientUnits="userSpaceOnUse"
       gradientTransform="matrix(0.6666651,0,0,0.6666659,10.999612,14.166703)"
       x1="24.001408"
       y1="10.238918"
       x2="23.999996"
       y2="38.762936" />
    <linearGradient
       inkscape:collect="always"
       xlink:href="#linearGradient6293"
       id="linearGradient7818"
       gradientUnits="userSpaceOnUse"
       gradientTransform="matrix(0.6792506,0,0,0.6663604,10.697559,14.174186)"
       x1="23.999998"
       y1="8.7654715"
       x2="24.046484"
       y2="31.230356" />
    <linearGradient
       gradientTransform="matrix(1.0033404,0,0,1,-8.2374684,8)"
       y2="19.9583"
       x2="71.999496"
       y1="14.2578"
       x1="71.999496"
       gradientUnits="userSpaceOnUse"
       id="linearGradient4305-4-8">
      <stop
         id="stop4307-0-1"
         style="stop-color:#feebd6;stop-opacity:0;"
         offset="0.00445589" />
      <stop
         offset="0.46138024"
         style="stop-color:#f5f5f5;stop-opacity:0.53"
         id="stop4309-8-0" />
      <stop
         id="stop4311-0-3"
         style="stop-color:#f5f5f5;stop-opacity:0"
         offset="1" />
    </linearGradient>
    <linearGradient
       inkscape:collect="always"
       xlink:href="#linearGradient4305-4-8"
       id="linearGradient7802"
       gradientUnits="userSpaceOnUse"
       gradientTransform="matrix(0.3102479,0,0,0.942809,-4.569324e-2,-23.279212)"
       x1="7.2379346"
       y1="36.005047"
       x2="132.86028"
       y2="35.857735" />
    <linearGradient
       id="linearGradient7244"
       gradientUnits="userSpaceOnUse"
       x1="71.999496"
       y1="14.2578"
       x2="71.999496"
       y2="19.9583"
       gradientTransform="matrix(1.0033404,0,0,1,-8.2374684,8)">
      <stop
         offset="0.25"
         style="stop-color:#babdb6;stop-opacity:0"
         id="stop7246" />
      <stop
         offset="1"
         style="stop-color:#888a85;stop-opacity:1"
         id="stop7248" />
    </linearGradient>
    <linearGradient
       inkscape:collect="always"
       xlink:href="#linearGradient7244"
       id="linearGradient7800"
       gradientUnits="userSpaceOnUse"
       gradientTransform="matrix(0.2402106,0,0,0.1666666,4.6255497,4.3333314)"
       x1="65.306877"
       y1="22"
       x2="65.306877"
       y2="28.003984" />
    <linearGradient
       id="linearGradient7232"
       inkscape:collect="always">
      <stop
         id="stop7234"
         offset="0"
         style="stop-color:#888a85;stop-opacity:1" />
      <stop
         id="stop7236"
         offset="1"
         style="stop-color:#555753;stop-opacity:1" />
    </linearGradient>
    <linearGradient
       inkscape:collect="always"
       xlink:href="#linearGradient7232"
       id="linearGradient7798"
       gradientUnits="userSpaceOnUse"
       gradientTransform="matrix(0.9997295,0,0,1.0000073,-129.95958,-55.000537)"
       x1="151"
       y1="64"
       x2="150.99998"
       y2="83" />
    <linearGradient
       id="linearGradient7226">
      <stop
         id="stop7228"
         offset="0"
         style="stop-color:#eeeeec;stop-opacity:1" />
      <stop
         id="stop7230"
         offset="1"
         style="stop-color:#babdb6;stop-opacity:1" />
    </linearGradient>
    <linearGradient
       inkscape:collect="always"
       xlink:href="#linearGradient7226"
       id="linearGradient7796"
       gradientUnits="userSpaceOnUse"
       gradientTransform="matrix(0.2421199,0,0,0.2368403,13.154605,-69.058011)"
       x1="28.272753"
       y1="325.34204"
       x2="28.272074"
       y2="409.80386" />
    <linearGradient
       id="linearGradient17648">
      <stop
         id="stop17650"
         offset="0"
         style="stop-color:#ffffff;stop-opacity:0.6" />
      <stop
         id="stop17652"
         offset="1"
         style="stop-color:#ffffff;stop-opacity:0;" />
    </linearGradient>
    <linearGradient
       inkscape:collect="always"
       xlink:href="#linearGradient17648"
       id="linearGradient7794"
       gradientUnits="userSpaceOnUse"
       gradientTransform="matrix(0.6666651,0,0,0.6666659,2.9996137,-1.8332986)"
       x1="24.001408"
       y1="10.238918"
       x2="23.999996"
       y2="38.762936" />
    <linearGradient
       inkscape:collect="always"
       id="linearGradient6293">
      <stop
         style="stop-color:#888a85;stop-opacity:1"
         offset="0"
         id="stop6295" />
      <stop
         style="stop-color:#555753;stop-opacity:0"
         offset="1"
         id="stop6297" />
    </linearGradient>
    <linearGradient
       inkscape:collect="always"
       xlink:href="#linearGradient6293"
       id="linearGradient7792"
       gradientUnits="userSpaceOnUse"
       gradientTransform="matrix(0.6792506,0,0,0.6663604,2.6975607,-1.8258156)"
       x1="23.999998"
       y1="8.7654715"
       x2="24.046484"
       y2="31.230356" />
    <radialGradient
       inkscape:collect="always"
       xlink:href="#linearGradient5060"
       id="radialGradient7790"
       gradientUnits="userSpaceOnUse"
       gradientTransform="matrix(-2.774389,0,0,1.969706,112.7623,-872.8854)"
       cx="605.71429"
       cy="486.64789"
       fx="605.71429"
       fy="486.64789"
       r="117.14286" />
    <radialGradient
       inkscape:collect="always"
       xlink:href="#linearGradient5060"
       id="radialGradient7788"
       gradientUnits="userSpaceOnUse"
       gradientTransform="matrix(2.774389,0,0,1.969706,-1891.633,-872.8854)"
       cx="605.71429"
       cy="486.64789"
       fx="605.71429"
       fy="486.64789"
       r="117.14286" />
    <linearGradient
       inkscape:collect="always"
       xlink:href="#linearGradient5048"
       id="linearGradient7786"
       gradientUnits="userSpaceOnUse"
       gradientTransform="matrix(2.774389,0,0,1.969706,-1892.179,-872.8854)"
       x1="302.85715"
       y1="366.64789"
       x2="302.85715"
       y2="609.50507" />
    <radialGradient
       inkscape:collect="always"
       xlink:href="#linearGradient5060"
       id="radialGradient7824"
       gradientUnits="userSpaceOnUse"
       gradientTransform="matrix(-2.774389,0,0,1.969706,112.7623,-872.8854)"
       cx="605.71429"
       cy="486.64789"
       fx="605.71429"
       fy="486.64789"
       r="117.14286" />
    <linearGradient
       inkscape:collect="always"
       id="linearGradient5060">
      <stop
         style="stop-color:black;stop-opacity:1;"
         offset="0"
         id="stop5062" />
      <stop
         style="stop-color:black;stop-opacity:0;"
         offset="1"
         id="stop5064" />
    </linearGradient>
    <radialGradient
       inkscape:collect="always"
       xlink:href="#linearGradient5060"
       id="radialGradient7822"
       gradientUnits="userSpaceOnUse"
       gradientTransform="matrix(2.774389,0,0,1.969706,-1891.633,-872.8854)"
       cx="605.71429"
       cy="486.64789"
       fx="605.71429"
       fy="486.64789"
       r="117.14286" />
    <linearGradient
       id="linearGradient5048">
      <stop
         style="stop-color:black;stop-opacity:0;"
         offset="0"
         id="stop5050" />
      <stop
         id="stop5056"
         offset="0.5"
         style="stop-color:black;stop-opacity:1;" />
      <stop
         style="stop-color:black;stop-opacity:0;"
         offset="1"
         id="stop5052" />
    </linearGradient>
    <linearGradient
       inkscape:collect="always"
       xlink:href="#linearGradient5048"
       id="linearGradient7820"
       gradientUnits="userSpaceOnUse"
       gradientTransform="matrix(2.774389,0,0,1.969706,-1892.179,-872.8854)"
       x1="302.85715"
       y1="366.64789"
       x2="302.85715"
       y2="609.50507" />
  </defs>
  <sodipodi:namedview
     id="base"
     pagecolor="#ffffff"
     bordercolor="#666666"
     borderopacity="1.0"
     inkscape:pageopacity="0.0"
     inkscape:pageshadow="2"
     inkscape:zoom="7"
     inkscape:cx="24"
     inkscape:cy="24"
     inkscape:current-layer="layer1"
     showgrid="true"
     inkscape:grid-bbox="true"
     inkscape:document-units="px"
     inkscape:window-width="641"
     inkscape:window-height="688"
     inkscape:window-x="0"
     inkscape:window-y="25" />
  <metadata
     id="metadata7255">
    <rdf:RDF>
      <cc:Work
         rdf:about="">
        <dc:format>image/svg+xml</dc:format>
        <dc:type
           rdf:resource="http://purl.org/dc/dcmitype/StillImage" />
      </cc:Work>
    </rdf:RDF>
  </metadata>
  <g
     id="layer1"
     inkscape:label="Layer 1"
     inkscape:groupmode="layer">
    <g
       id="g13071"
       transform="matrix(1.5760178e-2,0,0,1.4633417e-2,42.017662,41.20521)"
       style="display:inline">
      <rect
         y="-150.69685"
         x="-1559.2523"
         height="478.35718"
         width="1339.6335"
         id="rect13073"
         style="opacity:0.40206185;fill:url(#linearGradient7820);fill-opacity:1;fill-rule:nonzero;stroke:none;stroke-width:1;stroke-linecap:round;stroke-linejoin:miter;marker:none;marker-start:none;marker-mid:none;marker-end:none;stroke-miterlimit:4;stroke-dasharray:none;stroke-dashoffset:0;stroke-opacity:1;visibility:visible;display:inline;overflow:visible" />
      <path
         sodipodi:nodetypes="cccc"
         id="path13075"
         d="M -219.61876,-150.68038 C -219.61876,-150.68038 -219.61876,327.65041 -219.61876,327.65041 C -76.744594,328.55086 125.78146,220.48075 125.78138,88.454235 C 125.78138,-43.572302 -33.655436,-150.68036 -219.61876,-150.68038 z"
         style="opacity:0.40206185;fill:url(#radialGradient7822);fill-opacity:1;fill-rule:nonzero;stroke:none;stroke-width:1;stroke-linecap:round;stroke-linejoin:miter;marker:none;marker-start:none;marker-mid:none;marker-end:none;stroke-miterlimit:4;stroke-dasharray:none;stroke-dashoffset:0;stroke-opacity:1;visibility:visible;display:inline;overflow:visible" />
      <path
         style="opacity:0.40206185;fill:url(#radialGradient7824);fill-opacity:1;fill-rule:nonzero;stroke:none;stroke-width:1;stroke-linecap:round;stroke-linejoin:miter;marker:none;marker-start:none;marker-mid:none;marker-end:none;stroke-miterlimit:4;stroke-dasharray:none;stroke-dashoffset:0;stroke-opacity:1;visibility:visible;display:inline;overflow:visible"
         d="M -1559.2523,-150.68038 C -1559.2523,-150.68038 -1559.2523,327.65041 -1559.2523,327.65041 C -1702.1265,328.55086 -1904.6525,220.48075 -1904.6525,88.454235 C -1904.6525,-43.572302 -1745.2157,-150.68036 -1559.2523,-150.68038 z"
         id="path13077"
         sodipodi:nodetypes="cccc" />
    </g>
    <g
       id="g7768"
       transform="matrix(1.5760178e-2,0,0,1.4633417e-2,34.017662,25.205209)"
       style="display:inline">
      <rect
         y="-150.69685"
         x="-1559.2523"
         height="478.35718"
         width="1339.6335"
         id="rect7770"
         style="opacity:0.40206185;fill:url(#linearGradient7786);fill-opacity:1;fill-rule:nonzero;stroke:none;stroke-width:1;stroke-linecap:round;stroke-linejoin:miter;marker:none;marker-start:none;marker-mid:none;marker-end:none;stroke-miterlimit:4;stroke-dasharray:none;stroke-dashoffset:0;stroke-opacity:1;visibility:visible;display:inline;overflow:visible" />
      <path
         sodipodi:nodetypes="cccc"
         id="path7772"
         d="M -219.61876,-150.68038 C -219.61876,-150.68038 -219.61876,327.65041 -219.61876,327.65041 C -76.744594,328.55086 125.78146,220.48075 125.78138,88.454235 C 125.78138,-43.572302 -33.655436,-150.68036 -219.61876,-150.68038 z"
         style="opacity:0.40206185;fill:url(#radialGradient7788);fill-opacity:1;fill-rule:nonzero;stroke:none;stroke-width:1;stroke-linecap:round;stroke-linejoin:miter;marker:none;marker-start:none;marker-mid:none;marker-end:none;stroke-miterlimit:4;stroke-dasharray:none;stroke-dashoffset:0;stroke-opacity:1;visibility:visible;display:inline;overflow:visible" />
      <path
         style="opacity:0.40206185;fill:url(#radialGradient7790);fill-opacity:1;fill-rule:nonzero;stroke:none;stroke-width:1;stroke-linecap:round;stroke-linejoin:miter;marker:none;marker-start:none;marker-mid:none;marker-end:none;stroke-miterlimit:4;stroke-dasharray:none;stroke-dashoffset:0;stroke-opacity:1;visibility:visible;display:inline;overflow:visible"
         d="M -1559.2523,-150.68038 C -1559.2523,-150.68038 -1559.2523,327.65041 -1559.2523,327.65041 C -1702.1265,328.55086 -1904.6525,220.48075 -1904.6525,88.454235 C -1904.6525,-43.572302 -1745.2157,-150.68036 -1559.2523,-150.68038 z"
         id="path7774"
         sodipodi:nodetypes="cccc" />
    </g>
    <path
       d="M 33.499569,7.4999974 C 33.493768,6.9999974 32.985772,6.4999974 32.499569,6.4999974 L 17.499569,6.4999974 L 15.749569,4.9999974 C 15.568702,4.8271404 15.255297,4.4999974 14.999569,4.4999974 L 7.4995727,4.4999974 C 6.9881207,4.4999974 6.4995727,5.0112004 6.4995727,5.4999974 L 6.4995717,6.4999974 L 6.4995717,27.499999 L 33.499569,27.499999 L 33.499569,7.4999974 z"
       id="path7776"
       style="opacity:0.7;fill:#eeeeec;fill-opacity:1;stroke:url(#linearGradient7792);stroke-width:1.0091393;stroke-miterlimit:4;stroke-dasharray:none"
       sodipodi:nodetypes="ccccccccccc" />
    <path
       d="M 32.499569,7.9999974 C 32.509409,7.4588194 32.498796,7.4684234 31.999544,7.4999974 L 17.099569,7.4999974 L 15.399569,5.9999974 C 14.919284,5.5891264 14.852271,5.4583304 13.99957,5.4999974 L 7.9995727,5.4999974 C 7.5233407,5.4999974 7.4995727,5.5415414 7.4995727,5.9999974 L 7.4995717,26.499999 L 32.499569,26.499999 L 32.499569,7.9999974 z"
       id="path7778"
       style="opacity:0.7;fill:none;fill-opacity:1;stroke:url(#linearGradient7794);stroke-width:0.99997574;stroke-miterlimit:4;stroke-dasharray:none;stroke-opacity:1"
       sodipodi:nodetypes="cccccccccc" />
    <path
       style="opacity:0.7;fill:url(#linearGradient7796);fill-opacity:1;stroke:url(#linearGradient7798);stroke-width:1.00012851;stroke-miterlimit:4;stroke-dasharray:none;stroke-opacity:1;display:inline;enable-background:new"
       id="path7780"
       d="M 34.745848,27.000061 C 34.724993,27.390379 34.396882,27.499935 33.99605,27.499935 L 6.0036277,27.499935 C 5.6027767,27.499935 5.2749657,27.390379 5.2538317,27.000061 L 4.5040347,9.9999354 C 4.4748717,9.6103264 4.6030477,9.5000614 5.0038987,9.5000614 L 34.99578,9.5000614 C 35.396631,9.5000614 35.526246,9.6103274 35.495645,9.9999354 L 34.745848,27.000061 L 34.745848,27.000061 z"
       sodipodi:nodetypes="cccccccccc" />
    <path
       style="opacity:0.35;fill:url(#linearGradient7800);fill-opacity:1;display:inline;enable-background:new"
       id="path7782"
       d="M 7.0000027,7.9999974 C 7.0018637,8.2916644 7.0046567,8.6258314 7.0065177,8.9999974 L 32.993485,8.9999974 C 32.995347,8.6258314 32.998139,8.2916644 33,7.9999974 L 7.0004957,7.9999974 L 7.0000027,7.9999974 z" />
    <rect
       ry="0"
       rx="0"
       y="9.9999981"
       x="5.0000091"
       height="1"
       width="30"
       id="rect7784"
       style="opacity:0.7;fill:url(#linearGradient7802);fill-opacity:1;stroke:none;display:inline;enable-background:new" />
    <path
       d="M 41.499569,23.499998 C 41.493768,22.999998 40.985772,22.499998 40.499569,22.499998 L 25.499569,22.499998 L 23.749569,20.999998 C 23.568702,20.827141 23.255297,20.499998 22.999569,20.499998 L 15.499571,20.499998 C 14.988119,20.499998 14.499571,21.011201 14.499571,21.499998 L 14.49957,22.499998 L 14.49957,43.5 L 41.499569,43.5 L 41.499569,23.499998 z"
       id="path15"
       style="fill:#eeeeec;fill-opacity:1;stroke:url(#linearGradient7818);stroke-width:1.0091393;stroke-miterlimit:4;stroke-dasharray:none"
       sodipodi:nodetypes="ccccccccccc" />
    <path
       d="M 40.499569,23.999998 C 40.509409,23.45882 40.498796,23.468424 39.999544,23.499998 L 25.099569,23.499998 L 23.399569,21.999998 C 22.919284,21.589127 22.852271,21.458331 21.99957,21.499998 L 15.999571,21.499998 C 15.523339,21.499998 15.499571,21.541542 15.499571,21.999998 L 15.49957,42.5 L 40.499569,42.5 L 40.499569,23.999998 z"
       id="path7263"
       style="opacity:1;fill:none;fill-opacity:1;stroke:url(#linearGradient7816);stroke-width:0.99997574;stroke-miterlimit:4;stroke-dasharray:none;stroke-opacity:1"
       sodipodi:nodetypes="cccccccccc" />
    <path
       style="opacity:0.9;fill:url(#linearGradient7812);fill-opacity:1;stroke:url(#linearGradient7814);stroke-width:1.00012851;stroke-miterlimit:4;stroke-dasharray:none;stroke-opacity:1;display:inline;enable-background:new"
       id="path40085"
       d="M 42.745848,43.000062 C 42.724993,43.39038 42.396882,43.499936 41.99605,43.499936 L 14.003626,43.499936 C 13.602775,43.499936 13.274964,43.39038 13.25383,43.000062 L 12.504033,25.999936 C 12.47487,25.610327 12.603046,25.500062 13.003897,25.500062 L 42.99578,25.500062 C 43.396631,25.500062 43.526246,25.610328 43.495645,25.999936 L 42.745848,43.000062 L 42.745848,43.000062 z"
       sodipodi:nodetypes="cccccccccc" />
    <path
       style="opacity:0.5;fill:url(#linearGradient7810);fill-opacity:1;display:inline;enable-background:new"
       id="path50"
       d="M 15.000001,23.999998 C 15.001862,24.291665 15.004655,24.625832 15.006516,24.999998 L 40.993485,24.999998 C 40.995347,24.625832 40.998139,24.291665 41,23.999998 L 15.000494,23.999998 L 15.000001,23.999998 z" />
    <rect
       ry="0"
       rx="0"
       y="25.999998"
       x="13.000007"
       height="1"
       width="30"
       id="rect3521-5-0"
       style="fill:url(#linearGradient7808);fill-opacity:1;stroke:none;display:inline;enable-background:new" />
  </g>
</svg>
