<?xml version="1.0" encoding="UTF-8" standalone="no"?>
<!-- Created with Inkscape (http://www.inkscape.org/) -->
<svg
   xmlns:dc="http://purl.org/dc/elements/1.1/"
   xmlns:cc="http://creativecommons.org/ns#"
   xmlns:rdf="http://www.w3.org/1999/02/22-rdf-syntax-ns#"
   xmlns:svg="http://www.w3.org/2000/svg"
   xmlns="http://www.w3.org/2000/svg"
   xmlns:xlink="http://www.w3.org/1999/xlink"
   xmlns:sodipodi="http://sodipodi.sourceforge.net/DTD/sodipodi-0.dtd"
   xmlns:inkscape="http://www.inkscape.org/namespaces/inkscape"
   width="48px"
   height="48px"
   id="svg7226"
   sodipodi:version="0.32"
   inkscape:version="0.46"
   sodipodi:docname="drawing.svg"
   inkscape:output_extension="org.inkscape.output.svg.inkscape">
  <defs
     id="defs7228">
    <linearGradient
       inkscape:collect="always"
       xlink:href="#linearGradient3302"
       id="linearGradient3312"
       gradientUnits="userSpaceOnUse"
       x1="59.787399"
       y1="5.8966098"
       x2="58.125"
       y2="14.7785"
       gradientTransform="matrix(0.389743,0,0,0.389743,0.615554,0.6864029)" />
    <linearGradient
       inkscape:collect="always"
       id="linearGradient3302">
      <stop
         style="stop-color:#000000;stop-opacity:1;"
         offset="0"
         id="stop3304" />
      <stop
         style="stop-color:#000000;stop-opacity:0;"
         offset="1"
         id="stop3306" />
    </linearGradient>
    <linearGradient
       inkscape:collect="always"
       xlink:href="#linearGradient3302"
       id="linearGradient3308"
       x1="59.787399"
       y1="5.8966098"
       x2="59.787399"
       y2="13.460335"
       gradientUnits="userSpaceOnUse"
       gradientTransform="matrix(0.389743,0,0,0.389743,0.615554,0.6864029)" />
    <linearGradient
       inkscape:collect="always"
       xlink:href="#linearGradient4070"
       id="linearGradient2315"
       gradientUnits="userSpaceOnUse"
       gradientTransform="matrix(0.3695545,0,0,0.3760178,3.4568423,4.3423569)"
       x1="84.354332"
       y1="30.357241"
       x2="50.338581"
       y2="125.04807" />
    <radialGradient
       gradientUnits="userSpaceOnUse"
       gradientTransform="matrix(0.9769,0,0,1,1.387,0)"
       r="65.890404"
       cy="60.001499"
       cx="59.859901"
       id="radialGradient7288">
      <stop
         id="stop7290"
         style="stop-color:#795548;stop-opacity:1"
         offset="0.2604" />
      <stop
         id="stop7292"
         style="stop-color:#795548;stop-opacity:1"
         offset="0.7988" />
      <stop
         id="stop7294"
         style="stop-color:#795548;stop-opacity:1"
         offset="1" />
    </radialGradient>
    <radialGradient
       inkscape:collect="always"
       xlink:href="#radialGradient7288"
       id="radialGradient2313"
       gradientUnits="userSpaceOnUse"
       gradientTransform="matrix(0.3317545,0,0,0.9094852,4.0238423,-0.7217691)"
       cx="60.214153"
       cy="50.697399"
       fx="60.56406"
       fy="46.362309"
       r="45.214153" />
    <linearGradient
       id="linearGradient3599">
      <stop
         style="stop-color:#fefefe;stop-opacity:1"
         offset="0"
         id="stop3601" />
      <stop
         style="stop-color:#d6d6d6;stop-opacity:1"
         offset="1"
         id="stop3603" />
    </linearGradient>
    <radialGradient
       inkscape:collect="always"
       xlink:href="#linearGradient3599"
       id="radialGradient3597"
       cx="58.125"
       cy="14.7785"
       fx="58.125"
       fy="14.7785"
       r="43.125"
       gradientTransform="matrix(0.6933424,0,0,0.7401337,-17.031165,-4.4918451)"
       gradientUnits="userSpaceOnUse" />
    <linearGradient
       inkscape:collect="always"
       id="linearGradient4070">
      <stop
         style="stop-color:#ffffff;stop-opacity:1;"
         offset="0"
         id="stop4072" />
      <stop
         style="stop-color:#ffffff;stop-opacity:0;"
         offset="1"
         id="stop4074" />
    </linearGradient>
    <linearGradient
       inkscape:collect="always"
       xlink:href="#linearGradient4070"
       id="linearGradient4123"
       gradientUnits="userSpaceOnUse"
       gradientTransform="matrix(0.3695545,0,0,0.2297887,3.4568423,-1.3004084e-2)"
       x1="84.354332"
       y1="30.357241"
       x2="50.338581"
       y2="125.04807" />
    <radialGradient
       id="XMLID_40_"
       cx="59.859901"
       cy="60.001499"
       r="65.890404"
       gradientTransform="matrix(0.9769,0,0,1,1.387,0)"
       gradientUnits="userSpaceOnUse">
      <stop
         offset="0.2604"
         style="stop-color:#795548;stop-opacity:1"
         id="stop75" />
      <stop
         offset="0.7988"
         style="stop-color:#795548;stop-opacity:1"
         id="stop77" />
      <stop
         offset="1"
         style="stop-color:#795548;stop-opacity:1"
         id="stop79" />
    </radialGradient>
    <radialGradient
       inkscape:collect="always"
       xlink:href="#XMLID_40_"
       id="radialGradient4117"
       gradientUnits="userSpaceOnUse"
       gradientTransform="matrix(0.3317545,0,0,0.5557965,4.0238423,-3.1077491)"
       cx="60.214153"
       cy="50.697399"
       fx="60.56406"
       fy="46.362309"
       r="45.214153" />
    <linearGradient
       id="linearGradient3315"
       inkscape:collect="always">
      <stop
         id="stop3317"
         offset="0"
         style="stop-color:#dddddd;stop-opacity:1" />
      <stop
         id="stop3319"
         offset="1"
         style="stop-color:#d1d1d1;stop-opacity:1" />
    </linearGradient>
    <linearGradient
       inkscape:collect="always"
       xlink:href="#linearGradient3315"
       id="linearGradient4115"
       gradientUnits="userSpaceOnUse"
       x1="51.805714"
       y1="-0.070480376"
       x2="52.865498"
       y2="117.42957"
       gradientTransform="matrix(0.3447727,0,0,0.3340653,3.8759033,6.9377959)" />
    <radialGradient
       inkscape:collect="always"
       xlink:href="#linearGradient5060"
       id="radialGradient5031"
       gradientUnits="userSpaceOnUse"
       gradientTransform="matrix(-2.774389,0,0,1.969706,112.7623,-872.8854)"
       cx="605.71429"
       cy="486.64789"
       fx="605.71429"
       fy="486.64789"
       r="117.14286" />
    <linearGradient
       inkscape:collect="always"
       id="linearGradient5060">
      <stop
         style="stop-color:black;stop-opacity:1;"
         offset="0"
         id="stop5062" />
      <stop
         style="stop-color:black;stop-opacity:0;"
         offset="1"
         id="stop5064" />
    </linearGradient>
    <radialGradient
       inkscape:collect="always"
       xlink:href="#linearGradient5060"
       id="radialGradient5029"
       gradientUnits="userSpaceOnUse"
       gradientTransform="matrix(2.774389,0,0,1.969706,-1891.633,-872.8854)"
       cx="605.71429"
       cy="486.64789"
       fx="605.71429"
       fy="486.64789"
       r="117.14286" />
    <linearGradient
       id="linearGradient5048">
      <stop
         style="stop-color:black;stop-opacity:0;"
         offset="0"
         id="stop5050" />
      <stop
         id="stop5056"
         offset="0.5"
         style="stop-color:black;stop-opacity:1;" />
      <stop
         style="stop-color:black;stop-opacity:0;"
         offset="1"
         id="stop5052" />
    </linearGradient>
    <linearGradient
       inkscape:collect="always"
       xlink:href="#linearGradient5048"
       id="linearGradient5027"
       gradientUnits="userSpaceOnUse"
       gradientTransform="matrix(2.774389,0,0,1.969706,-1892.179,-872.8854)"
       x1="302.85715"
       y1="366.64789"
       x2="302.85715"
       y2="609.50507" />
  </defs>
  <sodipodi:namedview
     id="base"
     pagecolor="#ffffff"
     bordercolor="#666666"
     borderopacity="1.0"
     inkscape:pageopacity="0.0"
     inkscape:pageshadow="2"
     inkscape:zoom="7"
     inkscape:cx="24"
     inkscape:cy="24"
     inkscape:current-layer="layer1"
     showgrid="true"
     inkscape:grid-bbox="true"
     inkscape:document-units="px"
     inkscape:window-width="641"
     inkscape:window-height="688"
     inkscape:window-x="1037"
     inkscape:window-y="333" />
  <metadata
     id="metadata7231">
    <rdf:RDF>
      <cc:Work
         rdf:about="">
        <dc:format>image/svg+xml</dc:format>
        <dc:type
           rdf:resource="http://purl.org/dc/dcmitype/StillImage" />
      </cc:Work>
    </rdf:RDF>
  </metadata>
  <g
     id="layer1"
     inkscape:label="Layer 1"
     inkscape:groupmode="layer">
    <g
       id="g5022"
       transform="matrix(2.1670245e-2,0,0,2.0904881e-2,43.274286,41.1503)">
      <rect
         y="-150.69685"
         x="-1559.2523"
         height="478.35718"
         width="1339.6335"
         id="rect4173"
         style="opacity:0.40206185;fill:url(#linearGradient5027);fill-opacity:1;fill-rule:nonzero;stroke:none;stroke-width:1;stroke-linecap:round;stroke-linejoin:miter;marker:none;marker-start:none;marker-mid:none;marker-end:none;stroke-miterlimit:4;stroke-dasharray:none;stroke-dashoffset:0;stroke-opacity:1;visibility:visible;display:inline;overflow:visible" />
      <path
         sodipodi:nodetypes="cccc"
         id="path5058"
         d="M -219.61876,-150.68038 C -219.61876,-150.68038 -219.61876,327.65041 -219.61876,327.65041 C -76.744594,328.55086 125.78146,220.48075 125.78138,88.454235 C 125.78138,-43.572302 -33.655436,-150.68036 -219.61876,-150.68038 z"
         style="opacity:0.40206185;fill:url(#radialGradient5029);fill-opacity:1;fill-rule:nonzero;stroke:none;stroke-width:1;stroke-linecap:round;stroke-linejoin:miter;marker:none;marker-start:none;marker-mid:none;marker-end:none;stroke-miterlimit:4;stroke-dasharray:none;stroke-dashoffset:0;stroke-opacity:1;visibility:visible;display:inline;overflow:visible" />
      <path
         style="opacity:0.40206185;fill:url(#radialGradient5031);fill-opacity:1;fill-rule:nonzero;stroke:none;stroke-width:1;stroke-linecap:round;stroke-linejoin:miter;marker:none;marker-start:none;marker-mid:none;marker-end:none;stroke-miterlimit:4;stroke-dasharray:none;stroke-dashoffset:0;stroke-opacity:1;visibility:visible;display:inline;overflow:visible"
         d="M -1559.2523,-150.68038 C -1559.2523,-150.68038 -1559.2523,327.65041 -1559.2523,327.65041 C -1702.1265,328.55086 -1904.6525,220.48075 -1904.6525,88.454235 C -1904.6525,-43.572302 -1745.2157,-150.68036 -1559.2523,-150.68038 z"
         id="path5018"
         sodipodi:nodetypes="cccc" />
    </g>
    <path
       style="opacity:1;fill:#babdb6;fill-opacity:1;stroke:#888a85;stroke-width:1.00031686;stroke-linecap:round;stroke-linejoin:round;stroke-miterlimit:4;stroke-dasharray:none;stroke-opacity:1;overflow:visible"
       d="M 10.000158,2.5001579 L 5.5003203,8.9999999 L 5.5001623,45.499842 L 42.499999,45.499842 L 42.499999,8.9999999 L 38.000158,2.5001579 L 10.000158,2.5001579 z"
       id="path2318"
       sodipodi:nodetypes="ccccccc" />
    <path
       style="fill:url(#linearGradient4115);fill-opacity:1;stroke:none;stroke-width:1;stroke-linecap:round;stroke-linejoin:round;stroke-miterlimit:4;stroke-opacity:1;overflow:visible"
       d="M 6.0001623,8.9999999 L 41.000158,8.9999999 L 41.000158,45 L 6.0001623,45 L 6.0001623,8.9999999 z"
       id="rect2359"
       sodipodi:nodetypes="ccccc" />
    <rect
       y="12"
       x="9.0001631"
       height="11"
       width="30"
       id="rect3330"
       style="fill:url(#radialGradient4117);fill-opacity:1;stroke:none;stroke-width:1;stroke-linecap:round;stroke-linejoin:round;stroke-miterlimit:4;stroke-dasharray:none;stroke-opacity:1;overflow:visible" />
    <path
       id="path4078"
       d="M 9.0001623,12 L 9.0001623,23 L 39.000158,23 L 39.000158,12 L 9.0001623,12 z"
       style="opacity:0.6;fill:url(#linearGradient4123);fill-opacity:1;fill-rule:evenodd;stroke:none;stroke-width:1px;stroke-linecap:butt;stroke-linejoin:miter;stroke-opacity:1;overflow:visible"
       sodipodi:nodetypes="ccccc" />
    <path
       style="opacity:0.70792081;fill:#555555;fill-opacity:1;stroke:none;stroke-width:7.50000143;stroke-linecap:butt;stroke-linejoin:miter;stroke-miterlimit:4;stroke-opacity:1;overflow:visible"
       d="M 18.000158,12 L 30.000158,12 C 30.000158,14.012358 30.000158,14.017857 27.000158,14 L 21.000158,14 C 18.018015,14 18.018015,14 18.000158,12 z"
       id="rect4016"
       sodipodi:nodetypes="ccccc" />
    <path
       style="opacity:0.20430106;fill:none;fill-opacity:1;stroke:#000000;stroke-width:1;stroke-linecap:round;stroke-linejoin:round;stroke-miterlimit:4;stroke-dasharray:none;stroke-opacity:1;overflow:visible"
       d="M 38.500158,12.5 L 38.500158,22.5 L 9.5001623,22.5 L 9.5001623,12.5"
       id="rect3295"
       sodipodi:nodetypes="cccc" />
    <rect
       style="opacity:1;fill:#ffffff;fill-opacity:1;stroke:none;stroke-width:7.50000143;stroke-linecap:butt;stroke-linejoin:miter;stroke-miterlimit:4;stroke-dasharray:none;stroke-opacity:1;overflow:visible"
       id="rect4013"
       width="10"
       height="1"
       x="19.00016"
       y="12" />
    <path
       style="opacity:1;fill:url(#radialGradient3597);fill-opacity:1;stroke:none;stroke-width:1;stroke-linecap:round;stroke-linejoin:round;stroke-miterlimit:4;stroke-opacity:1;overflow:visible"
       d="M 10.000158,2.9999999 L 38.000158,2.9999999 L 42.000158,8.9999999 L 6.0001623,8.9999999 L 10.000158,2.9999999 z"
       id="rect3284"
       sodipodi:nodetypes="ccccc" />
    <rect
       style="fill:url(#radialGradient2313);fill-opacity:1;stroke:none;stroke-width:1;stroke-linecap:round;stroke-linejoin:round;stroke-miterlimit:4;stroke-dasharray:none;stroke-opacity:1;overflow:visible"
       id="rect2305"
       width="30"
       height="18"
       x="9.0001631"
       y="24" />
    <path
       sodipodi:nodetypes="ccccc"
       style="opacity:0.6;fill:url(#linearGradient2315);fill-opacity:1;fill-rule:evenodd;stroke:none;stroke-width:1px;stroke-linecap:butt;stroke-linejoin:miter;stroke-opacity:1;overflow:visible"
       d="M 9.0001623,24 L 9.0001623,42 L 39.000158,42 L 39.000158,24 L 9.0001623,24 z"
       id="path2307" />
    <path
       sodipodi:nodetypes="ccccc"
       id="path3326"
       d="M 18.000158,24 L 30.000158,24 C 30.035872,25.976643 30.015265,26 27.000158,26 L 21.000158,26 C 18.056479,25.982143 18.035872,25.976643 18.000158,24 z"
       style="opacity:0.70792081;fill:#555555;fill-opacity:1;stroke:none;stroke-width:7.50000143;stroke-linecap:butt;stroke-linejoin:miter;stroke-miterlimit:4;stroke-opacity:1;overflow:visible" />
    <path
       style="opacity:0.20430106;fill:none;fill-opacity:1;stroke:#000000;stroke-width:1.00007033;stroke-linecap:round;stroke-linejoin:round;stroke-miterlimit:4;stroke-dasharray:none;stroke-opacity:1;overflow:visible"
       d="M 9.5001973,24.500035 L 38.500123,24.500035 L 38.500123,41.499965 L 9.5001973,41.499965 L 9.5001973,24.500035 z"
       id="rect3297"
       sodipodi:nodetypes="ccccc" />
    <rect
       style="opacity:1;fill:#ffffff;fill-opacity:1;stroke:none;stroke-width:7.50000143;stroke-linecap:butt;stroke-linejoin:miter;stroke-miterlimit:4;stroke-dasharray:none;stroke-opacity:1;overflow:visible"
       id="rect3313"
       width="30"
       height="1"
       x="9.0001631"
       y="42" />
    <rect
       y="23"
       x="9.0001631"
       height="1"
       width="30"
       id="rect3321"
       style="opacity:0.5;fill:#ffffff;fill-opacity:1;stroke:none;stroke-width:7.50000143;stroke-linecap:butt;stroke-linejoin:miter;stroke-miterlimit:4;stroke-dasharray:none;stroke-opacity:1;overflow:visible" />
    <rect
       style="opacity:0.42473156;fill:#000000;fill-opacity:1;stroke:none;stroke-width:7.50000143;stroke-linecap:butt;stroke-linejoin:miter;stroke-miterlimit:4;stroke-dasharray:none;stroke-opacity:1;overflow:visible"
       id="rect3323"
       width="30"
       height="1"
       x="9.0001631"
       y="11" />
    <rect
       y="24"
       x="19.00016"
       height="1"
       width="10"
       id="rect3328"
       style="opacity:1;fill:#ffffff;fill-opacity:1;stroke:none;stroke-width:7.50000143;stroke-linecap:butt;stroke-linejoin:miter;stroke-miterlimit:4;stroke-dasharray:none;stroke-opacity:1;overflow:visible" />
    <rect
       y="9"
       x="41.00016"
       height="36"
       width="1"
       id="rect3623"
       style="opacity:0.55376371;fill:#ffffff;fill-opacity:1;stroke:none;stroke-width:7.50000143;stroke-linecap:butt;stroke-linejoin:miter;stroke-miterlimit:4;stroke-dasharray:none;stroke-opacity:1;overflow:visible" />
    <rect
       style="opacity:0.55376371;fill:#ffffff;fill-opacity:1;stroke:none;stroke-width:7.50000143;stroke-linecap:butt;stroke-linejoin:miter;stroke-miterlimit:4;stroke-dasharray:none;stroke-opacity:1;overflow:visible"
       id="rect3625"
       width="1"
       height="36"
       x="6.0001631"
       y="9" />
    <path
       sodipodi:nodetypes="ccccc"
       id="path3300"
       d="M 10.000158,2.9999999 L 38.000158,2.9999999 L 42.000158,8.9999999 L 6.0001623,8.9999999 L 10.000158,2.9999999 z"
       style="opacity:0.21226418;fill:url(#linearGradient3308);fill-opacity:1;stroke:none;stroke-width:1;stroke-linecap:round;stroke-linejoin:round;stroke-miterlimit:4;stroke-opacity:1;overflow:visible" />
    <path
       style="opacity:0.21226418;fill:url(#linearGradient3312);fill-opacity:1;stroke:none;stroke-width:1;stroke-linecap:round;stroke-linejoin:round;stroke-miterlimit:4;stroke-opacity:1;overflow:visible"
       d="M 10.100158,2.9999999 L 38.000158,2.9999999 L 42.000158,8.9999999 L 6.0001623,8.9999999 L 10.100158,2.9999999 z"
       id="path3310"
       sodipodi:nodetypes="ccccc" />
  </g>
</svg>
