<?xml version="1.0" encoding="UTF-8" standalone="no"?>
<!-- Created with Inkscape (http://www.inkscape.org/) -->

<svg
   width="1024"
   height="512"
   viewBox="0 0 270.93333 135.46667"
   version="1.1"
   id="svg8"
   inkscape:version="1.1 (c68e22c387, 2021-05-23)"
   sodipodi:docname="sulin-banner.svg"
   xmlns:inkscape="http://www.inkscape.org/namespaces/inkscape"
   xmlns:sodipodi="http://sodipodi.sourceforge.net/DTD/sodipodi-0.dtd"
   xmlns="http://www.w3.org/2000/svg"
   xmlns:svg="http://www.w3.org/2000/svg"
   xmlns:rdf="http://www.w3.org/1999/02/22-rdf-syntax-ns#"
   xmlns:cc="http://creativecommons.org/ns#"
   xmlns:dc="http://purl.org/dc/elements/1.1/">
  <defs
     id="defs2" />
  <sodipodi:namedview
     id="base"
     pagecolor="#ffffff"
     bordercolor="#666666"
     borderopacity="1.0"
     inkscape:pageopacity="0.0"
     inkscape:pageshadow="2"
     inkscape:zoom="0.49497475"
     inkscape:cx="355.57369"
     inkscape:cy="337.39095"
     inkscape:document-units="mm"
     inkscape:current-layer="layer1"
     showgrid="false"
     units="px"
     inkscape:window-width="1920"
     inkscape:window-height="1011"
     inkscape:window-x="0"
     inkscape:window-y="32"
     inkscape:window-maximized="1"
     inkscape:pagecheckerboard="0" />
  <metadata
     id="metadata5">
    <rdf:RDF>
      <cc:Work
         rdf:about="">
        <dc:format>image/svg+xml</dc:format>
        <dc:type
           rdf:resource="http://purl.org/dc/dcmitype/StillImage" />
        <dc:title />
      </cc:Work>
    </rdf:RDF>
  </metadata>
  <g
     inkscape:label="Layer 1"
     inkscape:groupmode="layer"
     id="layer1"
     transform="translate(0,-161.53332)">
    <rect
       style="fill:#000000;stroke-width:0.48614687"
       id="rect3728"
       width="270.93332"
       height="135.46666"
       x="-270.93332"
       y="161.53331"
       transform="scale(-1,1)" />
    <g
       id="g3736"
       transform="matrix(2.0390426,0,0,2.0390426,-70.010911,48.457541)">
      <g
         transform="translate(-47.841245,-9.621703)"
         id="g3726">
        <rect
           style="fill:#ff9900;stroke-width:0.26458332;fill-opacity:1"
           id="rect3713"
           width="43.089287"
           height="34.017857"
           x="155.35086"
           y="81.286308"
           ry="7.2162771" />
        <text
           xml:space="preserve"
           style="font-style:normal;font-weight:normal;font-size:23.7986px;line-height:1.25;font-family:sans-serif;letter-spacing:0px;word-spacing:0px;fill:#000000;fill-opacity:1;stroke:none;stroke-width:0.594965"
           x="159.9704"
           y="106.95824"
           id="text3717"><tspan
             sodipodi:role="line"
             id="tspan3715"
             x="159.9704"
             y="106.95824"
             style="stroke-width:0.594965;fill:#000000">OS</tspan></text>
      </g>
      <text
         id="text3721"
         y="97.344193"
         x="49.411167"
         style="font-style:normal;font-weight:normal;font-size:23.258px;line-height:1.25;font-family:sans-serif;letter-spacing:0px;word-spacing:0px;fill:#ffffff;fill-opacity:1;stroke:none;stroke-width:0.581451"
         xml:space="preserve"><tspan
           style="fill:#ffffff;stroke-width:0.581451"
           y="97.344193"
           x="49.411167"
           id="tspan3719"
           sodipodi:role="line">Sulin</tspan></text>
    </g>
  </g>
</svg>
