﻿PERIODE (dd/mm/yyyy); GDP ;FLAG (0 =aktual / 1 = proyeksi)
01/03/07;6,06;0
01/06/07;6,73;0
01/09/07;6,74;0
01/12/07;5,84;0
01/03/08;6,22;0
01/06/08;6,3;0
01/09/08;6,25;0
01/12/08;5,28;0
01/03/09;4,52;0
01/06/09;4,14;0
01/09/09;4,27;0
01/12/09;5,6;0
01/03/10;5,99;0
01/06/10;6,29;0
01/09/10;5,81;0
01/12/10;6,81;0
01/03/11;6,48;0
01/06/11;6,27;0
01/09/11;6,01;0
01/12/11;5,94;0
01/03/12;6,11;0
01/06/12;6,21;0
01/09/12;5,94;0
01/12/12;5,87;0
01/03/13;5,54;0
01/06/13;5,59;0
01/09/13;5,52;0
01/12/13;5,58;0
01/03/14;5,12;0
01/06/14;4,94;0
01/09/14;4,93;0
01/12/14;5,05;0
01/03/15;4,83;0
01/06/15;4,74;0
01/09/15;4,78;0
01/12/15;5,15;0
01/03/16;4,94;0
01/06/16;5,21;0
01/09/16;5,03;0
01/12/16;4,94;0
01/03/17;5,01;0
01/06/17;5,01;0
01/09/17;5,06;0
01/12/17;5,19;0
01/03/18;5,06;0
01/06/18;5,27;0
01/09/18;5,17;0
01/12/18;5,18;0
01/03/19;5,07;0
01/06/19;5,05;0
01/09/19;5,02;0
01/12/19;4,97;0
01/03/20;4,28;1
01/06/20;4,16;1
01/09/20;4,59;1
01/12/20;4,79;1