                                 _           _           _   _     _    ___
                                | |         | |         | | | |   (_)  |__ \
  _____      _____     __      _| |__   __ _| |_ ___    | |_| |__  _ ___  ) |
 / _ \ \ /\ / / _ \    \ \ /\ / / '_ \ / _` | __/ __|   | __| '_ \| / __|/ /
| (_) \ V  V / (_) |    \ V  V /| | | | (_| | |_\__ \   | |_| | | | \__ \_|
 \___/ \_/\_/ \___/      \_/\_/ |_| |_|\__,_|\__|___/    \__|_| |_|_|___(_)
 _____               _                  _                 _
/  ___|             (_)                | |               | |
\ `--. _ ____      ___ _ __   __ _     | |__   ___   ___ | |_
 `--. \ '_ \ \ /\ / / | '_ \ / _` |    | '_ \ / _ \ / _ \| __|
/\__/ / |_) \ V  V /| | | | | (_| |    | |_) | (_) | (_) | |_
\____/| .__/ \_/\_/ |_|_| |_|\__, |    |_.__/ \___/ \___/ \__|
      | |                     __/ |
      |_|                    |___/

                      CDN Service for ehvLINC
