PF11740.8	KfrA_N	Plasmid replication region DNA-binding N-term
PF03389.15	MobA_MobL	MobA/MobL family
PF01076.19	Mob_Pre	Plasmid recombination enzyme
PF10609.9	ParA	NUBPL iron-transfer P-loop NTPase
PF10623.9	PilI	Plasmid conjugative transfer protein PilI
PF01672.16	Plasmid_parti	Putative plasmid partition protein
PF04796.12	RepA_C	Plasmid encoded RepA protein
PF07506.11	RepB	RepB plasmid partitioning protein
PF06504.11	RepC	Replication protein C (RepC)
PF01719.17	Rep_2	Plasmid replication protein
PF01051.21	Rep_3	Initiator Replication protein
PF11130.8	TraC_F_IV	F pilus assembly Type-IV secretion system for plasmid transfer
PF13728.6	TraF	F plasmid transfer operon protein
PF13729.6	TraF_2	F plasmid transfer operon, TraF, protein
PF10624.9	TraS	Plasmid conjugative transfer entry exclusion protein TraS
PF04610.14	TrbL	TrbL/VirB6 plasmid conjugal transfer protein
PF07996.11	T4SS	Type IV secretion system proteins
PF02534.14	T4SS-DNA_transf	Type IV secretory system Conjugative DNA transfer
PF16932.5	T4SS_TraI	Type IV secretory system, conjugal DNA-protein transfer
