{
  "machine": {
    "blank": " ",
    "start state": "right",
    "final states": [
      "done"
    ],
    "table": {
      "right": {
        "0": "R",
        "1": "R",
        "+": "R",
        " ": {
          "L": "read"
        }
      },
      "read": {
        "0": {
          "write": "c",
          "L": "have0"
        },
        "1": {
          "write": "c",
          "L": "have1"
        },
        "+": {
          "write": " ",
          "L": "rewrite"
        }
      },
      "have0": {
        "0": "L",
        "1": "L",
        "+": {
          "L": "add0"
        }
      },
      "have1": {
        "0": "L",
        "1": "L",
        "+": {
          "L": "add1"
        }
      },
      "add0": {
        "0": {
          "write": "O",
          "R": "back0"
        },
        " ": {
          "write": "O",
          "R": "back0"
        },
        "1": {
          "write": "I",
          "R": "back0"
        },
        "O": "L",
        "I": "L"
      },
      "add1": {
        "0": {
          "write": "I",
          "R": "back1"
        },
        " ": {
          "write": "I",
          "R": "back1"
        },
        "1": {
          "write": "O",
          "L": "carry"
        },
        "O": "L",
        "I": "L"
      },
      "carry": {
        "0": {
          "write": "1",
          "R": "back1"
        },
        " ": {
          "write": "1",
          "R": "back1"
        },
        "1": {
          "write": "0",
          "L": "carry"
        }
      },
      "back0": {
        "0": "R",
        "1": "R",
        "O": "R",
        "I": "R",
        "+": "R",
        "c": {
          "write": "0",
          "L": "read"
        }
      },
      "back1": {
        "0": "R",
        "1": "R",
        "O": "R",
        "I": "R",
        "+": "R",
        "c": {
          "write": "1",
          "L": "read"
        }
      },
      "rewrite": {
        "O": {
          "write": "0",
          "L": "rewrite"
        },
        "I": {
          "write": "1",
          "L": "rewrite"
        },
        "0": "L",
        "1": "L",
        " ": {
          "R": "done"
        }
      },
      "done": {}
    }
  },
  "input": "11+1",
  "output": "100 1",
  "execution_history": [
    {
      "state": "right",
      "read": "1",
      "position": 0,
      "memory": "11+1",
      "direction": "R"
    },
    {
      "state": "right",
      "read": "1",
      "position": 1,
      "memory": "11+1",
      "direction": "R"
    },
    {
      "state": "right",
      "read": "+",
      "position": 2,
      "memory": "11+1",
      "direction": "R"
    },
    {
      "state": "right",
      "read": "1",
      "position": 3,
      "memory": "11+1",
      "direction": "R"
    },
    {
      "state": "right",
      "read": " ",
      "position": 4,
      "memory": "11+1 ",
      "direction": {
        "L": "read"
      }
    },
    {
      "state": "read",
      "read": "1",
      "position": 3,
      "memory": "11+1 ",
      "direction": {
        "write": "c",
        "L": "have1"
      }
    },
    {
      "state": "have1",
      "read": "+",
      "position": 2,
      "memory": "11+c ",
      "direction": {
        "L": "add1"
      }
    },
    {
      "state": "add1",
      "read": "1",
      "position": 1,
      "memory": "11+c ",
      "direction": {
        "write": "O",
        "L": "carry"
      }
    },
    {
      "state": "carry",
      "read": "1",
      "position": 0,
      "memory": "1O+c ",
      "direction": {
        "write": "0",
        "L": "carry"
      }
    },
    {
      "state": "carry",
      "read": " ",
      "position": 0,
      "memory": " 0O+c ",
      "direction": {
        "write": "1",
        "R": "back1"
      }
    },
    {
      "state": "back1",
      "read": "0",
      "position": 1,
      "memory": "10O+c ",
      "direction": "R"
    },
    {
      "state": "back1",
      "read": "O",
      "position": 2,
      "memory": "10O+c ",
      "direction": "R"
    },
    {
      "state": "back1",
      "read": "+",
      "position": 3,
      "memory": "10O+c ",
      "direction": "R"
    },
    {
      "state": "back1",
      "read": "c",
      "position": 4,
      "memory": "10O+c ",
      "direction": {
        "write": "1",
        "L": "read"
      }
    },
    {
      "state": "read",
      "read": "+",
      "position": 3,
      "memory": "10O+1 ",
      "direction": {
        "write": " ",
        "L": "rewrite"
      }
    },
    {
      "state": "rewrite",
      "read": "O",
      "position": 2,
      "memory": "10O 1 ",
      "direction": {
        "write": "0",
        "L": "rewrite"
      }
    },
    {
      "state": "rewrite",
      "read": "0",
      "position": 1,
      "memory": "100 1 ",
      "direction": "L"
    },
    {
      "state": "rewrite",
      "read": "1",
      "position": 0,
      "memory": "100 1 ",
      "direction": "L"
    },
    {
      "state": "rewrite",
      "read": " ",
      "position": 0,
      "memory": " 100 1 ",
      "direction": {
        "R": "done"
      }
    }
  ]
}
