@startuml

!include <C4/C4_Context>
!include <C4/C4_Container>
!include <C4/C4_Component>


LAYOUT_WITH_LEGEND()

title AAAAb Abbbbbbb Cddddddddd Deeeeeeee Fgggggg
AddSystemTag("ddddd", $legendText = "DDDDD Hiiiii")

System_Boundary(aa, "Abbb Cddddddddd"){
    Container_Boundary(yyyyy, "ZZZ Tttt Cddddddddd"){
        Component(iii_iiiiii, "ZZZ Ssssss", "neen", "ZZZ lllllll nnnnnnnnn neen")
        Component(iii_iiiiiiii, "ZZZ iiiiiiii", "neen", "ZZZ iiiiiiii ger lllllll mmmm")
    }
    Container(rrrrrr, "rrrrrr", "dddddd/RRRR", "Hhhh Rrrrrrrrrr Llllllll sssssss")

    Container_Boundary(cccc, "AAAAb cccc"){
        Component(pppppp, "AAAAb pppppp", "neen", "nnnnnnnnn tt the AAAAb qqqqq vvvvvv")
        Component(mmmmmmm, "mmmmmmm", "neen", "RRR tt AA EEE Ppppppp nnnnnnnnn")
        Component(lllllll, "lllllll", "neen", "ttt lllll lllllll lllll pppppppppp")
        Component(gggggggg, "gggggggg & ppppppppppp", "neen", "gggggggg, ppppppppppp and Oooooooooo ddddddd")
        Component(hhhhhh, "hhhhhh", "neen", "Hiiiii hhhhhh mmmmmmmmmm and rrrrrrrrr")
    }
    Container_Boundary(lllll_pppppppppp, "LlLLLL/Ccccccc ddddddddd"){
      Component(vvvvv, "vvvvv Dddddd", "neen")
      Component(ooo_o, "OOO-O Dddddd", "neen")
      Component(ttttttttt, "Sssssss tttttttttt", "neen")
      Component(aaaaaaaa, "aaaaaaaa neen", "neen")
      Component(lllll_dddddddddd, "LLLLL Dddddd", "neen", "Wwwwwww ger Mmmmmmm LlLLLL dddddddddd")
      Component(eeeeeee, "eeeeeee", "ccccccccc neen", "cvvvvvvv iiiii into mmmmm cccccccccc iiiiii")
      Component(iiiiiiiii_eeeeee, "Iiiiiiiii Eeeeee", "ccccccccc neen", "run mmmmm")
      Component(ddddddd, "ddddddd", "neen", "mmmmm output tt ttttt llll")
      Component(ffffff, "ffffff neen", "neen", "Ccccccc bbbb ttttt lllll")
      Rel(vvvvv, lllll_dddddddddd, "ppppppppppp")
      Rel(ttttttttt, lllll_dddddddddd, "tttttttttt")
      Rel(lllll_dddddddddd, ffffff, "LlLLLL ddddddddd list")
      Rel(ooo_o, eeeeeee, "iiiiiii")
      Rel(eeeeeee, iiiiiiiii_eeeeee, "mmmmm iiiiii", "Zzzz Cccc nnnnnnnnn")
      Rel(iiiiiiiii_eeeeee, ddddddd, "mmmmm otttttt")
      Rel(ddddddd, ffffff, "MM ddddddddd list")
      Rel(ffffff, aaaaaaaa, "bbbb", "Tttt ii oooooo rrrrrrrrrr a ssss")
     }

     Container(ccc_bbbbbb, "EEE Bbbbbbb", "dddddd/RRRR", "EEE tttttttttttt oo ppppppp mmmmmmmmmm tt kkkkk mmmmmmmmmm")
    iii_iiiiiiii .-> lllllll
    iii_iiiiii .-> iii_iiiiiiii
    iii_iiiiii .-> rrrrrr
    hhhhhh <-. pppppp
    pppppp .-> lllllll
    lllllll .-> mmmmmmm
    lllllll .-> gggggggg
    lllllll .-> rrrrrr
    Rel(aaaaaaaa, mmmmmmm, "ssssss ssssss")
    Rel(mmmmmmm, lllll_dddddddddd, "tttttttttt")
    mmmmmmm <-. ccc_bbbbbb
}

System_Ext(ggggggg, "Aaaaaa"){
    Component(ggggggg_ii, "Gggggggg I/I", "neen", "I/I nnnnnnnnn tt the HHH-HHH sssssss")
    Component(hhh_hhh, "HHH-HHH", "sssssss", "Hhhhhhhh ger pppppppp ssssssss cccccccccccccc")
    Component(wwww, "Cccccccc", "mmmmm", "Cccccccc nnnnnnnnn tt kkkkk")
}

mmmmmmm .-> ggggggg_ii
hhhhhh .-> ggggggg_ii
pppppp .-> ggggggg_ii
ggggggg_ii <-. kna_hal
rrrrrr .-> wwww
pppppp .-> wwww


System_Ext(kkkkk, "kkkkk qqqqq")
kkkkk <-. wwww

rrrrrr -[hidden]-> kkkkk

SHOW_LEGEND()

@enduml
