<svg width="19" height="18" viewBox="0 0 19 18" fill="none" xmlns="http://www.w3.org/2000/svg">
<g id="cash">
<path id="Vector" d="M4.6593 7.50606H6.05849L12.054 4.04307C12.0939 4.01994 12.138 4.00494 12.1838 3.99893C12.2295 3.99292 12.276 3.99602 12.3206 4.00805C12.3651 4.02008 12.4068 4.0408 12.4433 4.06902C12.4798 4.09725 12.5104 4.13241 12.5332 4.17249C12.6021 4.29199 12.6938 4.39673 12.8032 4.48075C12.9125 4.56477 13.0374 4.62641 13.1706 4.66214C13.3038 4.69788 13.4427 4.70701 13.5794 4.68901C13.7161 4.67102 13.848 4.62625 13.9674 4.55727C14.0073 4.53414 14.0514 4.51914 14.0972 4.51313C14.1429 4.50712 14.1894 4.51022 14.2339 4.52225C14.2785 4.53428 14.3202 4.555 14.3567 4.58323C14.3932 4.61145 14.4238 4.64661 14.4466 4.6867L16.0697 7.50606H16.8742L14.3417 3.12311C14.2021 2.88332 13.9732 2.70859 13.705 2.63714C13.4369 2.56569 13.1514 2.60333 12.911 2.74183L4.6593 7.50606Z" fill="#E2012D"/>
<path id="Vector_2" d="M12.1274 4.80914L7.45764 7.50608H15.2581C15.2931 7.50608 15.2581 7.50608 13.9918 5.30935C13.6663 5.41813 13.3159 5.4287 12.9844 5.33976C12.6528 5.25081 12.3548 5.06627 12.1274 4.80914Z" fill="#E2012D"/>
<path id="Vector_3" d="M5.98152 2.10172C6.00437 2.06164 6.03493 2.02647 6.07143 1.99825C6.10793 1.97003 6.14965 1.94931 6.19419 1.93728C6.23874 1.92525 6.28522 1.92215 6.33097 1.92816C6.37671 1.93417 6.42082 1.94917 6.46074 1.9723C6.5803 2.04183 6.71243 2.08703 6.84953 2.10532C6.98662 2.12361 7.12598 2.11461 7.25958 2.07885C7.39319 2.0431 7.51841 1.98128 7.62804 1.89696C7.73767 1.81264 7.82956 1.70748 7.89841 1.58752C7.94455 1.50751 8.02047 1.449 8.10959 1.42475C8.19871 1.40051 8.29381 1.41249 8.37413 1.4581L11.0501 3.0077C11.0886 3.0077 10.9311 3.07765 11.7497 2.60193C7.07988 -0.0915035 7.26877 -0.0950014 6.71259 0.0484153C6.15642 0.191832 6.3628 0.0484156 2.0498 7.50608H2.85784L5.98152 2.10172Z" fill="#E2012D"/>
<path id="Vector_4" d="M6.43279 2.72435L3.87927 7.15627L10.354 3.40995L8.2972 2.22064C8.07022 2.47838 7.77238 2.66359 7.44082 2.75316C7.10927 2.84274 6.75868 2.83272 6.43279 2.72435Z" fill="#E2012D"/>
<path id="Vector_5" d="M17.4199 8.24768C17.3534 8.18122 14.5725 8.2057 1.04939 8.2057C0.771075 8.2057 0.504158 8.31626 0.307359 8.51306C0.11056 8.70986 0 8.97678 0 9.25509V16.9506C0 17.2289 0.11056 17.4958 0.307359 17.6926C0.504158 17.8894 0.771075 18 1.04939 18H17.14C17.4184 18 17.6853 17.8894 17.8821 17.6926C18.0789 17.4958 18.1894 17.2289 18.1894 16.9506V9.25509C18.1886 9.02623 18.1129 8.80392 17.974 8.62205C17.835 8.44017 17.6405 8.30871 17.4199 8.24768ZM17.4898 15.5514C17.4898 15.6442 17.453 15.7332 17.3874 15.7988C17.3218 15.8644 17.2328 15.9012 17.14 15.9012C16.8617 15.9012 16.5948 16.0118 16.398 16.2086C16.2012 16.4054 16.0907 16.6723 16.0907 16.9506C16.0907 17.0434 16.0538 17.1324 15.9882 17.198C15.9226 17.2636 15.8336 17.3004 15.7409 17.3004H2.44858C2.35581 17.3004 2.26683 17.2636 2.20123 17.198C2.13563 17.1324 2.09878 17.0434 2.09878 16.9506C2.09878 16.6723 1.98822 16.4054 1.79142 16.2086C1.59462 16.0118 1.32771 15.9012 1.04939 15.9012C0.956618 15.9012 0.867646 15.8644 0.802047 15.7988C0.736447 15.7332 0.699593 15.6442 0.699593 15.5514V10.6543C0.699593 10.5615 0.736447 10.4725 0.802047 10.4069C0.867646 10.3413 0.956618 10.3045 1.04939 10.3045C1.32771 10.3045 1.59462 10.1939 1.79142 9.99712C1.98822 9.80032 2.09878 9.53341 2.09878 9.25509C2.09878 9.16232 2.13563 9.07335 2.20123 9.00775C2.26683 8.94215 2.35581 8.90529 2.44858 8.90529H15.7409C15.8336 8.90529 15.9226 8.94215 15.9882 9.00775C16.0538 9.07335 16.0907 9.16232 16.0907 9.25509C16.0907 9.53341 16.2012 9.80032 16.398 9.99712C16.5948 10.1939 16.8617 10.3045 17.14 10.3045C17.2328 10.3045 17.3218 10.3413 17.3874 10.4069C17.453 10.4725 17.4898 10.5615 17.4898 10.6543V15.5514Z" fill="#E2012D"/>
<path id="Vector_6" d="M15.426 9.60492H2.76338C2.69483 9.94104 2.52895 10.2496 2.28639 10.4921C2.04383 10.7347 1.73529 10.9006 1.39917 10.9691V15.2366C1.73529 15.3052 2.04383 15.4711 2.28639 15.7136C2.52895 15.9562 2.69483 16.2647 2.76338 16.6009H15.426C15.4946 16.2647 15.6604 15.9562 15.903 15.7136C16.1456 15.4711 16.4541 15.3052 16.7902 15.2366V10.9691C16.4541 10.9006 16.1456 10.7347 15.903 10.4921C15.6604 10.2496 15.4946 9.94104 15.426 9.60492ZM9.0947 15.9013C7.74448 15.9013 6.64612 14.6455 6.64612 13.1029C6.64612 11.5603 7.74448 10.3045 9.0947 10.3045C10.4449 10.3045 11.5433 11.5603 11.5433 13.1029C11.5433 14.6455 10.4449 15.9013 9.0947 15.9013Z" fill="#E2012D"/>
<path id="Vector_7" d="M9.09481 15.2016C10.0607 15.2016 10.8438 14.2619 10.8438 13.1028C10.8438 11.9437 10.0607 11.004 9.09481 11.004C8.12887 11.004 7.34583 11.9437 7.34583 13.1028C7.34583 14.2619 8.12887 15.2016 9.09481 15.2016Z" fill="#E2012D"/>
</g>
</svg>
