<svg width="22" height="19" viewBox="0 0 22 19" fill="none" xmlns="http://www.w3.org/2000/svg">
<g id="Group">
<g id="Group_2">
<path id="Vector" d="M20.5012 2.78487L7.44679 0.022194C6.89448 -0.094656 6.34704 0.261676 6.23019 0.813988L5.98218 2.40781L21.0447 5.59529L21.2928 4.00147C21.4096 3.44936 21.0535 2.90175 20.5012 2.78487Z" fill="#E2012D"/>
<path id="Vector_2" d="M15.0115 5.93328C14.859 5.38417 14.2851 5.0596 13.7362 5.21184L11.258 5.89981L5.41579 4.66339L4.77327 7.69923L0.758784 8.81346C0.209885 8.96573 -0.114683 9.53957 0.0375533 10.0885L2.29995 18.2411C2.45243 18.79 3.0263 19.1148 3.5752 18.9623L16.5526 15.361C17.1015 15.2085 17.4261 14.6349 17.2738 14.0857L16.8855 12.6862L18.341 12.9939C18.8933 13.1109 19.4407 12.7546 19.5576 12.2023L20.4784 7.8509L15.2358 6.74151L15.0115 5.93328ZM16.5102 10.0768L16.8311 8.55991C16.8793 8.33279 17.1045 8.1863 17.3316 8.23426L18.8484 8.55542C19.0758 8.60362 19.2223 8.82858 19.1743 9.0559L18.8534 10.5728C18.8052 10.7999 18.58 10.9466 18.3529 10.8984L16.836 10.5775C16.6085 10.5291 16.462 10.3039 16.5102 10.0768ZM0.984613 9.62702L4.57596 8.63072L13.0497 6.27919L13.9616 6.02585C13.9782 6.02136 13.9948 6.01923 14.0111 6.01923C14.0842 6.01923 14.1717 6.06723 14.1972 6.15914L14.3043 6.54469L14.6397 7.75338L1.29382 11.4569L0.851324 9.86288C0.8236 9.76286 0.88462 9.65475 0.984613 9.62702ZM16.46 14.3113C16.4771 14.3732 16.4592 14.4243 16.4411 14.4563C16.4232 14.4883 16.3886 14.5301 16.3268 14.5472L3.34958 18.1485C3.33318 18.153 3.31632 18.1554 3.30009 18.1554C3.22695 18.1554 3.13949 18.1072 3.11393 18.0153L1.79434 13.26L15.1402 9.55622L15.9542 12.4891L16.46 14.3113Z" fill="#E2012D"/>
<path id="Vector_3" d="M5.44641 14.6367C5.38414 14.4128 5.15041 14.2806 4.92649 14.3426L3.41092 14.7634C3.18722 14.8254 3.0548 15.0594 3.11708 15.2833L3.5376 16.7987C3.59987 17.0226 3.8336 17.1548 4.05752 17.0925L5.57309 16.672C5.797 16.6099 5.92921 16.376 5.86714 16.1521L5.44641 14.6367Z" fill="#E2012D"/>
</g>
</g>
</svg>
