[
  {
    "name": "this_mongodb_sharding_instance_mongo_list",
    "description": "The mongo-node count can be purchased. "
  },
  {
    "name": "this_alarm_rule_cpu_utilization_status",
    "description": "The current alarm cpu utilization rule status. "
  },
  {
    "name": "this_alarm_rule_disk_utilization_status",
    "description": "The current alarm disk utilization rule status. "
  },
  {
    "name": "this_mongodb_sharding_instance_period",
    "description": "The duration that you will buy MongoDB sharding instance. "
  },
  {
    "name": "this_mongodb_sharding_instance_vswitch_id",
    "description": "The virtual switch ID to launch MongoDB sharding instances in one VPC. "
  },
  {
    "name": "this_mongodb_sharding_instance_security_ip_list",
    "description": "IP whitelist of MongoDB sharding instances. "
  },
  {
    "name": "this_alarm_rule_effective_interval",
    "description": "The interval of effecting alarm rule. "
  },
  {
    "name": "this_alarm_rule_id",
    "description": "The ID of the alarm rule. "
  },
  {
    "name": "this_alarm_rule_period",
    "description": "Index query cycle. "
  },
  {
    "name": "this_alarm_rule_operator",
    "description": "Alarm comparison operator. "
  },
  {
    "name": "this_mongodb_sharding_instance_charge_type",
    "description": "The billing method of the MongoDB sharding instance. "
  },
  {
    "name": "this_alarm_rule_silence_time",
    "description": " Notification silence period in the alarm state. "
  },
  {
    "name": "this_alarm_rule_project",
    "description": "Monitor project name. "
  },
  {
    "name": "this_alarm_rule_notify_type",
    "description": "Notification type. "
  },
  {
    "name": "this_alarm_rule_name",
    "description": "The alarm name. "
  },
  {
    "name": "this_mongodb_sharding_instance_backup_time",
    "description": "MongoDB sharding instance backup time. "
  },
  {
    "name": "this_alarm_rule_metric",
    "description": "Name of the monitoring metrics. "
  },
  {
    "name": "this_alarm_rule_triggered_count",
    "description": "Number of trigger alarm. "
  },
  {
    "name": "this_alarm_rule_enabled",
    "description": "Whether to enable alarm rule. "
  },
  {
    "name": "this_alarm_rule_webhook",
    "description": "The webhook that is called when the alarm is triggered. "
  },
  {
    "name": "this_mongodb_sharding_instance_engine_version",
    "description": "The engine version of the MongoDB sharding instance. "
  },
  {
    "name": "this_mongodb_sharding_instance_zone_id",
    "description": "The Zone to launch the MongoDB sharding instance. "
  },
  {
    "name": "this_mongodb_sharding_instance_shard_list",
    "description": "MongoDB sharding Instance backup period. "
  },
  {
    "name": "this_alarm_rule_intranet_in_status",
    "description": "The current alarm intranet in rule status. "
  },
  {
    "name": "this_mongodb_sharding_instance_id",
    "description": "The ID of the MongoDB sharding instance. "
  },
  {
    "name": "this_alarm_rule_statistics",
    "description": "Statistical method. "
  },
  {
    "name": "this_alarm_rule_contact_groups",
    "description": "List contact groups of the alarm rule. "
  },
  {
    "name": "this_alarm_rule_memory_utilization_status",
    "description": "The current alarm memory utilization rule status. "
  },
  {
    "name": "this_mongodb_sharding_instance_backup_period",
    "description": "MongoDB sharding instance backup time. "
  },
  {
    "name": "this_alarm_rule_dimensions",
    "description": "Map of the resources associated with the alarm rule. "
  },
  {
    "name": "this_mongodb_sharding_instance_storage_engine",
    "description": "The storage engine used by the MongoDB sharding instance. "
  },
  {
    "name": "this_alarm_rule_threshold",
    "description": "Alarm threshold value."
  },
  {
    "name": "this_alarm_rule_intranet_out_status",
    "description": "The current alarm intranet out rule status. "
  },
  {
    "name": "this_mongodb_sharding_instance_name",
    "description": "The name of MongoDB sharding instance. "
  }
]
