[
  {
    "name": "external_key_expiration_model",
    "description": "Whether the key material expires. Empty when pending key material import, otherwise `KEY_MATERIAL_EXPIRES` or `KEY_MATERIAL_DOES_NOT_EXPIRE`"
  },
  {
    "name": "external_key_state",
    "description": "The state of the CMK"
  },
  {
    "name": "external_key_usage",
    "description": "The cryptographic operations for which you can use the CMK"
  },
  {
    "name": "aliases",
    "description": "A map of aliases created and their attributes"
  },
  {
    "name": "grants",
    "description": "A map of grants created and their attributes"
  },
  {
    "name": "key_arn",
    "description": "The Amazon Resource Name (ARN) of the key"
  },
  {
    "name": "key_id",
    "description": "The globally unique identifier for the key"
  },
  {
    "name": "key_policy",
    "description": "The IAM resource policy set on the key"
  }
]
