[
  {
    "name": "api_name",
    "type": "string",
    "description": "",
    "default": "\"TerraformApiGatewayApi\"",
    "required": false
  },
  {
    "name": "api_request_config",
    "type": "list(object({\n    protocol = string\n    method   = string\n    path     = string\n    mode     = string\n  }))",
    "description": "",
    "default": "[\n  {\n    \"method\": \"GET\",\n    \"mode\": \"MAPPING\",\n    \"path\": \"/test/path1\",\n    \"protocol\": \"HTTP\"\n  }\n]",
    "required": false
  },
  {
    "name": "api_group_description",
    "type": "string",
    "description": "The name of a api group.",
    "default": "\"Module of APi gateway Group\"",
    "required": false
  },
  {
    "name": "api_description",
    "type": "string",
    "description": "",
    "default": "\"description\"",
    "required": false
  },
  {
    "name": "api_auth_type",
    "type": "string",
    "description": "",
    "default": "\"APP\"",
    "required": false
  },
  {
    "name": "api_service_type",
    "type": "string",
    "description": "",
    "default": "\"HTTP\"",
    "required": false
  },
  {
    "name": "api_http_service_config",
    "type": "list(object({\n    address   = string\n    method    = string\n    path      = string\n    timeout   = number\n    aone_name = string\n  }))",
    "description": "",
    "default": "[\n  {\n    \"address\": \"http://apigateway-backend.alicloudapi.com:8080\",\n    \"aone_name\": \"cloudapi-openapi\",\n    \"method\": \"GET\",\n    \"path\": \"/web/cloudapi\",\n    \"timeout\": 12\n  }\n]",
    "required": false
  },
  {
    "name": "api_request_parameters",
    "type": "list(object({\n    name         = string\n    type         = string\n    required     = string\n    in           = string\n    in_service   = string\n    name_service = string\n  }))",
    "description": "",
    "default": "[\n  {\n    \"in\": \"QUERY\",\n    \"in_service\": \"QUERY\",\n    \"name\": \"test\",\n    \"name_service\": \"testparams\",\n    \"required\": \"REQUIRED\",\n    \"type\": \"STRING\"\n  }\n]",
    "required": false
  },
  {
    "name": "region",
    "type": "string",
    "description": "(Deprecated from version 1.2.0) The region used to launch this module resources.",
    "default": "\"\"",
    "required": false
  },
  {
    "name": "api_group_name",
    "type": "string",
    "description": "",
    "default": "\"TerraformApiGatewayGroup\"",
    "required": false
  },
  {
    "name": "api_stage_name",
    "type": "list(string)",
    "description": "",
    "default": "[\n  \"RELEASE\",\n  \"PRE\",\n  \"TEST\"\n]",
    "required": false
  }
]
