[
  {
    "name": "create_cmd_bin",
    "description": "The full bin path & command used on create"
  },
  {
    "name": "destroy_cmd_bin",
    "description": "The full bin path & command used on destroy"
  },
  {
    "name": "bin_dir",
    "description": "The full bin path of the modules executables"
  },
  {
    "name": "wait",
    "description": "An output to use when you want to depend on cmd finishing"
  },
  {
    "name": "downloaded",
    "description": "Whether gcloud was downloaded or not"
  }
]
