[
  {
    "name": "firewall_rule_allow_inbound_api_url",
    "description": ""
  },
  {
    "name": "firewall_rule_allow_inbound_health_check_url",
    "description": ""
  },
  {
    "name": "bucket_name_id",
    "description": ""
  },
  {
    "name": "gcp_project_id",
    "description": ""
  },
  {
    "name": "vault_cluster_size",
    "description": ""
  },
  {
    "name": "instance_group_id",
    "description": ""
  },
  {
    "name": "instance_template_url",
    "description": ""
  },
  {
    "name": "firewall_rule_allow_intracluster_vault_id",
    "description": ""
  },
  {
    "name": "firewall_rule_allow_inbound_api_id",
    "description": ""
  },
  {
    "name": "firewall_rule_allow_intracluster_vault_url",
    "description": ""
  },
  {
    "name": "firewall_rule_allow_inbound_health_check_id",
    "description": ""
  },
  {
    "name": "bucket_name_url",
    "description": ""
  },
  {
    "name": "cluster_tag_name",
    "description": ""
  },
  {
    "name": "instance_group_name",
    "description": ""
  },
  {
    "name": "instance_group_url",
    "description": ""
  }
]
