[
  {
    "name": "this_polardb_cluster_id",
    "description": ""
  },
  {
    "name": "this_polardb_database_id",
    "description": ""
  },
  {
    "name": "this_ecs_name",
    "description": ""
  },
  {
    "name": "this_ecs_id",
    "description": ""
  },
  {
    "name": "this_redis_id",
    "description": ""
  },
  {
    "name": "this_mongodb_id",
    "description": ""
  }
]
