[
  {
    "name": "vpc_privatelink_endpoint_service_description",
    "type": "string",
    "description": "The description of the VPC privatelink service.",
    "default": "\"tf-testAccVpcPrivatelinkServiceDescription\"",
    "required": false
  },
  {
    "name": "vpc_privatelink_endpoint_name",
    "type": "string",
    "description": "The name of the VPC privatelink.",
    "default": "\"tf-testAccVpcPrivatelinkName\"",
    "required": false
  },
  {
    "name": "vpc_privatelink_bandwidth",
    "type": "string",
    "description": "The bandwidth of VPC privatelink.",
    "default": "\"1024\"",
    "required": false
  },
  {
    "name": "vpc_security_group_name",
    "type": "string",
    "description": "The security group name of the VPC.",
    "default": "\"tf-testAccVpcSecurityGroupName\"",
    "required": false
  },
  {
    "name": "vpc_security_group_description",
    "type": "string",
    "description": "The security group description of the VPC.",
    "default": "\"tf-testAccVpcSecurityGroupDescription\"",
    "required": false
  },
  {
    "name": "vpc_name",
    "type": "string",
    "description": "The name of the VPC.",
    "default": "\"tf-testAccVpcName\"",
    "required": false
  },
  {
    "name": "vpc_cidr_block",
    "type": "string",
    "description": "The secondary CIDR blocks for the VPC.",
    "default": "\"172.16.0.0/12\"",
    "required": false
  }
]
