[
  {
    "name": "names",
    "type": "list(string)",
    "description": "Folder names.",
    "default": "[]",
    "required": false
  },
  {
    "name": "set_roles",
    "type": "bool",
    "description": "Enable setting roles via the folder admin variables.",
    "default": "false",
    "required": false
  },
  {
    "name": "per_folder_admins",
    "type": "map(object({\n    members = list(string)\n    roles   = optional(list(string))\n  }))",
    "description": "IAM-style roles per members per folder who will get extended permissions. If roles are not provided for a folder/member combination, the list provided as `folder_admin_roles` will be applied as default.",
    "default": "{}",
    "required": false
  },
  {
    "name": "all_folder_admins",
    "type": "list(string)",
    "description": "List of IAM-style members that will get the extended permissions across all the folders.",
    "default": "[]",
    "required": false
  },
  {
    "name": "prefix",
    "type": "string",
    "description": "Optional prefix to enforce uniqueness of folder names.",
    "default": "\"\"",
    "required": false
  },
  {
    "name": "folder_admin_roles",
    "type": "list(string)",
    "description": "List of roles that will be applied to a folder if roles are not explictly specified in per_folder_admins",
    "default": "[\n  \"roles/owner\",\n  \"roles/resourcemanager.folderViewer\",\n  \"roles/resourcemanager.projectCreator\",\n  \"roles/compute.networkAdmin\"\n]",
    "required": false
  },
  {
    "name": "parent",
    "type": "string",
    "description": "The resource name of the parent Folder or Organization. Must be of the form folders/folder_id or organizations/org_id",
    "default": "",
    "required": true
  }
]
