[
  {
    "name": "security_group_id_clients",
    "description": ""
  },
  {
    "name": "aws_region",
    "description": ""
  },
  {
    "name": "num_servers",
    "description": ""
  },
  {
    "name": "asg_name_servers",
    "description": ""
  },
  {
    "name": "launch_config_name_servers",
    "description": ""
  },
  {
    "name": "iam_role_id_servers",
    "description": ""
  },
  {
    "name": "num_clients",
    "description": ""
  },
  {
    "name": "asg_name_clients",
    "description": ""
  },
  {
    "name": "launch_config_name_clients",
    "description": ""
  },
  {
    "name": "iam_role_arn_servers",
    "description": ""
  },
  {
    "name": "security_group_id_servers",
    "description": ""
  },
  {
    "name": "iam_role_id_clients",
    "description": ""
  },
  {
    "name": "iam_role_arn_clients",
    "description": ""
  },
  {
    "name": "consul_servers_cluster_tag_key",
    "description": ""
  },
  {
    "name": "consul_servers_cluster_tag_value",
    "description": ""
  }
]
