[
  {
    "name": "enable_telemetry",
    "type": "bool",
    "description": "This variable controls whether or not telemetry is enabled for the module.\nFor more information see https://aka.ms/avm/telemetry.\nIf it is set to false, then no telemetry will be collected.\n",
    "default": "true",
    "required": false
  },
  {
    "name": "peerings",
    "type": "map(object({\n    name                                 = string\n    remote_virtual_network_resource_id   = string\n    allow_forwarded_traffic              = optional(bool, false)\n    allow_gateway_transit                = optional(bool, false)\n    allow_virtual_network_access         = optional(bool, true)\n    use_remote_gateways                  = optional(bool, false)\n    create_reverse_peering               = optional(bool, false)\n    reverse_name                         = optional(string)\n    reverse_allow_forwarded_traffic      = optional(bool, false)\n    reverse_allow_gateway_transit        = optional(bool, false)\n    reverse_allow_virtual_network_access = optional(bool, true)\n    reverse_use_remote_gateways          = optional(bool, false)\n  }))",
    "description": "(Optional) A map of virtual network peering configurations. Each entry specifies a remote virtual network by ID and includes settings for traffic forwarding, gateway transit, and remote gateways usage.\n\n- `name`: The name of the virtual network peering configuration.\n- `remote_virtual_network_resource_id`: The resource ID of the remote virtual network.\n- `allow_forwarded_traffic`: (Optional) Enables forwarded traffic between the virtual networks. Defaults to false.\n- `allow_gateway_transit`: (Optional) Enables gateway transit for the virtual networks. Defaults to false.\n- `allow_virtual_network_access`: (Optional) Enables access from the local virtual network to the remote virtual network. Defaults to true.\n- `use_remote_gateways`: (Optional) Enables the use of remote gateways for the virtual networks. Defaults to false.\n- `create_reverse_peering`: (Optional) Creates the reverse peering to form a complete peering.\n- `reverse_name`: (Optional) If you have selected `create_reverse_peering`, then this name will be used for the reverse peer.\n- `reverse_allow_forwarded_traffic`: (Optional) If you have selected `create_reverse_peering`, enables forwarded traffic between the virtual networks. Defaults to false.\n- `reverse_allow_gateway_transit`: (Optional) If you have selected `create_reverse_peering`, enables gateway transit for the virtual networks. Defaults to false.\n- `reverse_allow_virtual_network_access`: (Optional) If you have selected `create_reverse_peering`, enables access from the local virtual network to the remote virtual network. Defaults to true.\n- `reverse_use_remote_gateways`: (Optional) If you have selected `create_reverse_peering`, enables the use of remote gateways for the virtual networks. Defaults to false.\n\n",
    "default": "{}",
    "required": false
  },
  {
    "name": "role_assignments",
    "type": "map(object({\n    role_definition_id_or_name             = string\n    principal_id                           = string\n    description                            = optional(string, null)\n    skip_service_principal_aad_check       = optional(bool, false)\n    condition                              = optional(string, null)\n    condition_version                      = optional(string, null)\n    delegated_managed_identity_resource_id = optional(string, null)\n    principal_type                         = optional(string, null)\n  }))",
    "description": "  (Optional) A map of role assignments to create on the <RESOURCE>. The map key is deliberately arbitrary to avoid issues where map keys maybe unknown at plan time.\n  \n  - `role_definition_id_or_name` - The ID or name of the role definition to assign to the principal.\n  - `principal_id` - The ID of the principal to assign the role to.\n  - `description` - (Optional) The description of the role assignment.\n  - `skip_service_principal_aad_check` - (Optional) If set to true, skips the Azure Active Directory check for the service principal in the tenant. Defaults to false.\n  - `condition` - (Optional) The condition which will be used to scope the role assignment.\n  - `condition_version` - (Optional) The version of the condition syntax. Leave as `null` if you are not using a condition, if you are then valid values are '2.0'.\n  - `delegated_managed_identity_resource_id` - (Optional) The delegated Azure Resource Id which contains a Managed Identity. Changing this forces a new resource to be created. This field is only used in cross-tenant scenario.\n  - `principal_type` - (Optional) The type of the `principal_id`. Possible values are `User`, `Group` and `ServicePrincipal`. It is necessary to explicitly set this attribute when creating role assignments if the principal creating the assignment is constrained by ABAC rules that filters on the PrincipalType attribute.\n  \n  > Note: only set `skip_service_principal_aad_check` to true if you are assigning a role to a service principal.\n",
    "default": "{}",
    "required": false
  },
  {
    "name": "address_space",
    "type": "set(string)",
    "description": "(Optional) The address spaces applied to the virtual network. You can supply more than one address space.",
    "default": "",
    "required": true
  },
  {
    "name": "location",
    "type": "string",
    "description": "(Optional) The location/region where the virtual network is created. Changing this forces a new resource to be created. \n",
    "default": "",
    "required": true
  },
  {
    "name": "resource_group_name",
    "type": "string",
    "description": "(Required) The name of the resource group where the resources will be deployed. \n",
    "default": "",
    "required": true
  },
  {
    "name": "dns_servers",
    "type": "object({\n    dns_servers = set(string)\n  })",
    "description": "(Optional) Specifies a list of IP addresses representing DNS servers.\n\n- `dns_servers`: Set of IP addresses of DNS servers.\n",
    "default": "null",
    "required": false
  },
  {
    "name": "subnets",
    "type": "map(object({\n    address_prefixes = list(string)\n    name             = string\n    nat_gateway = optional(object({\n      id = string\n    }))\n    network_security_group = optional(object({\n      id = string\n    }))\n    private_endpoint_network_policies             = optional(string, \"Enabled\")\n    private_link_service_network_policies_enabled = optional(bool, true)\n    route_table = optional(object({\n      id = string\n    }))\n    service_endpoint_policies = optional(map(object({\n      id = string\n    })))\n    service_endpoints               = optional(set(string))\n    default_outbound_access_enabled = optional(bool, false)\n    delegation = optional(list(object({\n      name = string\n      service_delegation = object({\n        name = string\n      })\n    })))\n    timeouts = optional(object({\n      create = optional(string)\n      delete = optional(string)\n      read   = optional(string)\n      update = optional(string)\n    }))\n    role_assignments = optional(map(object({\n      role_definition_id_or_name             = string\n      principal_id                           = string\n      description                            = optional(string, null)\n      skip_service_principal_aad_check       = optional(bool, false)\n      condition                              = optional(string, null)\n      condition_version                      = optional(string, null)\n      delegated_managed_identity_resource_id = optional(string, null)\n      principal_type                         = optional(string, null)\n    })))\n  }))",
    "description": "(Optional) A map of subnets to create\n\n - `address_prefixes` - (Required) The address prefixes to use for the subnet.\n - `enforce_private_link_endpoint_network_policies` - \n - `enforce_private_link_service_network_policies` - \n - `name` - (Required) The name of the subnet. Changing this forces a new resource to be created.\n - `default_outbound_access_enabled` - (Optional) Whether to allow internet access from the subnet. Defaults to `false`.\n - `private_endpoint_network_policies` - (Optional) Enable or Disable network policies for the private endpoint on the subnet. Possible values are `Disabled`, `Enabled`, `NetworkSecurityGroupEnabled` and `RouteTableEnabled`. Defaults to `Enabled`.\n - `private_link_service_network_policies_enabled` - (Optional) Enable or Disable network policies for the private link service on the subnet. Setting this to `true` will **Enable** the policy and setting this to `false` will **Disable** the policy. Defaults to `true`.\n - `service_endpoint_policies` - (Optional) The map of objects with IDs of Service Endpoint Policies to associate with the subnet.\n - `service_endpoints` - (Optional) The list of Service endpoints to associate with the subnet. Possible values include: `Microsoft.AzureActiveDirectory`, `Microsoft.AzureCosmosDB`, `Microsoft.ContainerRegistry`, `Microsoft.EventHub`, `Microsoft.KeyVault`, `Microsoft.ServiceBus`, `Microsoft.Sql`, `Microsoft.Storage`, `Microsoft.Storage.Global` and `Microsoft.Web`.\n\n ---\n `delegation` supports the following:\n - `name` - (Required) A name for this delegation.\n\n ---\n `nat_gateway` supports the following:\n - `id` - (Optional) The ID of the NAT Gateway which should be associated with the Subnet. Changing this forces a new resource to be created.\n\n ---\n `network_security_group` supports the following:\n - `id` - (Optional) The ID of the Network Security Group which should be associated with the Subnet. Changing this forces a new association to be created.\n\n ---\n `route_table` supports the following:\n - `id` - (Optional) The ID of the Route Table which should be associated with the Subnet. Changing this forces a new association to be created.\n\n ---\n `timeouts` supports the following:\n - `create` - (Defaults to 30 minutes) Used when creating the Subnet.\n - `delete` - (Defaults to 30 minutes) Used when deleting the Subnet.\n - `read` - (Defaults to 5 minutes) Used when retrieving the Subnet.\n - `update` - (Defaults to 30 minutes) Used when updating the Subnet.\n\n ---\n `role_assignments` supports the following:\n\n - `role_definition_id_or_name` - The ID or name of the role definition to assign to the principal.\n - `principal_id` - The ID of the principal to assign the role to.\n - `description` - (Optional) The description of the role assignment.\n - `skip_service_principal_aad_check` - (Optional) If set to true, skips the Azure Active Directory check for the service principal in the tenant. Defaults to false.\n - `condition` - (Optional) The condition which will be used to scope the role assignment.\n - `condition_version` - (Optional) The version of the condition syntax. Leave as `null` if you are not using a condition, if you are then valid values are '2.0'.\n - `delegated_managed_identity_resource_id` - (Optional) The delegated Azure Resource Id which contains a Managed Identity. Changing this forces a new resource to be created. This field is only used in cross-tenant scenario.\n - `principal_type` - (Optional) The type of the `principal_id`. Possible values are `User`, `Group` and `ServicePrincipal`. It is necessary to explicitly set this attribute when creating role assignments if the principal creating the assignment is constrained by ABAC rules that filters on the PrincipalType attribute.\n \n",
    "default": "{}",
    "required": false
  },
  {
    "name": "subscription_id",
    "type": "string",
    "description": "(Optional) Subscription ID passed in by an external process.  If this is not supplied, then the configuration either needs to include the subscription ID, or needs to be supplied properties to create the subscription.",
    "default": "null",
    "required": false
  },
  {
    "name": "ddos_protection_plan",
    "type": "object({\n    id     = string\n    enable = bool\n  })",
    "description": "Specifies an AzureNetwork DDoS Protection Plan.\n\n- `id`: The ID of the DDoS Protection Plan. (Required)\n- `enable`: Enables or disables the DDoS Protection Plan on the Virtual Network. (Required)\n",
    "default": "null",
    "required": false
  },
  {
    "name": "lock",
    "type": "object({\n    kind = string\n    name = optional(string, null)\n  })",
    "description": "  (Optional) Controls the Resource Lock configuration for this resource. The following properties can be specified:\n  \n  - `kind` - (Required) The type of lock. Possible values are `\\\"CanNotDelete\\\"` and `\\\"ReadOnly\\\"`.\n  - `name` - (Optional) The name of the lock. If not specified, a name will be generated based on the `kind` value. Changing this forces the creation of a new resource.\n",
    "default": "null",
    "required": false
  },
  {
    "name": "name",
    "type": "string",
    "description": "(Optional) The name of the virtual network to create.  If null, existing_virtual_network must be supplied.\n",
    "default": "null",
    "required": false
  },
  {
    "name": "tags",
    "type": "map(string)",
    "description": "(Optional) Tags of the resource.",
    "default": "null",
    "required": false
  },
  {
    "name": "diagnostic_settings",
    "type": "map(object({\n    name                                     = optional(string, null)\n    log_categories                           = optional(set(string), [])\n    log_groups                               = optional(set(string), [\"allLogs\"])\n    metric_categories                        = optional(set(string), [\"AllMetrics\"])\n    log_analytics_destination_type           = optional(string, \"Dedicated\")\n    workspace_resource_id                    = optional(string, null)\n    storage_account_resource_id              = optional(string, null)\n    event_hub_authorization_rule_resource_id = optional(string, null)\n    event_hub_name                           = optional(string, null)\n    marketplace_partner_resource_id          = optional(string, null)\n  }))",
    "description": "  A map of diagnostic settings to create on the Key Vault. The map key is deliberately arbitrary to avoid issues where map keys maybe unknown at plan time.\n  \n  - `name` - (Optional) The name of the diagnostic setting. One will be generated if not set, however this will not be unique if you want to create multiple diagnostic setting resources.\n  - `log_categories` - (Optional) A set of log categories to send to the log analytics workspace. Defaults to `[]`.\n  - `log_groups` - (Optional) A set of log groups to send to the log analytics workspace. Defaults to `[\"allLogs\"]`.\n  - `metric_categories` - (Optional) A set of metric categories to send to the log analytics workspace. Defaults to `[\"AllMetrics\"]`.\n  - `log_analytics_destination_type` - (Optional) The destination type for the diagnostic setting. Possible values are `Dedicated` and `AzureDiagnostics`. Defaults to `Dedicated`.\n  - `workspace_resource_id` - (Optional) The resource ID of the log analytics workspace to send logs and metrics to.\n  - `storage_account_resource_id` - (Optional) The resource ID of the storage account to send logs and metrics to.\n  - `event_hub_authorization_rule_resource_id` - (Optional) The resource ID of the event hub authorization rule to send logs and metrics to.\n  - `event_hub_name` - (Optional) The name of the event hub. If none is specified, the default event hub will be selected.\n  - `marketplace_partner_resource_id` - (Optional) The full ARM resource ID of the Marketplace resource to which you would like to send Diagnostic LogsLogs.\n",
    "default": "{}",
    "required": false
  }
]
