[
  {
    "name": "this_key_name",
    "description": "The name of the key pair."
  },
  {
    "name": "this_key_pair_fingerprint",
    "description": "The finger print of the key pair."
  },
  {
    "name": "this_ecs_instance_ids",
    "description": "The list of ECS instance's ids."
  }
]
