[
  {
    "name": "this_k8s_name",
    "description": "Name of the kunernetes cluster."
  },
  {
    "name": "this_k8s_id",
    "description": "ID of the kunernetes cluster."
  },
  {
    "name": "this_k8s_nodes",
    "description": "List nodes of cluster."
  },
  {
    "name": "this_k8s_node_ids",
    "description": "List ids of of cluster node."
  },
  {
    "name": "this_k8s_scalinggroup_id",
    "description": "The scaling group id of the kubernetes auto scaling node pool."
  },
  {
    "name": "this_vpc_id",
    "description": "The ID of the VPC."
  },
  {
    "name": "this_vswitch_ids",
    "description": "List ID of the VSwitches."
  },
  {
    "name": "this_security_group_id",
    "description": "ID of the Security Group used to deploy kubernetes cluster."
  }
]
