[
  {
    "name": "consul_server_cluster_tag_name",
    "type": "string",
    "description": "The tag the consul server Compute Instances will look for to automatically discover each other and form a cluster. TIP: If running more than one Consul Server cluster, each cluster should have its own unique tag name. If you're not sure what to put for this value, just use the value entered in var.cluster_name.",
    "default": "",
    "required": true
  },
  {
    "name": "image_project_id",
    "type": "string",
    "description": "The name of the GCP Project where the image is located. Useful when using a separate project for custom images. If empty, var.gcp_project_id will be used.",
    "default": "",
    "required": true
  },
  {
    "name": "consul_server_cluster_size",
    "type": "number",
    "description": "The number of nodes to have in the Consul Server cluster. We strongly recommended that you use either 3 or 5.",
    "default": "3",
    "required": false
  },
  {
    "name": "consul_server_allowed_inbound_cidr_blocks_http_api",
    "type": "list(string)",
    "description": "A list of CIDR-formatted IP address ranges from which the Compute Instances will allow API connections to Consul.",
    "default": "[\n  \"0.0.0.0/0\"\n]",
    "required": false
  },
  {
    "name": "consul_client_allowed_inbound_cidr_blocks_http_api",
    "type": "list(string)",
    "description": "A list of CIDR-formatted IP address ranges from which the Compute Instances will allow API connections to Consul.",
    "default": "[\n  \"0.0.0.0/0\"\n]",
    "required": false
  },
  {
    "name": "consul_client_allowed_inbound_cidr_blocks_dns",
    "type": "list(string)",
    "description": "A list of CIDR-formatted IP address ranges from which the Compute Instances will allow TCP DNS and UDP DNS connections to Consul.",
    "default": "[]",
    "required": false
  },
  {
    "name": "consul_client_cluster_tag_name",
    "type": "string",
    "description": "A tag that will uniquely identify the Consul Clients. In this example, the Consul Server cluster uses this tag to identify the Consul Client servers that should have query permissions.",
    "default": "",
    "required": true
  },
  {
    "name": "gcp_region",
    "type": "string",
    "description": "The region in which all GCP resources will be launched.",
    "default": "",
    "required": true
  },
  {
    "name": "network_project_id",
    "type": "string",
    "description": "The name of the GCP Project where the network is located. Useful when using networks shared between projects. If empty, var.gcp_project_id will be used.",
    "default": "",
    "required": true
  },
  {
    "name": "consul_client_cluster_size",
    "type": "number",
    "description": "The number of nodes to have in the Consul Client example cluster. Any number of nodes is permissible, though 3 is usually enough to test..",
    "default": "3",
    "required": false
  },
  {
    "name": "consul_server_allowed_inbound_cidr_blocks_dns",
    "type": "list(string)",
    "description": "A list of CIDR-formatted IP address ranges from which the Compute Instances will allow TCP DNS and UDP DNS connections to Consul.",
    "default": "[]",
    "required": false
  },
  {
    "name": "gcp_project_id",
    "type": "string",
    "description": "The name of the GCP Project where all resources will be launched.",
    "default": "",
    "required": true
  },
  {
    "name": "consul_server_cluster_name",
    "type": "string",
    "description": "The name of the Consul Server cluster. All resources will be namespaced by this value. E.g. consul-server-prod",
    "default": "",
    "required": true
  },
  {
    "name": "consul_client_cluster_name",
    "type": "string",
    "description": "The name of the Consul Client example cluster. All resources will be namespaced by this value. E.g. consul-client-example",
    "default": "",
    "required": true
  },
  {
    "name": "consul_server_source_image",
    "type": "string",
    "description": "The Google Image used to launch each node in the Consul Server cluster.",
    "default": "",
    "required": true
  },
  {
    "name": "consul_client_source_image",
    "type": "string",
    "description": "The Google Image used to launch each node in the Consul Client cluster.",
    "default": "",
    "required": true
  }
]
