[
  {
    "name": "this_ecs_instance_private_ip",
    "description": "The private ip of ecs instance."
  },
  {
    "name": "this_ecs_instance_deletion_protection",
    "description": "Whether enable the deletion protection or not."
  },
  {
    "name": "this_ecs_instance_period",
    "description": "The duration that buy the resource."
  },
  {
    "name": "this_ecs_instance_availability_zone",
    "description": "The ecs instance avalability zone."
  },
  {
    "name": "this_ecs_instance_id",
    "description": "The id of ecs instance."
  },
  {
    "name": "this_vswitch_id",
    "description": "The virtual switch ID to launch ECS instance in VPC."
  },
  {
    "name": "this_ecs_instance_type",
    "description": "The type of instance."
  },
  {
    "name": "this_ecs_instance_internet_max_bandwidth_out",
    "description": "Maximum outgoing bandwidth to the public network."
  },
  {
    "name": "this_ecs_instance_instance_charge_type",
    "description": "The charge type of ecs instance."
  },
  {
    "name": "this_ecs_instance_public_ip",
    "description": "The ecs instance public ip."
  },
  {
    "name": "this_security_group_ids",
    "description": "A list of security group ids to associate with."
  },
  {
    "name": "this_ecs_instance_image_id",
    "description": "The ID of the image used to launch the instance."
  },
  {
    "name": "this_ecs_instance_system_disk_category",
    "description": "The system disk category used to launch one ecs instance."
  },
  {
    "name": "this_ecs_instance_system_disk_size",
    "description": "Size of the system disk, in GB."
  },
  {
    "name": "this_ecs_instance_host_name",
    "description": "The host name of ecs instance."
  },
  {
    "name": "this_ecs_instance_internet_charge_type",
    "description": "Internet charge type of the instance."
  },
  {
    "name": "this_ecs_instance_resource_group_id",
    "description": "The Id of resource group which the ECS instance belongs."
  },
  {
    "name": "this_ecs_instance_name",
    "description": "The name of ecs instance."
  },
  {
    "name": "this_ecs_instance_description",
    "description": "The description of ecs instance."
  },
  {
    "name": "this_ecs_instance_tags",
    "description": "The tags of ecs instance."
  }
]
