[
  {
    "name": "vnet_address_space",
    "description": "The address space of the newly created vNet"
  },
  {
    "name": "vnet_id",
    "description": "The id of the newly created vNet"
  },
  {
    "name": "vnet_location",
    "description": "The location of the newly created vNet"
  },
  {
    "name": "vnet_name",
    "description": "The Name of the newly created vNet"
  },
  {
    "name": "vnet_subnets_name_id",
    "description": "Can be queried subnet-id by subnet name by using lookup(module.vnet.vnet_subnets_name_id, subnet1)"
  }
]
