[
  {
    "name": "log_forwarder_s3_bucket_regional_domain_name",
    "description": "The log forwarder bucket region-specific domain name. The bucket domain name including the region name"
  },
  {
    "name": "rds_em_forwarder_lambda_kms_key_arn",
    "description": "(Optional) The ARN for the KMS encryption key for the RDS enhanced monitoring forwarder lambda function"
  },
  {
    "name": "vpc_fl_forwarder_role_arn",
    "description": "The VPC flow log forwarder lambda role arn"
  },
  {
    "name": "vpc_fl_forwarder_lambda_kms_key_arn",
    "description": "(Optional) The ARN for the KMS encryption key for the VPC flow log forwarder lambda function"
  },
  {
    "name": "log_forwarder_role_id",
    "description": "The log forwarder lambda role id"
  },
  {
    "name": "log_forwarder_lambda_kms_key_arn",
    "description": "(Optional) The ARN for the KMS encryption key for the log forwarder lambda function"
  },
  {
    "name": "vpc_fl_forwarder_role_policy_id",
    "description": "The ID of the VPC flow log forwarder lambda role policy"
  },
  {
    "name": "processes_endpoint_network_interface_ids",
    "description": "One or more network interfaces for the processes VPC endpoint"
  },
  {
    "name": "traces_endpoint_dns_entry",
    "description": "DNS entries of the traces VPC endpoint"
  },
  {
    "name": "traces_endpoint_state",
    "description": "The state of the traces VPC endpoint"
  },
  {
    "name": "log_forwarder_role_unique_id",
    "description": "The stable and unique string identifying the log forwarder lambda role"
  },
  {
    "name": "rds_em_forwarder_role_policy_arn",
    "description": "The ARN of the RDS enhanced monitoring forwarder lambda role policy"
  },
  {
    "name": "vpc_fl_forwarder_role_unique_id",
    "description": "The stable and unique string identifying the VPC flow log forwarder lambda role."
  },
  {
    "name": "vpc_fl_forwarder_lambda_arn",
    "description": "The ARN of the VPC flow log forwarder lambda function"
  },
  {
    "name": "metrics_endpoint_dns_entry",
    "description": "DNS entries of the metrics VPC endpoint"
  },
  {
    "name": "api_endpoint_arn",
    "description": "ARN of the API VPC endpoint"
  },
  {
    "name": "processes_endpoint_dns_entry",
    "description": "DNS entries of the processes VPC endpoint"
  },
  {
    "name": "log_forwarder_cloudwatch_log_group_arn",
    "description": "The ARN of the log forwarder lambda function CloudWatch log group"
  },
  {
    "name": "rds_em_forwarder_lambda_version",
    "description": "Latest published version of the RDS enhanced monitoring forwarder lambda function"
  },
  {
    "name": "vpc_fl_forwarder_cloudwatch_log_group_arn",
    "description": "The ARN of the VPC flow log forwarder lambda function CloudWatch log group"
  },
  {
    "name": "metrics_endpoint_arn",
    "description": "ARN of the metrics VPC endpoint"
  },
  {
    "name": "api_endpoint_id",
    "description": "ID of the API VPC endpoint"
  },
  {
    "name": "log_forwarder_endpoint_network_interface_ids",
    "description": "One or more network interfaces for the log forwarder VPC endpoint"
  },
  {
    "name": "processes_endpoint_owner_id",
    "description": "The ID of the AWS account that owns the processes VPC endpoint"
  },
  {
    "name": "traces_endpoint_arn",
    "description": "ARN of the traces VPC endpoint"
  },
  {
    "name": "rds_em_forwarder_cloudwatch_log_group_arn",
    "description": "The ARN of the RDS enhanced monitoring forwarder lambda function CloudWatch log group"
  },
  {
    "name": "vpc_fl_forwarder_lambda_qualified_arn",
    "description": "The ARN of the VPC flow log forwarder lambda function (if versioning is enabled via publish = true)"
  },
  {
    "name": "log_forwarder_endpoint_id",
    "description": "ID of the log forwarder VPC endpoint"
  },
  {
    "name": "log_forwarder_endpoint_state",
    "description": "The state of the log forwarder VPC endpoint"
  },
  {
    "name": "vpc_fl_forwarder_role_id",
    "description": "The VPC flow log forwarder lambda role id"
  },
  {
    "name": "vpc_fl_forwarder_role_policy_arn",
    "description": "The ARN of the VPC flow log forwarder lambda role policy"
  },
  {
    "name": "agent_endpoint_id",
    "description": "ID of the agent VPC endpoint"
  },
  {
    "name": "agent_endpoint_owner_id",
    "description": "The ID of the AWS account that owns the agent VPC endpoint"
  },
  {
    "name": "log_forwarder_s3_bucket_arn",
    "description": "The ARN of the log forwarder bucket. Will be of format arn:aws:s3:::bucketname"
  },
  {
    "name": "log_forwarder_s3_object_id",
    "description": "The `key` of the log forwarder lambda zip archive"
  },
  {
    "name": "rds_em_forwarder_lambda_arn",
    "description": "The ARN of the RDS enhanced monitoring forwarder lambda function"
  },
  {
    "name": "agent_endpoint_state",
    "description": "The state of the agent VPC endpoint"
  },
  {
    "name": "api_endpoint_state",
    "description": "The state of the API VPC endpoint"
  },
  {
    "name": "metrics_endpoint_id",
    "description": "ID of the metrics VPC endpoint"
  },
  {
    "name": "traces_endpoint_network_interface_ids",
    "description": "One or more network interfaces for the traces VPC endpoint"
  },
  {
    "name": "log_forwarder_s3_object_etag",
    "description": "The ETag generated for the log forwarder lambda zip object (an MD5 sum of the object content)"
  },
  {
    "name": "rds_em_forwarder_role_policy_name",
    "description": "The name of the RDS enhanced monitoring forwarder lambda role policy"
  },
  {
    "name": "metrics_endpoint_network_interface_ids",
    "description": "One or more network interfaces for the metrics VPC endpoint"
  },
  {
    "name": "metrics_endpoint_owner_id",
    "description": "The ID of the AWS account that owns the metrics VPC endpoint"
  },
  {
    "name": "log_forwarder_endpoint_arn",
    "description": "ARN of the log forwarder VPC endpoint"
  },
  {
    "name": "processes_endpoint_arn",
    "description": "ARN of the processes VPC endpoint"
  },
  {
    "name": "traces_endpoint_id",
    "description": "ID of the traces VPC endpoint"
  },
  {
    "name": "log_forwarder_role_arn",
    "description": "The log forwarder lambda role arn"
  },
  {
    "name": "log_forwarder_lambda_arn",
    "description": "The ARN of the log forwarder lambda function"
  },
  {
    "name": "log_forwarder_lambda_source_code_hash",
    "description": "Base64-encoded representation of raw SHA-256 sum of the log forwarder zip file, provided either via filename or s3_* parameters"
  },
  {
    "name": "api_endpoint_network_interface_ids",
    "description": "One or more network interfaces for API api VPC endpoint"
  },
  {
    "name": "log_forwarder_s3_bucket_domain_name",
    "description": "The log forwarder bucket domain name. Will be of format bucketname.s3.amazonaws.com"
  },
  {
    "name": "log_forwarder_s3_object_version",
    "description": "A unique version ID value for the log forwarder lambda zip object, if bucket versioning is enabled"
  },
  {
    "name": "rds_em_forwarder_role_name",
    "description": "The RDS enhanced monitoring forwarder lambda role name"
  },
  {
    "name": "vpc_fl_forwarder_role_name",
    "description": "The VPC flow log forwarder lambda role name"
  },
  {
    "name": "vpc_fl_forwarder_lambda_source_code_hash",
    "description": "Base64-encoded representation of raw SHA-256 sum of the VPC flow log forwarder lambda zip file, provided either via filename or s3_* parameters"
  },
  {
    "name": "processes_endpoint_id",
    "description": "ID of the processes VPC endpoint"
  },
  {
    "name": "processes_endpoint_state",
    "description": "The state of the processes VPC endpoint"
  },
  {
    "name": "log_forwarder_endpoint_owner_id",
    "description": "The ID of the AWS account that owns the log forwarder VPC endpoint"
  },
  {
    "name": "rds_em_forwarder_role_policy_id",
    "description": "The ID of the RDS enhanced monitoring forwarder lambda role policy"
  },
  {
    "name": "rds_em_forwarder_lambda_qualified_arn",
    "description": "The ARN of the RDS enhanced monitoring forwarder lambda function (if versioning is enabled via publish = true)"
  },
  {
    "name": "vpc_fl_forwarder_role_policy_name",
    "description": "The name of the VPC flow log forwarder lambda role policy"
  },
  {
    "name": "metrics_endpoint_state",
    "description": "The state of the metrics VPC endpoint"
  },
  {
    "name": "agent_endpoint_dns_entry",
    "description": "DNS entries of the agent VPC endpoint"
  },
  {
    "name": "agent_endpoint_network_interface_ids",
    "description": "One or more network interfaces for the agent VPC endpoint"
  },
  {
    "name": "log_forwarder_endpoint_dns_entry",
    "description": "DNS entries of the log forwarder VPC endpoint"
  },
  {
    "name": "log_forwarder_s3_bucket_id",
    "description": "The name of the log forwarder bucket"
  },
  {
    "name": "log_forwarder_role_name",
    "description": "The log forwarder lambda role name"
  },
  {
    "name": "log_forwarder_role_policy_arn",
    "description": "The ARN of the log forwarder lambda role policy"
  },
  {
    "name": "log_forwarder_lambda_qualified_arn",
    "description": "The ARN of the log forwarder lambda function (if versioning is enabled via publish = true)"
  },
  {
    "name": "rds_em_forwarder_role_unique_id",
    "description": "The stable and unique string identifying the RDS enhanced monitoring forwarder lambda role."
  },
  {
    "name": "rds_em_forwarder_lambda_source_code_hash",
    "description": "Base64-encoded representation of raw SHA-256 sum of the RDS enhanced monitoring lambda forwarder zip file, provided either via filename or s3_* parameters"
  },
  {
    "name": "api_endpoint_owner_id",
    "description": "The ID of the AWS account that owns the API VPC endpoint"
  },
  {
    "name": "api_endpoint_dns_entry",
    "description": "DNS entries of the API VPC endpoint"
  },
  {
    "name": "log_forwarder_role_policy_id",
    "description": "The ID of the log forwarder lambda role policy"
  },
  {
    "name": "log_forwarder_role_policy_name",
    "description": "The name of the log forwarder lambda role policy"
  },
  {
    "name": "log_forwarder_lambda_version",
    "description": "Latest published version of the log forwarder lambda function"
  },
  {
    "name": "rds_em_forwarder_role_arn",
    "description": "The RDS enhanced monitoring forwarder lambda role arn"
  },
  {
    "name": "rds_em_forwarder_role_id",
    "description": "The RDS enhanced monitoring forwarder lambda role id"
  },
  {
    "name": "vpc_fl_forwarder_lambda_version",
    "description": "Latest published version of the VPC flow log forwarder lambda function"
  },
  {
    "name": "agent_endpoint_arn",
    "description": "ARN of the agent VPC endpoint"
  },
  {
    "name": "traces_endpoint_owner_id",
    "description": "The ID of the AWS account that owns the traces VPC endpoint"
  }
]
