[
  {
    "name": "tags",
    "type": "map(string)",
    "description": "A mapping of tags to assign to the mysql.",
    "default": "{}",
    "required": false
  },
  {
    "name": "allocate_public_connection",
    "type": "bool",
    "description": "Whether to allocate public connection for a MySQL instance. If true, the connection_prefix can not be empty.",
    "default": "false",
    "required": false
  },
  {
    "name": "account_name",
    "type": "string",
    "description": "Name of a new database account. It should be set when create_account = true.",
    "default": "\"\"",
    "required": false
  },
  {
    "name": "region",
    "type": "string",
    "description": "(Deprecated from version 1.4.0)The region used to launch this module resources.",
    "default": "\"\"",
    "required": false
  },
  {
    "name": "enable_alarm_rule",
    "type": "bool",
    "description": "Whether to enable alarm rule. Default to true. ",
    "default": "true",
    "required": false
  },
  {
    "name": "security_ips",
    "type": "list(string)",
    "description": " List of IP addresses allowed to access all databases of an instance. The list contains up to 1,000 IP addresses, separated by commas. Supported formats include 0.0.0.0/0, 10.23.12.24 (IP), and 10.23.12.24/24 (Classless Inter-Domain Routing (CIDR) mode. /24 represents the length of the prefix in an IP address. The range of the prefix length is [1,32]).",
    "default": "[]",
    "required": false
  },
  {
    "name": "log_backup_retention_period",
    "type": "number",
    "description": "Instance log backup retention days. Valid values: [7-730]. Default to 7. It can be larger than 'retention_period'.",
    "default": "7",
    "required": false
  },
  {
    "name": "create_account",
    "type": "bool",
    "description": "Whether to create a new account. If true, the `account_name` should not be empty.",
    "default": "true",
    "required": false
  },
  {
    "name": "alarm_rule_period",
    "type": "number",
    "description": "Index query cycle, which must be consistent with that defined for metrics. Default to 300, in seconds. ",
    "default": "300",
    "required": false
  },
  {
    "name": "alarm_rule_statistics",
    "type": "string",
    "description": "Statistical method. It must be consistent with that defined for metrics. Valid values: ['Average', 'Minimum', 'Maximum']. Default to 'Average'. ",
    "default": "\"Average\"",
    "required": false
  },
  {
    "name": "instance_type",
    "type": "string",
    "description": "MySQL Instance type, for example: mysql.n1.micro.1. full list is : https://www.alibabacloud.com/help/zh/doc-detail/26312.htm",
    "default": "\"\"",
    "required": false
  },
  {
    "name": "preferred_backup_time",
    "type": "string",
    "description": " MySQL Instance backup time, in the format of HH:mmZ- HH:mmZ. ",
    "default": "\"02:00Z-03:00Z\"",
    "required": false
  },
  {
    "name": "enable_backup_log",
    "type": "bool",
    "description": "Whether to backup instance log. Default to true.",
    "default": "false",
    "required": false
  },
  {
    "name": "port",
    "type": "number",
    "description": " Internet connection port. Valid value: [3001-3999]. Default to 3306.",
    "default": "3306",
    "required": false
  },
  {
    "name": "databases",
    "type": "list(map(string))",
    "description": "A list mapping used to add multiple databases. Each item supports keys: name, character_set and description. It should be set when create_database = true.",
    "default": "[]",
    "required": false
  },
  {
    "name": "account_password",
    "type": "string",
    "description": "Operation database account password. It may consist of letters, digits, or underlines, with a length of 6 to 32 characters.",
    "default": "\"\"",
    "required": false
  },
  {
    "name": "alarm_rule_triggered_count",
    "type": "number",
    "description": "Number of consecutive times it has been detected that the values exceed the threshold. Default to 3. ",
    "default": "3",
    "required": false
  },
  {
    "name": "alarm_rule_contact_groups",
    "type": "list(string)",
    "description": "List contact groups of the alarm rule, which must have been created on the console. ",
    "default": "[]",
    "required": false
  },
  {
    "name": "account_privilege",
    "type": "string",
    "description": "The privilege of one account access database.",
    "default": "\"ReadOnly\"",
    "required": false
  },
  {
    "name": "alarm_rule_silence_time",
    "type": "number",
    "description": "Notification silence period in the alarm state, in seconds. Valid value range: [300, 86400]. Default to 86400. ",
    "default": "86400",
    "required": false
  },
  {
    "name": "engine_version",
    "type": "string",
    "description": "RDS Database version. Value options can refer to the latest docs [CreateDBInstance](https://www.alibabacloud.com/help/doc-detail/26228.htm) `EngineVersion`",
    "default": "\"\"",
    "required": false
  },
  {
    "name": "period",
    "type": "number",
    "description": "The duration that you will buy MySQL Instance (in month). It is valid when instance_charge_type is PrePaid. Valid values: [1~9], 12, 24, 36. Default to 1",
    "default": "1",
    "required": false
  },
  {
    "name": "security_group_ids",
    "type": "list(string)",
    "description": "List of VPC security group ids to associate with mysql instance.",
    "default": "[]",
    "required": false
  },
  {
    "name": "vswitch_id",
    "type": "string",
    "description": "The virtual switch ID to launch MySQL Instances in one VPC.",
    "default": "\"\"",
    "required": false
  },
  {
    "name": "create_database",
    "type": "bool",
    "description": "Whether to create multiple databases. If true, the `databases` should not be empty.",
    "default": "true",
    "required": false
  },
  {
    "name": "alarm_rule_name",
    "type": "string",
    "description": "The alarm rule name. ",
    "default": "\"\"",
    "required": false
  },
  {
    "name": "alarm_rule_operator",
    "type": "string",
    "description": "Alarm comparison operator. Valid values: ['<=', '<', '>', '>=', '==', '!=']. Default to '=='. ",
    "default": "\"==\"",
    "required": false
  },
  {
    "name": "create_backup_policy",
    "type": "bool",
    "description": "Whether to create backup policy.",
    "default": "true",
    "required": false
  },
  {
    "name": "account_type",
    "type": "string",
    "description": "Privilege type of account. Normal: Common privilege. Super: High privilege.Default to Normal.",
    "default": "\"Normal\"",
    "required": false
  },
  {
    "name": "alarm_rule_effective_interval",
    "type": "string",
    "description": "The interval of effecting alarm rule. It foramt as 'hh:mm-hh:mm', like '0:00-4:00'.",
    "default": "\"0:00-2:00\"",
    "required": false
  },
  {
    "name": "instance_storage",
    "type": "number",
    "description": "The storage capacity of the instance. Unit: GB. The storage capacity increases at increments of 5 GB. For more information, see [Instance Types](https://www.alibabacloud.com/help/doc-detail/26312.htm).",
    "default": "20",
    "required": false
  },
  {
    "name": "shared_credentials_file",
    "type": "string",
    "description": "(Deprecated from version 1.4.0)This is the path to the shared credentials file. If this is not set and a profile is specified, $HOME/.aliyun/config.json will be used.",
    "default": "\"\"",
    "required": false
  },
  {
    "name": "alarm_rule_threshold",
    "type": "string",
    "description": "Alarm threshold value, which must be a numeric value currently. ",
    "default": "\"\"",
    "required": false
  },
  {
    "name": "existing_instance_id",
    "type": "string",
    "description": "The Id of an existing mysql instance. If set, the `create_instance` will be ignored.",
    "default": "\"\"",
    "required": false
  },
  {
    "name": "skip_region_validation",
    "type": "bool",
    "description": "(Deprecated from version 1.4.0)Skip static validation of region ID. Used by users of alternative AlibabaCloud-like APIs or users w/ access to regions that are not public (yet).",
    "default": "false",
    "required": false
  },
  {
    "name": "instance_name",
    "type": "string",
    "description": "The name of MySQL Instance.",
    "default": "\"tf-rds-instance-for-mysql\"",
    "required": false
  },
  {
    "name": "backup_retention_period",
    "type": "number",
    "description": "Instance backup retention days. Valid values: [7-730]. Default to 7.",
    "default": "7",
    "required": false
  },
  {
    "name": "connection_prefix",
    "type": "string",
    "description": "Prefix of an Internet connection string.",
    "default": "\"tf-mysql\"",
    "required": false
  },
  {
    "name": "create_instance",
    "type": "bool",
    "description": "Whether to create mysql instance. If false, you can use a existing MySQL instance by setting `existing_instance_id`.",
    "default": "true",
    "required": false
  },
  {
    "name": "instance_charge_type",
    "type": "string",
    "description": "The instance charge type. Valid values: Prepaid and Postpaid. Default to Postpaid.",
    "default": "\"Postpaid\"",
    "required": false
  },
  {
    "name": "preferred_backup_period",
    "type": "list(string)",
    "description": "MySQL Instance backup period.",
    "default": "[]",
    "required": false
  },
  {
    "name": "profile",
    "type": "string",
    "description": "(Deprecated from version 1.4.0)The profile name as set in the shared credentials file. If not set, it will be sourced from the ALICLOUD_PROFILE environment variable.",
    "default": "\"\"",
    "required": false
  }
]
