[
  {
    "name": "this_cdn_domain_id",
    "description": "The id of cdn domain."
  },
  {
    "name": "this_cdn_sources",
    "description": "The source address list of the cdn domain"
  },
  {
    "name": "this_cdn_domain_config_function_name",
    "description": "The name of the domain config."
  },
  {
    "name": "this_cdn_config_function_id",
    "description": "The id of the domain config."
  },
  {
    "name": "this_cdn_config_function_args",
    "description": "The args of the domain config."
  },
  {
    "name": "this_cdn_domain_name",
    "description": "The name of cdn domain."
  }
]
