[
  {
    "name": "tags_for",
    "type": "string",
    "description": "The specification of the tags for.",
    "default": "\"acceptance-test-update\"",
    "required": false
  },
  {
    "name": "description",
    "type": "string",
    "description": "The name of a new description.",
    "default": "\"Test new adb.\"",
    "required": false
  },
  {
    "name": "node_count",
    "type": "string",
    "description": "The specification of the node count.",
    "default": "\"4\"",
    "required": false
  },
  {
    "name": "payment_type",
    "type": "string",
    "description": "The specification of the payment type.",
    "default": "\"PayAsYouGo\"",
    "required": false
  },
  {
    "name": "tags_created",
    "type": "string",
    "description": "The specification of the tags created.",
    "default": "\"TF-update\"",
    "required": false
  },
  {
    "name": "availability_zone",
    "type": "string",
    "description": "The available zone to launch modules.",
    "default": "\"\"",
    "required": false
  },
  {
    "name": "class",
    "type": "string",
    "description": "The specification of the class.",
    "default": "\"C8\"",
    "required": false
  },
  {
    "name": "mode",
    "type": "string",
    "description": "The specification of the mode.",
    "default": "\"reserver\"",
    "required": false
  },
  {
    "name": "cluster_version",
    "type": "string",
    "description": "The specification of the cluster version.",
    "default": "\"3.0\"",
    "required": false
  },
  {
    "name": "security_ips",
    "type": "list(string)",
    "description": "The specification of the security_ips.",
    "default": "[\n  \"10.168.1.12\",\n  \"10.168.1.11\"\n]",
    "required": false
  },
  {
    "name": "category",
    "type": "string",
    "description": "The specification of the category.",
    "default": "\"Cluster\"",
    "required": false
  },
  {
    "name": "node_storage",
    "type": "string",
    "description": "The specification of the node storage.",
    "default": "\"400\"",
    "required": false
  },
  {
    "name": "maintain_time",
    "type": "string",
    "description": "The specification of the maintain time.",
    "default": "\"23:00Z-00:00Z\"",
    "required": false
  },
  {
    "name": "vswitch_id",
    "type": "string",
    "description": "VSwitch variables, if vswitch_id is empty, then the net_type = classic.",
    "default": "\"\"",
    "required": false
  }
]
