[
  {
    "name": "resource_id",
    "description": "The resource ID of the virtual network."
  },
  {
    "name": "subnets",
    "description": "Information about the subnets created in the module.\n\nPlease refer to the subnet module documentation for details of the outputs.\n"
  },
  {
    "name": "name",
    "description": "The resource name of the virtual network."
  },
  {
    "name": "peerings",
    "description": "Information about the peerings created in the module.\n\nPlease refer to the peering module documentation for details of the outputs\n"
  },
  {
    "name": "resource",
    "description": "The Azure Virtual Network resource.  This will be null if an existing vnet is supplied."
  }
]
