[
  {
    "name": "disk_capacity",
    "type": "number",
    "description": "The host group of ecs mount disk capacity to create emr cluster instance.",
    "default": "0",
    "required": false
  },
  {
    "name": "charge_type",
    "type": "string",
    "description": "The instance charge type. Valid values: Prepaid and PostPaid. Default to PostPaid.",
    "default": "\"PostPaid\"",
    "required": false
  },
  {
    "name": "support_local_storage",
    "type": "bool",
    "description": "Whether to support local storage.",
    "default": "false",
    "required": false
  },
  {
    "name": "emr_version",
    "type": "string",
    "description": "The version of this new created emr druid cluster.",
    "default": "\"EMR-3.24.0\"",
    "required": false
  },
  {
    "name": "system_disk_capacity",
    "type": "number",
    "description": "The host group of ecs mount system disk capacity to create emr cluster instance.",
    "default": "0",
    "required": false
  },
  {
    "name": "profile",
    "type": "string",
    "description": "(Deprecated from version 1.1.0) The profile name as set in the shared credentials file. If not set, it will be sourced from the ALICLOUD_PROFILE environment variable.",
    "default": "\"\"",
    "required": false
  },
  {
    "name": "emr_cluster_name",
    "type": "string",
    "description": "The name of this new created emr cluster instance.",
    "default": "\"terraform-test-druid-module\"",
    "required": false
  },
  {
    "name": "ram_role_name",
    "type": "string",
    "description": "The role name to bound by this new created emr cluster.",
    "default": "\"\"",
    "required": false
  },
  {
    "name": "high_availability_enable",
    "type": "bool",
    "description": "The high availability of this emr cluster is enable or not.",
    "default": "true",
    "required": false
  },
  {
    "name": "is_open_public_ip",
    "type": "bool",
    "description": "The emr cluster ecs instance is open public ip or not.",
    "default": "true",
    "required": false
  },
  {
    "name": "ssh_enable",
    "type": "bool",
    "description": "The emr cluster ecs instance is ssh enable or not.",
    "default": "true",
    "required": false
  },
  {
    "name": "create",
    "type": "bool",
    "description": "The switch to control creation of the emr cluster or not.",
    "default": "false",
    "required": false
  },
  {
    "name": "region",
    "type": "string",
    "description": "(Deprecated from version 1.1.0) The region used to launch this module resources.",
    "default": "\"\"",
    "required": false
  },
  {
    "name": "shared_credentials_file",
    "type": "string",
    "description": "(Deprecated from version 1.1.0) This is the path to the shared credentials file. If this is not set and a profile is specified, $HOME/.aliyun/config.json will be used.",
    "default": "\"\"",
    "required": false
  },
  {
    "name": "skip_region_validation",
    "type": "bool",
    "description": "(Deprecated from version 1.1.0) Skip static validation of region ID. Used by users of alternative AlibabaCloud-like APIs or users w/ access to regions that are not public (yet).",
    "default": "false",
    "required": false
  },
  {
    "name": "instance_type",
    "type": "string",
    "description": "The host group of ecs instance type to create emr cluster instance.",
    "default": "\"\"",
    "required": false
  },
  {
    "name": "disk_type",
    "type": "string",
    "description": "The host group of ecs mount disk type to create emr cluster instance. Supported value: cloud, cloud_efficiency, cloud_ssd, local_disk, cloud_essd.",
    "default": "\"\"",
    "required": false
  },
  {
    "name": "system_disk_type",
    "type": "string",
    "description": "The host group of ecs mount system disk type to create emr cluster instance. Supported value: cloud, cloud_efficiency, cloud_ssd, local_disk, cloud_essd.",
    "default": "\"\"",
    "required": false
  },
  {
    "name": "host_groups",
    "type": "list(map(string))",
    "description": "Host groups to attach to the emr cluster instance.",
    "default": "[\n  {\n    \"disk_count\": \"1\",\n    \"host_group_name\": \"master_group\",\n    \"host_group_type\": \"MASTER\",\n    \"node_count\": \"2\"\n  },\n  {\n    \"disk_count\": \"4\",\n    \"host_group_name\": \"core_group\",\n    \"host_group_type\": \"CORE\",\n    \"node_count\": \"3\"\n  }\n]",
    "required": false
  },
  {
    "name": "zone_id",
    "type": "string",
    "description": "The zone id used to created emr cluster.",
    "default": "\"\"",
    "required": false
  },
  {
    "name": "vswitch_id",
    "type": "string",
    "description": "The vswitch id used to created emr cluster.",
    "default": "\"\"",
    "required": false
  },
  {
    "name": "security_group_id",
    "type": "string",
    "description": "The security group id used to created emr cluster.",
    "default": "\"\"",
    "required": false
  },
  {
    "name": "master_pwd",
    "type": "string",
    "description": "The master password of this new created emr cluster.",
    "default": "\"YourPassword123!\"",
    "required": false
  }
]
