[
  {
    "name": "dual_stack_dns_name",
    "description": "The DNS name that Global Accelerator creates that points to a dual-stack accelerator's four static IP addresses: two IPv4 addresses and two IPv6 addresses"
  },
  {
    "name": "hosted_zone_id",
    "description": "The Global Accelerator Route 53 zone ID that can be used to route an Alias Resource Record Set to the Global Accelerator"
  },
  {
    "name": "ip_sets",
    "description": "IP address set associated with the accelerator"
  },
  {
    "name": "listeners",
    "description": "Map of listeners created and their associated attributes"
  },
  {
    "name": "endpoint_groups",
    "description": "Map of endpoints created and their associated attributes"
  },
  {
    "name": "id",
    "description": "The Amazon Resource Name (ARN) of the accelerator"
  },
  {
    "name": "dns_name",
    "description": "The DNS name of the accelerator"
  }
]
