[
  {
    "name": "this_slb_id",
    "description": "The ID of the SLB"
  },
  {
    "name": "this_slb_master_slave_servers",
    "description": "List of slb master slave servers"
  },
  {
    "name": "this_slb_virtual_server_group_id",
    "description": "The ID of virtual server group"
  },
  {
    "name": "this_slb_virtual_server_group_name",
    "description": "The name of virtual server group"
  },
  {
    "name": "rule_ids",
    "description": "The ids of slb rules"
  },
  {
    "name": "this_server_certificate_id",
    "description": "The id of slb server certificate"
  },
  {
    "name": "this_slb_master_slave_server_group_id",
    "description": "The ID of master slave server group."
  },
  {
    "name": "this_slb_virtual_servers",
    "description": "List of slb virtual servers"
  },
  {
    "name": "this_slb_network_type",
    "description": "The network type of this slb"
  },
  {
    "name": "this_slb_vswitch_id",
    "description": "The vswitch id of the SLB belongs"
  },
  {
    "name": "this_slb_backend_servers",
    "description": "List of slb attached backend servers"
  },
  {
    "name": "this_slb_master_slave_server_group_name",
    "description": "The name of master slave server group"
  },
  {
    "name": "this_slb_http_listener_ids",
    "description": "The id of slb listeners"
  },
  {
    "name": "this_slb_https_listener_ids",
    "description": "The id of slb listeners"
  },
  {
    "name": "this_slb_name",
    "description": "The name of the SLB"
  },
  {
    "name": "this_slb_address",
    "description": "The IP address of the SLB"
  },
  {
    "name": "this_slb_tags",
    "description": "The tags of the SLB"
  }
]
