[
  {
    "name": "this_image_id",
    "description": "The image ID used by the instance."
  },
  {
    "name": "this_availability_zone",
    "description": "The zone id of the instance."
  },
  {
    "name": "this_vswitch_id",
    "description": "The vswitch id in which the instance."
  },
  {
    "name": "this_instance_id",
    "description": "The instance id."
  },
  {
    "name": "this_private_ip",
    "description": "The instance private ip."
  },
  {
    "name": "this_instance_type",
    "description": "The instance type."
  },
  {
    "name": "this_instance_public_ip",
    "description": "The instance public ip."
  },
  {
    "name": "this_security_group_ids",
    "description": "The security group ids in which the instance."
  },
  {
    "name": "this_instance_name",
    "description": "The instance name."
  },
  {
    "name": "this_instance_tags",
    "description": "The tags for the instance."
  }
]
