[
  {
    "name": "proxy_arn",
    "description": "The Amazon Resource Name (ARN) for the proxy"
  },
  {
    "name": "proxy_target_type",
    "description": "Type of target. e.g. `RDS_INSTANCE` or `TRACKED_CLUSTER`"
  },
  {
    "name": "iam_role_arn",
    "description": "The Amazon Resource Name (ARN) of the IAM role that the proxy uses to access secrets in AWS Secrets Manager."
  },
  {
    "name": "proxy_id",
    "description": "The ID for the proxy"
  },
  {
    "name": "proxy_endpoint",
    "description": "The endpoint that you can use to connect to the proxy"
  },
  {
    "name": "log_group_arn",
    "description": "The Amazon Resource Name (ARN) of the CloudWatch log group"
  },
  {
    "name": "proxy_target_target_arn",
    "description": "Amazon Resource Name (ARN) for the DB instance or DB cluster. Currently not returned by the RDS API"
  },
  {
    "name": "proxy_target_tracked_cluster_id",
    "description": "DB Cluster identifier for the DB Instance target. Not returned unless manually importing an RDS_INSTANCE target that is part of a DB Cluster"
  },
  {
    "name": "iam_role_name",
    "description": "IAM role name"
  },
  {
    "name": "proxy_default_target_group_name",
    "description": "The name of the default target group"
  },
  {
    "name": "proxy_target_id",
    "description": "Identifier of `db_proxy_name`, `target_group_name`, target type (e.g. `RDS_INSTANCE` or `TRACKED_CLUSTER`), and resource identifier separated by forward slashes (/)"
  },
  {
    "name": "proxy_target_rds_resource_id",
    "description": "Identifier representing the DB Instance or DB Cluster target"
  },
  {
    "name": "proxy_target_port",
    "description": "Port for the target RDS DB Instance or Aurora DB Cluster"
  },
  {
    "name": "db_proxy_endpoints",
    "description": "Array containing the full resource object and attributes for all DB proxy endpoints created"
  },
  {
    "name": "iam_role_unique_id",
    "description": "Stable and unique string identifying the IAM role"
  },
  {
    "name": "proxy_default_target_group_id",
    "description": "The ID for the default target group"
  },
  {
    "name": "proxy_default_target_group_arn",
    "description": "The Amazon Resource Name (ARN) for the default target group"
  },
  {
    "name": "proxy_target_endpoint",
    "description": "Hostname for the target RDS DB Instance. Only returned for `RDS_INSTANCE` type"
  }
]
