[
  {
    "name": "this_vswitch_ids",
    "description": "List ID of the VSwitches."
  },
  {
    "name": "this_security_group_id",
    "description": "ID of the Security Group used to deploy kubernetes cluster."
  },
  {
    "name": "this_k8s_name",
    "description": "Name of the kunernetes cluster."
  },
  {
    "name": "this_k8s_id",
    "description": "ID of the kunernetes cluster."
  },
  {
    "name": "this_k8s_node_pool_id",
    "description": "ID of the kunernetes node pool."
  }
]
