[
  {
    "name": "this_adb_cluster_db_cluster_version",
    "description": "The version of the ADB cluster."
  },
  {
    "name": "this_adb_cluster_db_cluster_category",
    "description": "The catrgory type of the ADB cluster. "
  },
  {
    "name": "this_adb_cluster_db_node_count",
    "description": "The node count of the ADB cluster. "
  },
  {
    "name": "this_adb_cluster_pay_type",
    "description": "The pay type."
  },
  {
    "name": "this_adb_description",
    "description": "The description of ADB cluster."
  },
  {
    "name": "this_adb_cluster_vswitch_id",
    "description": "The virtual switch ID to launch ADB cluster in one VPC. "
  },
  {
    "name": "this_adb_cluster_db_node_class",
    "description": "The node class of the core node. "
  },
  {
    "name": "this_adb_cluster_db_node_storage",
    "description": "The node storage size of the ADB cluster. "
  },
  {
    "name": "this_adb_cluster_id",
    "description": "The ID of the ADB cluster."
  },
  {
    "name": "this_adb_cluster_zone_id",
    "description": "The Zone to launch the ADB cluster."
  }
]
