[
  {
    "name": "vault_lb_arn",
    "description": "ARN of Vault load balancer"
  },
  {
    "name": "vault_target_group_arn",
    "description": "Target group ARN to register Vault nodes with"
  },
  {
    "name": "vault_lb_dns_name",
    "description": "DNS name of Vault load balancer"
  },
  {
    "name": "vault_lb_zone_id",
    "description": "Zone ID of Vault load balancer"
  }
]
