%YAML 1.1
%TAG !u! tag:unity3d.com,2011:
--- !u!1 &1136482693
GameObject:
  m_ObjectHideFlags: 0
  m_CorrespondingSourceObject: {fileID: 0}
  m_PrefabInstance: {fileID: 0}
  m_PrefabAsset: {fileID: 0}
  serializedVersion: 6
  m_Component:
  - component: {fileID: 1136482694}
  m_Layer: 0
  m_Name: StartPoint
  m_TagString: Untagged
  m_Icon: {fileID: 0}
  m_NavMeshLayer: 0
  m_StaticEditorFlags: 0
  m_IsActive: 1
--- !u!4 &1136482694
Transform:
  m_ObjectHideFlags: 0
  m_CorrespondingSourceObject: {fileID: 0}
  m_PrefabInstance: {fileID: 0}
  m_PrefabAsset: {fileID: 0}
  m_GameObject: {fileID: 1136482693}
  m_LocalRotation: {x: -0, y: -0, z: -0, w: 1}
  m_LocalPosition: {x: 0, y: 0, z: 0}
  m_LocalScale: {x: 0.018181818, y: 0.018181818, z: 0.018181818}
  m_Children: []
  m_Father: {fileID: 6328759479451180978}
  m_RootOrder: 3
  m_LocalEulerAnglesHint: {x: 0, y: 0, z: 0}
--- !u!1 &1426712541
GameObject:
  m_ObjectHideFlags: 0
  m_CorrespondingSourceObject: {fileID: 0}
  m_PrefabInstance: {fileID: 0}
  m_PrefabAsset: {fileID: 0}
  serializedVersion: 6
  m_Component:
  - component: {fileID: 1426712542}
  m_Layer: 0
  m_Name: EndPoint
  m_TagString: Untagged
  m_Icon: {fileID: 0}
  m_NavMeshLayer: 0
  m_StaticEditorFlags: 0
  m_IsActive: 1
--- !u!4 &1426712542
Transform:
  m_ObjectHideFlags: 0
  m_CorrespondingSourceObject: {fileID: 0}
  m_PrefabInstance: {fileID: 0}
  m_PrefabAsset: {fileID: 0}
  m_GameObject: {fileID: 1426712541}
  m_LocalRotation: {x: -0, y: -0, z: -0, w: 1}
  m_LocalPosition: {x: 0, y: 0, z: 0}
  m_LocalScale: {x: 0.018181818, y: 0.018181818, z: 0.018181818}
  m_Children: []
  m_Father: {fileID: 6328759479451180978}
  m_RootOrder: 4
  m_LocalEulerAnglesHint: {x: 0, y: 0, z: 0}
--- !u!114 &1176362810
MonoBehaviour:
  m_ObjectHideFlags: 0
  m_CorrespondingSourceObject: {fileID: 0}
  m_PrefabInstance: {fileID: 0}
  m_PrefabAsset: {fileID: 0}
  m_GameObject: {fileID: 6323335699682756836}
  m_Enabled: 1
  m_EditorHideFlags: 0
  m_Script: {fileID: 11500000, guid: 7131041864ed14f44865fa1d8e27b411, type: 3}
  m_Name: 
  m_EditorClassIdentifier: 
  character: {fileID: 6323335699682756836}
  characterSpeed: 5
  characterAnimator: {fileID: 6239045598699567272}
  directions: {fileID: 1176362812}
  startPoint: {fileID: 1136482694}
  endPoint: {fileID: 1426712542}
  map: {fileID: 0}
  rayPlane: {fileID: 0}
  _movementEndPoint: {fileID: 0}
  layerMask:
    serializedVersion: 2
    m_Bits: 131072
  cam: {fileID: 0}
--- !u!114 &1176362812
MonoBehaviour:
  m_ObjectHideFlags: 0
  m_CorrespondingSourceObject: {fileID: 0}
  m_PrefabInstance: {fileID: 0}
  m_PrefabAsset: {fileID: 0}
  m_GameObject: {fileID: 6323335699682756836}
  m_Enabled: 1
  m_EditorHideFlags: 0
  m_Script: {fileID: 11500000, guid: 3590ab21d4bcb49ba8fd090c53a5fc51, type: 3}
  m_Name: 
  m_EditorClassIdentifier: 
--- !u!1001 &6324210601195107864
PrefabInstance:
  m_ObjectHideFlags: 0
  serializedVersion: 2
  m_Modification:
    m_TransformParent: {fileID: 0}
    m_Modifications:
    - target: {fileID: 4601729990306218, guid: b4281c0219e45624e855839527bdc6f1, type: 3}
      propertyPath: m_RootOrder
      value: 0
      objectReference: {fileID: 0}
    - target: {fileID: 4601729990306218, guid: b4281c0219e45624e855839527bdc6f1, type: 3}
      propertyPath: m_LocalPosition.x
      value: 0
      objectReference: {fileID: 0}
    - target: {fileID: 4601729990306218, guid: b4281c0219e45624e855839527bdc6f1, type: 3}
      propertyPath: m_LocalPosition.y
      value: 0
      objectReference: {fileID: 0}
    - target: {fileID: 4601729990306218, guid: b4281c0219e45624e855839527bdc6f1, type: 3}
      propertyPath: m_LocalPosition.z
      value: 0
      objectReference: {fileID: 0}
    - target: {fileID: 4601729990306218, guid: b4281c0219e45624e855839527bdc6f1, type: 3}
      propertyPath: m_LocalRotation.w
      value: 1
      objectReference: {fileID: 0}
    - target: {fileID: 4601729990306218, guid: b4281c0219e45624e855839527bdc6f1, type: 3}
      propertyPath: m_LocalRotation.x
      value: 0
      objectReference: {fileID: 0}
    - target: {fileID: 4601729990306218, guid: b4281c0219e45624e855839527bdc6f1, type: 3}
      propertyPath: m_LocalRotation.y
      value: 0
      objectReference: {fileID: 0}
    - target: {fileID: 4601729990306218, guid: b4281c0219e45624e855839527bdc6f1, type: 3}
      propertyPath: m_LocalRotation.z
      value: 0
      objectReference: {fileID: 0}
    - target: {fileID: 114672260392319182, guid: b4281c0219e45624e855839527bdc6f1,
        type: 3}
      propertyPath: Target
      value: 
      objectReference: {fileID: 0}
    - target: {fileID: 114672260392319182, guid: b4281c0219e45624e855839527bdc6f1,
        type: 3}
      propertyPath: moveSpeed
      value: 5
      objectReference: {fileID: 0}
    - target: {fileID: 114672260392319182, guid: b4281c0219e45624e855839527bdc6f1,
        type: 3}
      propertyPath: rotationSpeed
      value: 1
      objectReference: {fileID: 0}
    m_RemovedComponents: []
  m_SourcePrefab: {fileID: 100100000, guid: b4281c0219e45624e855839527bdc6f1, type: 3}
--- !u!1 &6323335699682756836 stripped
GameObject:
  m_CorrespondingSourceObject: {fileID: 1438539700862716, guid: b4281c0219e45624e855839527bdc6f1,
    type: 3}
  m_PrefabInstance: {fileID: 6324210601195107864}
  m_PrefabAsset: {fileID: 0}
--- !u!4 &6328759479451180978 stripped
Transform:
  m_CorrespondingSourceObject: {fileID: 4601729990306218, guid: b4281c0219e45624e855839527bdc6f1,
    type: 3}
  m_PrefabInstance: {fileID: 6324210601195107864}
  m_PrefabAsset: {fileID: 0}
--- !u!95 &6239045598699567272 stripped
Animator:
  m_CorrespondingSourceObject: {fileID: 95022966287224496, guid: b4281c0219e45624e855839527bdc6f1,
    type: 3}
  m_PrefabInstance: {fileID: 6324210601195107864}
  m_PrefabAsset: {fileID: 0}
