<?xml version="1.0" encoding="UTF-8" ?>
<testsuite tests="56" failures="0" name="TestRunner" time="0.146" errors="0" skipped="48">
  <properties>
    <property name="idea.version" value="2020.2.1"/>
    <property name="java.runtime.name" value="Java(TM) SE Runtime Environment"/>
    <property name="sun.boot.library.path" value="/Library/Java/JavaVirtualMachines/jdk1.8.0_261.jdk/Contents/Home/jre/lib"/>
    <property name="java.vm.version" value="25.261-b12"/>
    <property name="gopherProxySet" value="false"/>
    <property name="java.vm.vendor" value="Oracle Corporation"/>
    <property name="maven.multiModuleProjectDirectory" value="/Users/webautomation/AutomationRepo/restAssuredBDDFramework"/>
    <property name="java.vendor.url" value="http://java.oracle.com/"/>
    <property name="path.separator" value=":"/>
    <property name="guice.disable.misplaced.annotation.check" value="true"/>
    <property name="java.vm.name" value="Java HotSpot(TM) 64-Bit Server VM"/>
    <property name="file.encoding.pkg" value="sun.io"/>
    <property name="user.country" value="GB"/>
    <property name="sun.java.launcher" value="SUN_STANDARD"/>
    <property name="sun.os.patch.level" value="unknown"/>
    <property name="java.vm.specification.name" value="Java Virtual Machine Specification"/>
    <property name="user.dir" value="/Users/webautomation/AutomationRepo/restAssuredBDDFramework"/>
    <property name="java.runtime.version" value="1.8.0_261-b12"/>
    <property name="java.awt.graphicsenv" value="sun.awt.CGraphicsEnvironment"/>
    <property name="java.endorsed.dirs" value="/Library/Java/JavaVirtualMachines/jdk1.8.0_261.jdk/Contents/Home/jre/lib/endorsed"/>
    <property name="os.arch" value="x86_64"/>
    <property name="java.io.tmpdir" value="/var/folders/vz/w0p7x7fs19d2ntp20qnptd100000gn/T/"/>
    <property name="line.separator" value="
"/>
    <property name="java.vm.specification.vendor" value="Oracle Corporation"/>
    <property name="os.name" value="Mac OS X"/>
    <property name="maven.ext.class.path" value="/Applications/IntelliJ IDEA CE.app/Contents/plugins/maven/lib/maven-event-listener.jar"/>
    <property name="classworlds.conf" value="/Applications/IntelliJ IDEA CE.app/Contents/plugins/maven/lib/maven3/bin/m2.conf"/>
    <property name="sun.jnu.encoding" value="UTF-8"/>
    <property name="java.library.path" value="/Users/webautomation/Library/Java/Extensions:/Library/Java/Extensions:/Network/Library/Java/Extensions:/System/Library/Java/Extensions:/usr/lib/java:."/>
    <property name="maven.conf" value="/Applications/IntelliJ IDEA CE.app/Contents/plugins/maven/lib/maven3/conf"/>
    <property name="java.specification.name" value="Java Platform API Specification"/>
    <property name="java.class.version" value="52.0"/>
    <property name="sun.management.compiler" value="HotSpot 64-Bit Tiered Compilers"/>
    <property name="os.version" value="10.15.7"/>
    <property name="http.nonProxyHosts" value="local|*.local|169.254/16|*.169.254/16"/>
    <property name="user.home" value="/Users/webautomation"/>
    <property name="user.timezone" value="Europe/London"/>
    <property name="java.awt.printerjob" value="sun.lwawt.macosx.CPrinterJob"/>
    <property name="java.specification.version" value="1.8"/>
    <property name="file.encoding" value="UTF-8"/>
    <property name="user.name" value="webautomation"/>
    <property name="java.class.path" value="/Applications/IntelliJ IDEA CE.app/Contents/plugins/maven/lib/maven3/boot/plexus-classworlds.license:/Applications/IntelliJ IDEA CE.app/Contents/plugins/maven/lib/maven3/boot/plexus-classworlds-2.6.0.jar:/Applications/IntelliJ IDEA CE.app/Contents/lib/idea_rt.jar"/>
    <property name="java.vm.specification.version" value="1.8"/>
    <property name="sun.arch.data.model" value="64"/>
    <property name="java.home" value="/Library/Java/JavaVirtualMachines/jdk1.8.0_261.jdk/Contents/Home/jre"/>
    <property name="sun.java.command" value="org.codehaus.classworlds.Launcher -Didea.version=2020.2.1 clean install"/>
    <property name="java.specification.vendor" value="Oracle Corporation"/>
    <property name="user.language" value="en"/>
    <property name="awt.toolkit" value="sun.lwawt.macosx.LWCToolkit"/>
    <property name="java.vm.info" value="mixed mode"/>
    <property name="java.version" value="1.8.0_261"/>
    <property name="java.ext.dirs" value="/Users/webautomation/Library/Java/Extensions:/Library/Java/JavaVirtualMachines/jdk1.8.0_261.jdk/Contents/Home/jre/lib/ext:/Library/Java/Extensions:/Network/Library/Java/Extensions:/System/Library/Java/Extensions:/usr/lib/java"/>
    <property name="sun.boot.class.path" value="/Library/Java/JavaVirtualMachines/jdk1.8.0_261.jdk/Contents/Home/jre/lib/resources.jar:/Library/Java/JavaVirtualMachines/jdk1.8.0_261.jdk/Contents/Home/jre/lib/rt.jar:/Library/Java/JavaVirtualMachines/jdk1.8.0_261.jdk/Contents/Home/jre/lib/sunrsasign.jar:/Library/Java/JavaVirtualMachines/jdk1.8.0_261.jdk/Contents/Home/jre/lib/jsse.jar:/Library/Java/JavaVirtualMachines/jdk1.8.0_261.jdk/Contents/Home/jre/lib/jce.jar:/Library/Java/JavaVirtualMachines/jdk1.8.0_261.jdk/Contents/Home/jre/lib/charsets.jar:/Library/Java/JavaVirtualMachines/jdk1.8.0_261.jdk/Contents/Home/jre/lib/jfr.jar:/Library/Java/JavaVirtualMachines/jdk1.8.0_261.jdk/Contents/Home/jre/classes"/>
    <property name="java.vendor" value="Oracle Corporation"/>
    <property name="maven.home" value="/Applications/IntelliJ IDEA CE.app/Contents/plugins/maven/lib/maven3"/>
    <property name="file.separator" value="/"/>
    <property name="java.vendor.url.bug" value="http://bugreport.sun.com/bugreport/"/>
    <property name="sun.cpu.endian" value="little"/>
    <property name="sun.io.unicode.encoding" value="UnicodeBig"/>
    <property name="socksNonProxyHosts" value="local|*.local|169.254/16|*.169.254/16"/>
    <property name="ftp.nonProxyHosts" value="local|*.local|169.254/16|*.169.254/16"/>
    <property name="sun.cpu.isalist" value=""/>
  </properties>
  <testcase classname="| https://jsonplaceholder.typicode.com/users/ |  | 200 | HTTP/1.1 200 OK | application/json | allUsers.json |" name="Given When User request GET API &quot;https://jsonplaceholder.typicode.com/users/&quot;" time="0.005">
    <skipped/>
    <system-out>Feature: End to End Tests for Social Network API
  Description: The purpose of these tests are to cover End to End happy flows and couple of negative for Social Network users.
  
  Below are the base URL = &quot;https://jsonplaceholder.typicode.com/&quot;
  and Couple of End Point URL&apos;s
  1. Make posts: https://jsonplaceholder.typicode.com/posts
  2. Comment on posts: https://jsonplaceholder.typicode.com/comments
  3. List of users: https://jsonplaceholder.typicode.com/users
  
  /*
  Imagine you are building a social network. Starting from simple functionality. Users are now
  able to make posts and comment on them. You are working in the backend team that
  exposes the service: https://jsonplaceholder.typicode.com/ which has the following
  endpoints:
  
  1. Make posts: https://jsonplaceholder.typicode.com/posts
  2. Comment on posts: https://jsonplaceholder.typicode.com/comments
  3. List of users: https://jsonplaceholder.typicode.com/users
  */

  #    Given I am an authorized user
  #  Scenario: Validate the GET call with Valid Response
  #
  #  Given I perform GET operation for &quot;/post&quot;
  #  And I perform GET for the post number &quot;&quot;
  #  Then I should see the author name as &quot;&quot;
  #
  #
  #  Scenario: Validate the POST call with Valid Response
  #
  #    Given I perform POST operation for &quot;/post&quot;
  #  Scenario Outline: Validate the POST call with Valid Response
  #   Given User POST the API request &quot;&quot; and
  #    Given User sets the base API request &quot;&lt;URL&gt;&quot;
  #    And User sends the API request to get all the users
  #    Then User validate the response status is &quot;&lt;Code&gt;&quot;
  #    Examples:
  #      | URL                                        | Code |
  #      | https://jsonplaceholder.typicode.com/posts | 201  |
  #      | https://jsonplaceholder.typicode.com/post  | 404  |
  #
  #  @user @positive
  #  Scenario: Enter a valid userId
  #    When I input a valid userId &quot;1&quot;
  #    Then I should have the status code &quot;200&quot;
  #    And content type should be in &quot;JSON&quot; format
  #    And the body response content should be matched
  #      | key        | value                  |
  #      | id         | 1                      |
  #      | name       | Leanne Graham          |
  #      | username   | Bret                   |
  #      | email      | Sincere@april.biz      |
  #      | phone      | 1-770-736-8031 x56442  |
  #      | website    | hildegard.org          |
  #
  #
  #  @CommentOnPost-POSTMethod
  #  Scenario Outline: Enter an invalid UserId
  #    Given When User make a post by POST API &quot;&lt;URL&gt;&quot; get the response &quot;&lt;Code&gt;&quot;
  #    Examples:
  #      | URL                                           | Code |
  #      | https://jsonplaceholder.typicode.com/comments | 201  |
  #      | https://jsonplaceholder.typicode.com/comment  | 404  |
  #
  #  @GetListOfUsers-GETMethod
  #  Scenario Outline: Enter an invalid UserId
  #    Given When User make a request for specific User &quot;&lt;pathParameter&gt;&quot; by using the GET &quot;&lt;URI&gt;&quot; with queryParameter &quot;&lt;queryParameter&gt;&quot; and User should get the response code as &quot;&lt;responseCode&gt;&quot;
  #    Examples:
  #      | URI                                   | pathParameter | queryParameter | responseCode |
  #      | https://jsonplaceholder.typicode.com/ | users         | 1              | 200          |
  #      | https://jsonplaceholder.typicode.com/ | users         | 2              | 200          |
  #      | https://jsonplaceholder.typicode.com/ | user          | 1              | 404          |
  #      | https://jsonplaceholder.typicode.com/ | users         | 100            | 200          |
  @GetListOfAllUsers-GETMethod
  Scenario Outline: Enter an invalid UserId                        # GetPost.feature:80
    Given When User request GET API &quot;&lt;URI&gt;&quot;
    Then User expect the response code &quot;&lt;responseCode&gt;&quot;
    Then User expect the response statusLineCode &quot;&lt;stateLineCode&gt;&quot;
    And User expect the response content type &quot;&lt;contentType&gt;&quot;
    And User validate the response schema as per &quot;&lt;schemaSample&gt;&quot;

    Examples: 

  Background: User generates token for Authorization # GetPost.feature:21
</system-out>
  </testcase>
  <testcase classname="| https://jsonplaceholder.typicode.com/users/ |  | 200 | HTTP/1.1 200 OK | application/json | allUsers.json |" name="Then User expect the response code &quot;200&quot;" time="0.005">
    <skipped/>
  </testcase>
  <testcase classname="| https://jsonplaceholder.typicode.com/users/ |  | 200 | HTTP/1.1 200 OK | application/json | allUsers.json |" name="Then User expect the response statusLineCode &quot;HTTP/1.1 200 OK&quot;" time="0.005">
    <skipped/>
  </testcase>
  <testcase classname="| https://jsonplaceholder.typicode.com/users/ |  | 200 | HTTP/1.1 200 OK | application/json | allUsers.json |" name="And User expect the response content type &quot;application/json&quot;" time="0.005">
    <skipped/>
  </testcase>
  <testcase classname="| https://jsonplaceholder.typicode.com/users/ |  | 200 | HTTP/1.1 200 OK | application/json | allUsers.json |" name="And User validate the response schema as per &quot;allUsers.json&quot;" time="0.005">
    <skipped/>
  </testcase>
  <testcase classname="| https://jsonplaceholder.typicode.com/users/ |  | 200 | HTTP/1.1 200 OK | application/json | allUsers.json |" name="| https://jsonplaceholder.typicode.com/users/ |  | 200 | HTTP/1.1 200 OK | application/json | allUsers.json |" time="0.006">
    <skipped/>
  </testcase>
  <testcase classname="| https://jsonplaceholder.typicode.com/users/ |  | 200 | HTTP/1.1 200 OK | application/json | allUsers.json |" name="| https://jsonplaceholder.typicode.com/users/ |  | 200 | HTTP/1.1 200 OK | application/json | allUsers.json |" time="0.006"/>
  <testcase classname="| https://jsonplaceholder.typicode.com/user/ |  | 404 | HTTP/1.1 404 Not Found | application/json | empty.json |" name="Given When User request GET API &quot;https://jsonplaceholder.typicode.com/user/&quot;" time="0.002">
    <skipped/>
    <system-out>
  @GetListOfAllUsers-GETMethod
  Scenario Outline: Enter an invalid UserId                                       # GetPost.feature:88
    Given When User request GET API &quot;https://jsonplaceholder.typicode.com/users/&quot;
    Then User expect the response code &quot;200&quot;
    Then User expect the response statusLineCode &quot;HTTP/1.1 200 OK&quot;
    And User expect the response content type &quot;application/json&quot;
    And User validate the response schema as per &quot;allUsers.json&quot;

  Background: User generates token for Authorization # GetPost.feature:21
</system-out>
  </testcase>
  <testcase classname="| https://jsonplaceholder.typicode.com/user/ |  | 404 | HTTP/1.1 404 Not Found | application/json | empty.json |" name="Then User expect the response code &quot;404&quot;" time="0.002">
    <skipped/>
  </testcase>
  <testcase classname="| https://jsonplaceholder.typicode.com/user/ |  | 404 | HTTP/1.1 404 Not Found | application/json | empty.json |" name="Then User expect the response statusLineCode &quot;HTTP/1.1 404 Not Found&quot;" time="0.003">
    <skipped/>
  </testcase>
  <testcase classname="| https://jsonplaceholder.typicode.com/user/ |  | 404 | HTTP/1.1 404 Not Found | application/json | empty.json |" name="And User expect the response content type &quot;application/json&quot;" time="0.004">
    <skipped/>
  </testcase>
  <testcase classname="| https://jsonplaceholder.typicode.com/user/ |  | 404 | HTTP/1.1 404 Not Found | application/json | empty.json |" name="And User validate the response schema as per &quot;empty.json&quot;" time="0.004">
    <skipped/>
  </testcase>
  <testcase classname="| https://jsonplaceholder.typicode.com/user/ |  | 404 | HTTP/1.1 404 Not Found | application/json | empty.json |" name="| https://jsonplaceholder.typicode.com/user/ |  | 404 | HTTP/1.1 404 Not Found | application/json | empty.json |" time="0.004">
    <skipped/>
  </testcase>
  <testcase classname="| https://jsonplaceholder.typicode.com/user/ |  | 404 | HTTP/1.1 404 Not Found | application/json | empty.json |" name="| https://jsonplaceholder.typicode.com/user/ |  | 404 | HTTP/1.1 404 Not Found | application/json | empty.json |" time="0.004"/>
  <testcase classname="| https://jsonplaceholder.typicode.com/users | 1 | 200 | HTTP/1.1 200 OK | application/json | user.json |" name="Given When User request GET API &quot;https://jsonplaceholder.typicode.com/users&quot; with queryParameter &quot;1&quot;" time="0.002">
    <skipped/>
    <system-out>
  @GetListOfAllUsers-GETMethod
  Scenario Outline: Enter an invalid UserId                                      # GetPost.feature:89
    Given When User request GET API &quot;https://jsonplaceholder.typicode.com/user/&quot;
    Then User expect the response code &quot;404&quot;
    Then User expect the response statusLineCode &quot;HTTP/1.1 404 Not Found&quot;
    And User expect the response content type &quot;application/json&quot;
    And User validate the response schema as per &quot;empty.json&quot;

  @GetListOfSpecificUser-GETMethod
  Scenario Outline: Enter an invalid UserId                                        # GetPost.feature:92
    Given When User request GET API &quot;&lt;URI&gt;&quot; with queryParameter &quot;&lt;queryParameter&gt;&quot;
    Then User expect the response code &quot;&lt;responseCode&gt;&quot;
    Then User expect the response statusLineCode &quot;&lt;stateLineCode&gt;&quot;
    And User expect the response content type &quot;&lt;contentType&gt;&quot;
    And User validate the response schema as per &quot;&lt;schemaSample&gt;&quot;

    Examples: 

  Background: User generates token for Authorization # GetPost.feature:21
</system-out>
  </testcase>
  <testcase classname="| https://jsonplaceholder.typicode.com/users | 1 | 200 | HTTP/1.1 200 OK | application/json | user.json |" name="Then User expect the response code &quot;200&quot;" time="0.002">
    <skipped/>
  </testcase>
  <testcase classname="| https://jsonplaceholder.typicode.com/users | 1 | 200 | HTTP/1.1 200 OK | application/json | user.json |" name="Then User expect the response statusLineCode &quot;HTTP/1.1 200 OK&quot;" time="0.002">
    <skipped/>
  </testcase>
  <testcase classname="| https://jsonplaceholder.typicode.com/users | 1 | 200 | HTTP/1.1 200 OK | application/json | user.json |" name="And User expect the response content type &quot;application/json&quot;" time="0.003">
    <skipped/>
  </testcase>
  <testcase classname="| https://jsonplaceholder.typicode.com/users | 1 | 200 | HTTP/1.1 200 OK | application/json | user.json |" name="And User validate the response schema as per &quot;user.json&quot;" time="0.003">
    <skipped/>
  </testcase>
  <testcase classname="| https://jsonplaceholder.typicode.com/users | 1 | 200 | HTTP/1.1 200 OK | application/json | user.json |" name="| https://jsonplaceholder.typicode.com/users | 1 | 200 | HTTP/1.1 200 OK | application/json | user.json |" time="0.003">
    <skipped/>
  </testcase>
  <testcase classname="| https://jsonplaceholder.typicode.com/users | 1 | 200 | HTTP/1.1 200 OK | application/json | user.json |" name="| https://jsonplaceholder.typicode.com/users | 1 | 200 | HTTP/1.1 200 OK | application/json | user.json |" time="0.003"/>
  <testcase classname="| https://jsonplaceholder.typicode.com/users | 2 | 200 | HTTP/1.1 200 OK | application/json | user.json |" name="Given When User request GET API &quot;https://jsonplaceholder.typicode.com/users&quot; with queryParameter &quot;2&quot;" time="0.002">
    <skipped/>
    <system-out>
  @GetListOfSpecificUser-GETMethod
  Scenario Outline: Enter an invalid UserId                                                              # GetPost.feature:100
    Given When User request GET API &quot;https://jsonplaceholder.typicode.com/users&quot; with queryParameter &quot;1&quot;
    Then User expect the response code &quot;200&quot;
    Then User expect the response statusLineCode &quot;HTTP/1.1 200 OK&quot;
    And User expect the response content type &quot;application/json&quot;
    And User validate the response schema as per &quot;user.json&quot;

  Background: User generates token for Authorization # GetPost.feature:21
</system-out>
  </testcase>
  <testcase classname="| https://jsonplaceholder.typicode.com/users | 2 | 200 | HTTP/1.1 200 OK | application/json | user.json |" name="Then User expect the response code &quot;200&quot;" time="0.002">
    <skipped/>
  </testcase>
  <testcase classname="| https://jsonplaceholder.typicode.com/users | 2 | 200 | HTTP/1.1 200 OK | application/json | user.json |" name="Then User expect the response statusLineCode &quot;HTTP/1.1 200 OK&quot;" time="0.003">
    <skipped/>
  </testcase>
  <testcase classname="| https://jsonplaceholder.typicode.com/users | 2 | 200 | HTTP/1.1 200 OK | application/json | user.json |" name="And User expect the response content type &quot;application/json&quot;" time="0.003">
    <skipped/>
  </testcase>
  <testcase classname="| https://jsonplaceholder.typicode.com/users | 2 | 200 | HTTP/1.1 200 OK | application/json | user.json |" name="And User validate the response schema as per &quot;user.json&quot;" time="0.003">
    <skipped/>
  </testcase>
  <testcase classname="| https://jsonplaceholder.typicode.com/users | 2 | 200 | HTTP/1.1 200 OK | application/json | user.json |" name="| https://jsonplaceholder.typicode.com/users | 2 | 200 | HTTP/1.1 200 OK | application/json | user.json |" time="0.003">
    <skipped/>
  </testcase>
  <testcase classname="| https://jsonplaceholder.typicode.com/users | 2 | 200 | HTTP/1.1 200 OK | application/json | user.json |" name="| https://jsonplaceholder.typicode.com/users | 2 | 200 | HTTP/1.1 200 OK | application/json | user.json |" time="0.003"/>
  <testcase classname="| https://jsonplaceholder.typicode.com/posts | 201 | HTTP/1.1 201 Created | application/json | postSchema.json |" name="Given When User request POST API &quot;https://jsonplaceholder.typicode.com/posts&quot;" time="0.001">
    <skipped/>
    <system-out>
  @GetListOfSpecificUser-GETMethod
  Scenario Outline: Enter an invalid UserId                                                              # GetPost.feature:101
    Given When User request GET API &quot;https://jsonplaceholder.typicode.com/users&quot; with queryParameter &quot;2&quot;
    Then User expect the response code &quot;200&quot;
    Then User expect the response statusLineCode &quot;HTTP/1.1 200 OK&quot;
    And User expect the response content type &quot;application/json&quot;
    And User validate the response schema as per &quot;user.json&quot;

  @MakeaPost-POSTMethod
  Scenario Outline: Enter an invalid UserId                        # GetPost.feature:105
    Given When User request POST API &quot;&lt;URI&gt;&quot;
    Then User expect the response code &quot;&lt;responseCode&gt;&quot;
    Then User expect the response statusLineCode &quot;&lt;stateLineCode&gt;&quot;
    And User expect the response content type &quot;&lt;contentType&gt;&quot;
    And User validate the response schema as per &quot;&lt;schemaSample&gt;&quot;

    Examples: 

  Background: User generates token for Authorization # GetPost.feature:21
</system-out>
  </testcase>
  <testcase classname="| https://jsonplaceholder.typicode.com/posts | 201 | HTTP/1.1 201 Created | application/json | postSchema.json |" name="Then User expect the response code &quot;201&quot;" time="0.001">
    <skipped/>
  </testcase>
  <testcase classname="| https://jsonplaceholder.typicode.com/posts | 201 | HTTP/1.1 201 Created | application/json | postSchema.json |" name="Then User expect the response statusLineCode &quot;HTTP/1.1 201 Created&quot;" time="0.001">
    <skipped/>
  </testcase>
  <testcase classname="| https://jsonplaceholder.typicode.com/posts | 201 | HTTP/1.1 201 Created | application/json | postSchema.json |" name="And User expect the response content type &quot;application/json&quot;" time="0.002">
    <skipped/>
  </testcase>
  <testcase classname="| https://jsonplaceholder.typicode.com/posts | 201 | HTTP/1.1 201 Created | application/json | postSchema.json |" name="And User validate the response schema as per &quot;postSchema.json&quot;" time="0.002">
    <skipped/>
  </testcase>
  <testcase classname="| https://jsonplaceholder.typicode.com/posts | 201 | HTTP/1.1 201 Created | application/json | postSchema.json |" name="| https://jsonplaceholder.typicode.com/posts | 201 | HTTP/1.1 201 Created | application/json | postSchema.json |" time="0.002">
    <skipped/>
  </testcase>
  <testcase classname="| https://jsonplaceholder.typicode.com/posts | 201 | HTTP/1.1 201 Created | application/json | postSchema.json |" name="| https://jsonplaceholder.typicode.com/posts | 201 | HTTP/1.1 201 Created | application/json | postSchema.json |" time="0.002"/>
  <testcase classname="| https://jsonplaceholder.typicode.com/post | 404 | HTTP/1.1 404 Not Found | application/json | empty.json |" name="Given When User request POST API &quot;https://jsonplaceholder.typicode.com/post&quot;" time="0.001">
    <skipped/>
    <system-out>
  @MakeaPost-POSTMethod
  Scenario Outline: Enter an invalid UserId                                       # GetPost.feature:113
    Given When User request POST API &quot;https://jsonplaceholder.typicode.com/posts&quot;
    Then User expect the response code &quot;201&quot;
    Then User expect the response statusLineCode &quot;HTTP/1.1 201 Created&quot;
    And User expect the response content type &quot;application/json&quot;
    And User validate the response schema as per &quot;postSchema.json&quot;

  Background: User generates token for Authorization # GetPost.feature:21
</system-out>
  </testcase>
  <testcase classname="| https://jsonplaceholder.typicode.com/post | 404 | HTTP/1.1 404 Not Found | application/json | empty.json |" name="Then User expect the response code &quot;404&quot;" time="0.001">
    <skipped/>
  </testcase>
  <testcase classname="| https://jsonplaceholder.typicode.com/post | 404 | HTTP/1.1 404 Not Found | application/json | empty.json |" name="Then User expect the response statusLineCode &quot;HTTP/1.1 404 Not Found&quot;" time="0.002">
    <skipped/>
  </testcase>
  <testcase classname="| https://jsonplaceholder.typicode.com/post | 404 | HTTP/1.1 404 Not Found | application/json | empty.json |" name="And User expect the response content type &quot;application/json&quot;" time="0.002">
    <skipped/>
  </testcase>
  <testcase classname="| https://jsonplaceholder.typicode.com/post | 404 | HTTP/1.1 404 Not Found | application/json | empty.json |" name="And User validate the response schema as per &quot;empty.json&quot;" time="0.002">
    <skipped/>
  </testcase>
  <testcase classname="| https://jsonplaceholder.typicode.com/post | 404 | HTTP/1.1 404 Not Found | application/json | empty.json |" name="| https://jsonplaceholder.typicode.com/post | 404 | HTTP/1.1 404 Not Found | application/json | empty.json |" time="0.002">
    <skipped/>
  </testcase>
  <testcase classname="| https://jsonplaceholder.typicode.com/post | 404 | HTTP/1.1 404 Not Found | application/json | empty.json |" name="| https://jsonplaceholder.typicode.com/post | 404 | HTTP/1.1 404 Not Found | application/json | empty.json |" time="0.002"/>
  <testcase classname="| https://jsonplaceholder.typicode.com/comments | 201 | HTTP/1.1 201 Created | application/json | postSchema.json |" name="Given When User request POST API &quot;https://jsonplaceholder.typicode.com/comments&quot;" time="0.001">
    <skipped/>
    <system-out>
  @MakeaPost-POSTMethod
  Scenario Outline: Enter an invalid UserId                                      # GetPost.feature:114
    Given When User request POST API &quot;https://jsonplaceholder.typicode.com/post&quot;
    Then User expect the response code &quot;404&quot;
    Then User expect the response statusLineCode &quot;HTTP/1.1 404 Not Found&quot;
    And User expect the response content type &quot;application/json&quot;
    And User validate the response schema as per &quot;empty.json&quot;

  @MakeaComment-POSTMethod
  Scenario Outline: Enter an invalid UserId                        # GetPost.feature:117
    Given When User request POST API &quot;&lt;URI&gt;&quot;
    Then User expect the response code &quot;&lt;responseCode&gt;&quot;
    Then User expect the response statusLineCode &quot;&lt;stateLineCode&gt;&quot;
    And User expect the response content type &quot;&lt;contentType&gt;&quot;
    And User validate the response schema as per &quot;&lt;schemaSample&gt;&quot;

    Examples: 

  Background: User generates token for Authorization # GetPost.feature:21
</system-out>
  </testcase>
  <testcase classname="| https://jsonplaceholder.typicode.com/comments | 201 | HTTP/1.1 201 Created | application/json | postSchema.json |" name="Then User expect the response code &quot;201&quot;" time="0.001">
    <skipped/>
  </testcase>
  <testcase classname="| https://jsonplaceholder.typicode.com/comments | 201 | HTTP/1.1 201 Created | application/json | postSchema.json |" name="Then User expect the response statusLineCode &quot;HTTP/1.1 201 Created&quot;" time="0.001">
    <skipped/>
  </testcase>
  <testcase classname="| https://jsonplaceholder.typicode.com/comments | 201 | HTTP/1.1 201 Created | application/json | postSchema.json |" name="And User expect the response content type &quot;application/json&quot;" time="0.001">
    <skipped/>
  </testcase>
  <testcase classname="| https://jsonplaceholder.typicode.com/comments | 201 | HTTP/1.1 201 Created | application/json | postSchema.json |" name="And User validate the response schema as per &quot;postSchema.json&quot;" time="0.002">
    <skipped/>
  </testcase>
  <testcase classname="| https://jsonplaceholder.typicode.com/comments | 201 | HTTP/1.1 201 Created | application/json | postSchema.json |" name="| https://jsonplaceholder.typicode.com/comments | 201 | HTTP/1.1 201 Created | application/json | postSchema.json |" time="0.002">
    <skipped/>
  </testcase>
  <testcase classname="| https://jsonplaceholder.typicode.com/comments | 201 | HTTP/1.1 201 Created | application/json | postSchema.json |" name="| https://jsonplaceholder.typicode.com/comments | 201 | HTTP/1.1 201 Created | application/json | postSchema.json |" time="0.002"/>
  <testcase classname="| https://jsonplaceholder.typicode.com/comment | 404 | HTTP/1.1 404 Not Found | application/json | empty.json |" name="Given When User request POST API &quot;https://jsonplaceholder.typicode.com/comment&quot;" time="0.002">
    <skipped/>
    <system-out>
  @MakeaComment-POSTMethod
  Scenario Outline: Enter an invalid UserId                                          # GetPost.feature:125
    Given When User request POST API &quot;https://jsonplaceholder.typicode.com/comments&quot;
    Then User expect the response code &quot;201&quot;
    Then User expect the response statusLineCode &quot;HTTP/1.1 201 Created&quot;
    And User expect the response content type &quot;application/json&quot;
    And User validate the response schema as per &quot;postSchema.json&quot;

  Background: User generates token for Authorization # GetPost.feature:21
</system-out>
  </testcase>
  <testcase classname="| https://jsonplaceholder.typicode.com/comment | 404 | HTTP/1.1 404 Not Found | application/json | empty.json |" name="Then User expect the response code &quot;404&quot;" time="0.002">
    <skipped/>
  </testcase>
  <testcase classname="| https://jsonplaceholder.typicode.com/comment | 404 | HTTP/1.1 404 Not Found | application/json | empty.json |" name="Then User expect the response statusLineCode &quot;HTTP/1.1 404 Not Found&quot;" time="0.002">
    <skipped/>
  </testcase>
  <testcase classname="| https://jsonplaceholder.typicode.com/comment | 404 | HTTP/1.1 404 Not Found | application/json | empty.json |" name="And User expect the response content type &quot;application/json&quot;" time="0.002">
    <skipped/>
  </testcase>
  <testcase classname="| https://jsonplaceholder.typicode.com/comment | 404 | HTTP/1.1 404 Not Found | application/json | empty.json |" name="And User validate the response schema as per &quot;empty.json&quot;" time="0.002">
    <skipped/>
  </testcase>
  <testcase classname="| https://jsonplaceholder.typicode.com/comment | 404 | HTTP/1.1 404 Not Found | application/json | empty.json |" name="| https://jsonplaceholder.typicode.com/comment | 404 | HTTP/1.1 404 Not Found | application/json | empty.json |" time="0.003">
    <skipped/>
  </testcase>
  <testcase classname="| https://jsonplaceholder.typicode.com/comment | 404 | HTTP/1.1 404 Not Found | application/json | empty.json |" name="| https://jsonplaceholder.typicode.com/comment | 404 | HTTP/1.1 404 Not Found | application/json | empty.json |" time="0.003"/>
</testsuite>