{
	"sectionburstingconfig": {
		"burstingrules": [
			{
				"contentType": "Smart Section",
				"sectionTypePath": "/document/section",
				"assetBrowserId": "SMART_SECTION_BROWSER"
			}
		]
	},
	"blockburstingconfig":{
		"burstingrules":[
			{
				"contentType": "Box",
				"assetBrowserId": "BOX_BROWSER",
				"selectors": [{
					"elementName": "region",
					"elementType": "box"
				}]
			},
			{
				"contentType": "Callout",
				"assetBrowserId": "CALLOUT_BROWSER",
				"selectors": [{
					"elementName": "region",
					"elementType": "callout"
				}]
			},
			{
				"contentType": "Smart Region",
				"assetBrowserId": "REGION_BROWSER",
				"selectors": [{
					"elementName": "region"
				}]
			},
			{
				"contentType": "Smart Table",
				"assetBrowserId": "STRUCTURED_TABLE_BROWSER",
				"selectors": [{
					"elementName": "table"
				}]
			}
		]
    },
    "editorconfigs": {
    	"ckeditorconfigs":[{
    		"name": "proofreader_defaultLanguage",
    		"value": "en-US"
    	}, 
    	{
    		"name": "proofreader_autoStartup",
    		"value": true
    	},
    	{
    		"name": "tracking_autoStartup",
    		"value": false
    	}]
    },
    "navMenus": [
    {
	    "id": "createComponent",
	    "label": "Section To Component"
    },
    {
	    "id": "delete",
	    "show": false
    },
    {
	    "id": "dialog3",
	    "show": false
    },
    {
	    "id": "submenu2",
	    "label": "More Options"
    }
    ],
    "extensions": [
        "nav"
    ]
}