{
  "$schema": "../../node_modules/ng-packagr/ng-package.schema.json",
  "dest": "../../dist/plugin-library",
  "deleteDestPath": false,
  "lib": {
    "entryFile": "src/public_api.ts",
    "umdModuleIds": {
      "@angular/core": "ngcore",
      "@angular/common": "ngcommon",
      "@angular/common/http": "ngcommonhttp",
      "@quark/qwc": "qwc",
      "@quark/platform-components-ng": "platformcomponentsng"
    }
  }
}