{
  "/components": {
    "target": "http://dbagga-dev:7000",
    "secure": false
  },
  "/auth": {
    "target": "http://dbagga-dev:31900/",
    "secure": false
  },
  "/notification": {
    "target": "ws://dbagga-dev:61420",
    "secure": false,
    "ws": true
  }
}