[
    {
        "ID": false,
        "key": "group_5ba4d0f1b4bb2",
        "title": "Featured Cities - HOME",
        "fields": [
            {
                "key": "field_5ba4d0feaf056",
                "label": "Favorite Cities Title",
                "name": "favorite_cities_title",
                "type": "text",
                "instructions": "",
                "required": 0,
                "conditional_logic": 0,
                "wrapper": {
                    "width": "",
                    "class": "",
                    "id": ""
                },
                "default_value": "",
                "placeholder": "",
                "prepend": "",
                "append": "",
                "maxlength": ""
            },
            {
                "key": "field_5ba4d112af057",
                "label": "Favorite Cities",
                "name": "featured_cities_repeater",
                "type": "taxonomy",
                "instructions": "",
                "required": 0,
                "conditional_logic": 0,
                "wrapper": {
                    "width": "",
                    "class": "",
                    "id": ""
                },
                "taxonomy": "location",
                "field_type": "multi_select",
                "allow_null": 0,
                "add_term": 0,
                "save_terms": 0,
                "load_terms": 0,
                "return_format": "id",
                "multiple": 0
            }
        ],
        "location": [
            [
                {
                    "param": "page_template",
                    "operator": "==",
                    "value": "page-homepage-landing.php"
                }
            ],
            [
                {
                    "param": "page_template",
                    "operator": "==",
                    "value": "page-homepage.php"
                }
            ]
        ],
        "menu_order": 0,
        "position": "normal",
        "style": "default",
        "label_placement": "top",
        "instruction_placement": "label",
        "hide_on_screen": "",
        "active": 1,
        "description": "",
        "_valid": 1
    }
]