[
  {
    "ID": false,
    "key": "group_5d0fc9e55b03d",
    "title": "Guest Service CTA",
    "fields": [
      {
        "key": "field_5d0fd3ec680fd",
        "label": "Enable CTA",
        "name": "enable_cta",
        "type": "true_false",
        "instructions": "",
        "required": 0,
        "conditional_logic": 0,
        "wrapper": {
          "width": "",
          "class": "",
          "id": ""
        },
        "message": "",
        "default_value": 0,
        "ui": 0,
        "ui_on_text": "",
        "ui_off_text": ""
      },
      {
        "key": "field_5d0fca0a4f680",
        "label": "promocode enable",
        "name": "promocode_enable",
        "type": "true_false",
        "instructions": "",
        "required": 0,
        "conditional_logic": 0,
        "wrapper": {
          "width": "",
          "class": "",
          "id": ""
        },
        "message": "",
        "default_value": 0,
        "ui": 0,
        "ui_on_text": "",
        "ui_off_text": ""
      },
      {
        "key": "field_5d0fca224f681",
        "label": "Promocode",
        "name": "promocode_val",
        "type": "text",
        "instructions": "",
        "required": 0,
        "conditional_logic": 0,
        "wrapper": {
          "width": "",
          "class": "",
          "id": ""
        },
        "default_value": "",
        "placeholder": "",
        "prepend": "",
        "append": "",
        "maxlength": ""
      },
      {
        "key": "field_5d0fca3e4f682",
        "label": "Discount URL",
        "name": "discount_url",
        "type": "link",
        "instructions": "",
        "required": 0,
        "conditional_logic": 0,
        "wrapper": {
          "width": "",
          "class": "",
          "id": ""
        },
        "return_format": "array"
      }
    ],
    "location": [
      [
        {
          "param": "post_type",
          "operator": "==",
          "value": "guestservice"
        }
      ]
    ],
    "menu_order": 0,
    "position": "normal",
    "style": "default",
    "label_placement": "top",
    "instruction_placement": "label",
    "hide_on_screen": "",
    "active": 1,
    "description": "",
    "_valid": 1
  }
]