[
    {
        "ID": false,
        "key": "group_5ad746688e5a8",
        "title": "On\/Off Popup",
        "fields": [
            {
                "key": "field_5a8ad20d8e032",
                "label": "On\/Off Popup",
                "name": "on_off_popup",
                "type": "true_false",
                "instructions": "",
                "required": 0,
                "conditional_logic": 0,
                "wrapper": {
                    "width": "",
                    "class": "",
                    "id": ""
                },
                "message": "",
                "default_value": 1,
                "ui": 0,
                "ui_on_text": "",
                "ui_off_text": ""
            }
        ],
        "location": [
            [
                {
                    "param": "page_template",
                    "operator": "==",
                    "value": "page-homepage.php"
                }
            ],
            [
                {
                    "param": "page_template",
                    "operator": "==",
                    "value": "page-search.php"
                }
            ]
        ],
        "menu_order": 0,
        "position": "normal",
        "style": "default",
        "label_placement": "top",
        "instruction_placement": "label",
        "hide_on_screen": [
            "the_content"
        ],
        "active": 1,
        "description": "",
        "_valid": 1
    }
]