[
    {
        "ID": false,
        "key": "group_5ad7473abf269",
        "title": "Static Search page",
        "fields": [
            {
                "key": "field_5b922d9866f74",
                "label": "City location",
                "name": "city_location",
                "type": "taxonomy",
                "instructions": "",
                "required": 0,
                "conditional_logic": 0,
                "wrapper": {
                    "width": "",
                    "class": "",
                    "id": ""
                },
                "taxonomy": "location",
                "field_type": "select",
                "allow_null": 0,
                "add_term": 1,
                "save_terms": 0,
                "load_terms": 0,
                "return_format": "id",
                "multiple": 0
            },
            {
                "key": "field_5adef68946fa5",
                "label": "Main title H1",
                "name": "search_static_main_title_h1",
                "type": "text",
                "instructions": "",
                "required": 0,
                "conditional_logic": 0,
                "wrapper": {
                    "width": "",
                    "class": "",
                    "id": ""
                },
                "default_value": "",
                "placeholder": "",
                "prepend": "",
                "append": "",
                "maxlength": "",
                "readonly": 0,
                "disabled": 0
            },
            {
                "key": "field_5ad74741ecc6e",
                "label": "Main title",
                "name": "search_static_main_title",
                "type": "text",
                "instructions": "",
                "required": 0,
                "conditional_logic": 0,
                "wrapper": {
                    "width": "",
                    "class": "",
                    "id": ""
                },
                "default_value": "",
                "placeholder": "",
                "prepend": "",
                "append": "",
                "maxlength": "",
                "readonly": 0,
                "disabled": 0
            },
            {
                "key": "field_5ad747a66590b",
                "label": "Property Boxes",
                "name": "search_static_property_boxes",
                "type": "repeater",
                "instructions": "",
                "required": 0,
                "conditional_logic": 0,
                "wrapper": {
                    "width": "",
                    "class": "",
                    "id": ""
                },
                "collapsed": "",
                "min": 0,
                "max": 0,
                "layout": "block",
                "button_label": "Add Box",
                "sub_fields": [
                    {
                        "key": "field_5ad747b76590c",
                        "label": "Image",
                        "name": "property_image",
                        "type": "image",
                        "instructions": "",
                        "required": 0,
                        "conditional_logic": 0,
                        "wrapper": {
                            "width": "",
                            "class": "",
                            "id": ""
                        },
                        "return_format": "array",
                        "preview_size": "thumbnail",
                        "library": "all",
                        "min_width": "",
                        "min_height": "",
                        "min_size": "",
                        "max_width": "",
                        "max_height": "",
                        "max_size": "",
                        "mime_types": ""
                    },
                    {
                        "key": "field_5ad747c66590d",
                        "label": "Title",
                        "name": "property_title",
                        "type": "text",
                        "instructions": "",
                        "required": 0,
                        "conditional_logic": 0,
                        "wrapper": {
                            "width": 50,
                            "class": "",
                            "id": ""
                        },
                        "default_value": "",
                        "placeholder": "",
                        "prepend": "",
                        "append": "",
                        "maxlength": "",
                        "readonly": 0,
                        "disabled": 0
                    },
                    {
                        "key": "field_5ad747cd6590e",
                        "label": "Location",
                        "name": "property_place",
                        "type": "text",
                        "instructions": "",
                        "required": 0,
                        "conditional_logic": 0,
                        "wrapper": {
                            "width": 50,
                            "class": "",
                            "id": ""
                        },
                        "default_value": "",
                        "placeholder": "",
                        "prepend": "",
                        "append": "",
                        "maxlength": "",
                        "readonly": 0,
                        "disabled": 0
                    },
                    {
                        "key": "field_5ad747db6590f",
                        "label": "Bedrooms",
                        "name": "property_bedrooms",
                        "type": "text",
                        "instructions": "",
                        "required": 0,
                        "conditional_logic": 0,
                        "wrapper": {
                            "width": 33,
                            "class": "",
                            "id": ""
                        },
                        "default_value": "",
                        "placeholder": "",
                        "prepend": "",
                        "append": "",
                        "maxlength": "",
                        "readonly": 0,
                        "disabled": 0
                    },
                    {
                        "key": "field_5ad747ee65910",
                        "label": "Bathrooms",
                        "name": "property_bathrooms",
                        "type": "text",
                        "instructions": "",
                        "required": 0,
                        "conditional_logic": 0,
                        "wrapper": {
                            "width": 33,
                            "class": "",
                            "id": ""
                        },
                        "default_value": "",
                        "placeholder": "",
                        "prepend": "",
                        "append": "",
                        "maxlength": "",
                        "readonly": 0,
                        "disabled": 0
                    },
                    {
                        "key": "field_5ad747fa65911",
                        "label": "Guests",
                        "name": "property_guests",
                        "type": "text",
                        "instructions": "",
                        "required": 0,
                        "conditional_logic": 0,
                        "wrapper": {
                            "width": 33,
                            "class": "",
                            "id": ""
                        },
                        "default_value": "",
                        "placeholder": "",
                        "prepend": "",
                        "append": "",
                        "maxlength": "",
                        "readonly": 0,
                        "disabled": 0
                    },
                    {
                        "key": "field_5ad7480f65912",
                        "label": "Price",
                        "name": "property_price",
                        "type": "text",
                        "instructions": "",
                        "required": 0,
                        "conditional_logic": 0,
                        "wrapper": {
                            "width": "",
                            "class": "",
                            "id": ""
                        },
                        "default_value": "",
                        "placeholder": "",
                        "prepend": "",
                        "append": "",
                        "maxlength": "",
                        "readonly": 0,
                        "disabled": 0
                    },
                    {
                        "key": "field_5ad7481765913",
                        "label": "Rating",
                        "name": "property_rating",
                        "type": "select",
                        "instructions": "Choose value",
                        "required": 0,
                        "conditional_logic": 0,
                        "wrapper": {
                            "width": 50,
                            "class": "",
                            "id": ""
                        },
                        "choices": {
                            "one": "1 Triangle",
                            "two": "2 Triangles",
                            "three": "3 Triangles"
                        },
                        "default_value": {
                            "one": "one"
                        },
                        "allow_null": 0,
                        "multiple": 0,
                        "ui": 0,
                        "ajax": 0,
                        "placeholder": "",
                        "disabled": 0,
                        "readonly": 0,
                        "return_format": "value"
                    },
                    {
                        "key": "field_5ad74ad3660a0",
                        "label": "Link to property",
                        "name": "link_to_property",
                        "type": "text",
                        "instructions": "Paste URL of property",
                        "required": 0,
                        "conditional_logic": 0,
                        "wrapper": {
                            "width": 50,
                            "class": "",
                            "id": ""
                        },
                        "default_value": "",
                        "placeholder": "",
                        "prepend": "",
                        "append": "",
                        "maxlength": "",
                        "readonly": 0,
                        "disabled": 0
                    }
                ]
            },
            {
                "key": "field_5adef705eb740",
                "label": "Text block",
                "name": "search_text_block",
                "type": "wysiwyg",
                "instructions": "",
                "required": 0,
                "conditional_logic": 0,
                "wrapper": {
                    "width": "",
                    "class": "",
                    "id": ""
                },
                "default_value": "",
                "tabs": "all",
                "toolbar": "full",
                "media_upload": 0,
                "delay": 0
            }
        ],
        "location": [
            [
                {
                    "param": "page_template",
                    "operator": "==",
                    "value": "page-search.php"
                }
            ]
        ],
        "menu_order": 0,
        "position": "normal",
        "style": "default",
        "label_placement": "top",
        "instruction_placement": "label",
        "hide_on_screen": [
            "the_content"
        ],
        "active": 1,
        "description": "",
        "_valid": 1
    }
]