<svg width="16" height="21" viewBox="0 0 16 21" fill="none" xmlns="http://www.w3.org/2000/svg">
<path fill-rule="evenodd" clip-rule="evenodd" d="M0.682129 7.96413C0.682129 3.91852 3.95416 0.646484 7.99977 0.646484C12.0454 0.646484 15.3174 3.91852 15.3174 7.96413C15.3174 12.3233 10.6968 18.3343 8.80471 20.6236C8.38656 21.1254 7.62343 21.1254 7.20528 20.6236C5.3027 18.3343 0.682129 12.3233 0.682129 7.96413ZM5.38633 7.96413C5.38633 9.40675 6.55715 10.5776 7.99977 10.5776C9.44239 10.5776 10.6132 9.40675 10.6132 7.96413C10.6132 6.52151 9.44239 5.35068 7.99977 5.35068C6.55715 5.35068 5.38633 6.52151 5.38633 7.96413Z" fill="#FAFAFA"/>
</svg>
