%YAML 1.1
%TAG !u! tag:unity3d.com,2011:
--- !u!1 &7508904976395563602
GameObject:
  m_ObjectHideFlags: 0
  m_CorrespondingSourceObject: {fileID: 0}
  m_PrefabInstance: {fileID: 0}
  m_PrefabAsset: {fileID: 0}
  serializedVersion: 6
  m_Component:
  - component: {fileID: 1211856977262876550}
  - component: {fileID: 5171369783679460643}
  - component: {fileID: 6134342559229035531}
  m_Layer: 5
  m_Name: Txt_Issue
  m_TagString: Untagged
  m_Icon: {fileID: 0}
  m_NavMeshLayer: 0
  m_StaticEditorFlags: 0
  m_IsActive: 1
--- !u!224 &1211856977262876550
RectTransform:
  m_ObjectHideFlags: 0
  m_CorrespondingSourceObject: {fileID: 0}
  m_PrefabInstance: {fileID: 0}
  m_PrefabAsset: {fileID: 0}
  m_GameObject: {fileID: 7508904976395563602}
  m_LocalRotation: {x: 0, y: 0, z: 0, w: 1}
  m_LocalPosition: {x: 0, y: 0, z: 0}
  m_LocalScale: {x: 1, y: 1, z: 1}
  m_ConstrainProportionsScale: 0
  m_Children: []
  m_Father: {fileID: 4300565008019804269}
  m_RootOrder: 0
  m_LocalEulerAnglesHint: {x: 0, y: 0, z: 0}
  m_AnchorMin: {x: 0.05, y: 0}
  m_AnchorMax: {x: 0.95, y: 1}
  m_AnchoredPosition: {x: 0, y: 105}
  m_SizeDelta: {x: 0, y: -250}
  m_Pivot: {x: 0.5, y: 0.5}
--- !u!222 &5171369783679460643
CanvasRenderer:
  m_ObjectHideFlags: 0
  m_CorrespondingSourceObject: {fileID: 0}
  m_PrefabInstance: {fileID: 0}
  m_PrefabAsset: {fileID: 0}
  m_GameObject: {fileID: 7508904976395563602}
  m_CullTransparentMesh: 1
--- !u!114 &6134342559229035531
MonoBehaviour:
  m_ObjectHideFlags: 0
  m_CorrespondingSourceObject: {fileID: 0}
  m_PrefabInstance: {fileID: 0}
  m_PrefabAsset: {fileID: 0}
  m_GameObject: {fileID: 7508904976395563602}
  m_Enabled: 1
  m_EditorHideFlags: 0
  m_Script: {fileID: 11500000, guid: f4688fdb7df04437aeb418b961361dc5, type: 3}
  m_Name: 
  m_EditorClassIdentifier: 
  m_Material: {fileID: 0}
  m_Color: {r: 1, g: 1, b: 1, a: 1}
  m_RaycastTarget: 1
  m_RaycastPadding: {x: 0, y: 0, z: 0, w: 0}
  m_Maskable: 1
  m_OnCullStateChanged:
    m_PersistentCalls:
      m_Calls: []
  m_text: No internet
  m_isRightToLeft: 0
  m_fontAsset: {fileID: 11400000, guid: 8f586378b4e144a9851e7b34d9b748ee, type: 2}
  m_sharedMaterial: {fileID: 2180264, guid: 8f586378b4e144a9851e7b34d9b748ee, type: 2}
  m_fontSharedMaterials: []
  m_fontMaterial: {fileID: 0}
  m_fontMaterials: []
  m_fontColor32:
    serializedVersion: 2
    rgba: 4294967295
  m_fontColor: {r: 1, g: 1, b: 1, a: 1}
  m_enableVertexGradient: 0
  m_colorMode: 3
  m_fontColorGradient:
    topLeft: {r: 1, g: 1, b: 1, a: 1}
    topRight: {r: 1, g: 1, b: 1, a: 1}
    bottomLeft: {r: 1, g: 1, b: 1, a: 1}
    bottomRight: {r: 1, g: 1, b: 1, a: 1}
  m_fontColorGradientPreset: {fileID: 0}
  m_spriteAsset: {fileID: 0}
  m_tintAllSprites: 0
  m_StyleSheet: {fileID: 0}
  m_TextStyleHashCode: -1183493901
  m_overrideHtmlColors: 0
  m_faceColor:
    serializedVersion: 2
    rgba: 4294967295
  m_fontSize: 80
  m_fontSizeBase: 80
  m_fontWeight: 400
  m_enableAutoSizing: 0
  m_fontSizeMin: 18
  m_fontSizeMax: 72
  m_fontStyle: 17
  m_HorizontalAlignment: 2
  m_VerticalAlignment: 512
  m_textAlignment: 65535
  m_characterSpacing: 0
  m_wordSpacing: 0
  m_lineSpacing: 0
  m_lineSpacingMax: 0
  m_paragraphSpacing: 0
  m_charWidthMaxAdj: 0
  m_enableWordWrapping: 1
  m_wordWrappingRatios: 0.4
  m_overflowMode: 0
  m_linkedTextComponent: {fileID: 0}
  parentLinkedComponent: {fileID: 0}
  m_enableKerning: 1
  m_enableExtraPadding: 0
  checkPaddingRequired: 0
  m_isRichText: 1
  m_parseCtrlCharacters: 1
  m_isOrthographic: 1
  m_isCullingEnabled: 0
  m_horizontalMapping: 0
  m_verticalMapping: 0
  m_uvLineOffset: 0
  m_geometrySortingOrder: 0
  m_IsTextObjectScaleStatic: 0
  m_VertexBufferAutoSizeReduction: 0
  m_useMaxVisibleDescender: 1
  m_pageToDisplay: 1
  m_margin: {x: 0, y: 0, z: 0, w: 0}
  m_isUsingLegacyAnimationComponent: 0
  m_isVolumetricText: 0
  m_hasFontAssetChanged: 0
  m_baseMaterial: {fileID: 0}
  m_maskOffset: {x: 0, y: 0, z: 0, w: 0}
--- !u!1001 &2953897004140022004
PrefabInstance:
  m_ObjectHideFlags: 0
  serializedVersion: 2
  m_Modification:
    m_TransformParent: {fileID: 4300565008019804269}
    m_Modifications:
    - target: {fileID: 1341070712688354625, guid: b2c7c8583239aa04f899bf7c0bad0307, type: 3}
      propertyPath: m_Sprite
      value: 
      objectReference: {fileID: 21300000, guid: adeb124107fcd8945afca43e86740b35, type: 3}
    - target: {fileID: 1341070712688354628, guid: b2c7c8583239aa04f899bf7c0bad0307, type: 3}
      propertyPath: m_Name
      value: P_UI_BtnMenu-Ok
      objectReference: {fileID: 0}
    - target: {fileID: 1341070712688354631, guid: b2c7c8583239aa04f899bf7c0bad0307, type: 3}
      propertyPath: m_Pivot.x
      value: 0.5
      objectReference: {fileID: 0}
    - target: {fileID: 1341070712688354631, guid: b2c7c8583239aa04f899bf7c0bad0307, type: 3}
      propertyPath: m_Pivot.y
      value: 0
      objectReference: {fileID: 0}
    - target: {fileID: 1341070712688354631, guid: b2c7c8583239aa04f899bf7c0bad0307, type: 3}
      propertyPath: m_RootOrder
      value: 1
      objectReference: {fileID: 0}
    - target: {fileID: 1341070712688354631, guid: b2c7c8583239aa04f899bf7c0bad0307, type: 3}
      propertyPath: m_AnchorMax.x
      value: 0.7
      objectReference: {fileID: 0}
    - target: {fileID: 1341070712688354631, guid: b2c7c8583239aa04f899bf7c0bad0307, type: 3}
      propertyPath: m_AnchorMax.y
      value: 0
      objectReference: {fileID: 0}
    - target: {fileID: 1341070712688354631, guid: b2c7c8583239aa04f899bf7c0bad0307, type: 3}
      propertyPath: m_AnchorMin.x
      value: 0.3
      objectReference: {fileID: 0}
    - target: {fileID: 1341070712688354631, guid: b2c7c8583239aa04f899bf7c0bad0307, type: 3}
      propertyPath: m_AnchorMin.y
      value: 0
      objectReference: {fileID: 0}
    - target: {fileID: 1341070712688354631, guid: b2c7c8583239aa04f899bf7c0bad0307, type: 3}
      propertyPath: m_SizeDelta.x
      value: 0
      objectReference: {fileID: 0}
    - target: {fileID: 1341070712688354631, guid: b2c7c8583239aa04f899bf7c0bad0307, type: 3}
      propertyPath: m_SizeDelta.y
      value: 200
      objectReference: {fileID: 0}
    - target: {fileID: 1341070712688354631, guid: b2c7c8583239aa04f899bf7c0bad0307, type: 3}
      propertyPath: m_LocalPosition.x
      value: 0
      objectReference: {fileID: 0}
    - target: {fileID: 1341070712688354631, guid: b2c7c8583239aa04f899bf7c0bad0307, type: 3}
      propertyPath: m_LocalPosition.y
      value: 0
      objectReference: {fileID: 0}
    - target: {fileID: 1341070712688354631, guid: b2c7c8583239aa04f899bf7c0bad0307, type: 3}
      propertyPath: m_LocalPosition.z
      value: 0
      objectReference: {fileID: 0}
    - target: {fileID: 1341070712688354631, guid: b2c7c8583239aa04f899bf7c0bad0307, type: 3}
      propertyPath: m_LocalRotation.w
      value: 1
      objectReference: {fileID: 0}
    - target: {fileID: 1341070712688354631, guid: b2c7c8583239aa04f899bf7c0bad0307, type: 3}
      propertyPath: m_LocalRotation.x
      value: -0
      objectReference: {fileID: 0}
    - target: {fileID: 1341070712688354631, guid: b2c7c8583239aa04f899bf7c0bad0307, type: 3}
      propertyPath: m_LocalRotation.y
      value: -0
      objectReference: {fileID: 0}
    - target: {fileID: 1341070712688354631, guid: b2c7c8583239aa04f899bf7c0bad0307, type: 3}
      propertyPath: m_LocalRotation.z
      value: -0
      objectReference: {fileID: 0}
    - target: {fileID: 1341070712688354631, guid: b2c7c8583239aa04f899bf7c0bad0307, type: 3}
      propertyPath: m_AnchoredPosition.x
      value: 0
      objectReference: {fileID: 0}
    - target: {fileID: 1341070712688354631, guid: b2c7c8583239aa04f899bf7c0bad0307, type: 3}
      propertyPath: m_AnchoredPosition.y
      value: 20
      objectReference: {fileID: 0}
    - target: {fileID: 1341070712688354631, guid: b2c7c8583239aa04f899bf7c0bad0307, type: 3}
      propertyPath: m_LocalEulerAnglesHint.x
      value: 0
      objectReference: {fileID: 0}
    - target: {fileID: 1341070712688354631, guid: b2c7c8583239aa04f899bf7c0bad0307, type: 3}
      propertyPath: m_LocalEulerAnglesHint.y
      value: 0
      objectReference: {fileID: 0}
    - target: {fileID: 1341070712688354631, guid: b2c7c8583239aa04f899bf7c0bad0307, type: 3}
      propertyPath: m_LocalEulerAnglesHint.z
      value: 0
      objectReference: {fileID: 0}
    - target: {fileID: 1341070712864991017, guid: b2c7c8583239aa04f899bf7c0bad0307, type: 3}
      propertyPath: m_Name
      value: Txt_Ok
      objectReference: {fileID: 0}
    - target: {fileID: 1341070712864991019, guid: b2c7c8583239aa04f899bf7c0bad0307, type: 3}
      propertyPath: m_text
      value: Ok
      objectReference: {fileID: 0}
    - target: {fileID: 1341070712864991019, guid: b2c7c8583239aa04f899bf7c0bad0307, type: 3}
      propertyPath: m_fontSize
      value: 70
      objectReference: {fileID: 0}
    - target: {fileID: 1341070712864991019, guid: b2c7c8583239aa04f899bf7c0bad0307, type: 3}
      propertyPath: m_fontSizeBase
      value: 70
      objectReference: {fileID: 0}
    m_RemovedComponents: []
  m_SourcePrefab: {fileID: 100100000, guid: b2c7c8583239aa04f899bf7c0bad0307, type: 3}
--- !u!1001 &9045678530889601912
PrefabInstance:
  m_ObjectHideFlags: 0
  serializedVersion: 2
  m_Modification:
    m_TransformParent: {fileID: 0}
    m_Modifications:
    - target: {fileID: 2738872360787838972, guid: 9287671e6140d14408c351294e7e98fd, type: 3}
      propertyPath: m_AspectRatio
      value: 1.6
      objectReference: {fileID: 0}
    - target: {fileID: 6097034989797402031, guid: 9287671e6140d14408c351294e7e98fd, type: 3}
      propertyPath: m_text
      value: oops !!!
      objectReference: {fileID: 0}
    - target: {fileID: 6097034991250219953, guid: 9287671e6140d14408c351294e7e98fd, type: 3}
      propertyPath: m_Name
      value: P_UI_Popup_SomethingWrong
      objectReference: {fileID: 0}
    - target: {fileID: 6097034991250219953, guid: 9287671e6140d14408c351294e7e98fd, type: 3}
      propertyPath: m_IsActive
      value: 1
      objectReference: {fileID: 0}
    - target: {fileID: 6097034991250219954, guid: 9287671e6140d14408c351294e7e98fd, type: 3}
      propertyPath: m_Pivot.x
      value: 0.5
      objectReference: {fileID: 0}
    - target: {fileID: 6097034991250219954, guid: 9287671e6140d14408c351294e7e98fd, type: 3}
      propertyPath: m_Pivot.y
      value: 0.5
      objectReference: {fileID: 0}
    - target: {fileID: 6097034991250219954, guid: 9287671e6140d14408c351294e7e98fd, type: 3}
      propertyPath: m_RootOrder
      value: 0
      objectReference: {fileID: 0}
    - target: {fileID: 6097034991250219954, guid: 9287671e6140d14408c351294e7e98fd, type: 3}
      propertyPath: m_AnchorMax.x
      value: 1
      objectReference: {fileID: 0}
    - target: {fileID: 6097034991250219954, guid: 9287671e6140d14408c351294e7e98fd, type: 3}
      propertyPath: m_AnchorMax.y
      value: 1
      objectReference: {fileID: 0}
    - target: {fileID: 6097034991250219954, guid: 9287671e6140d14408c351294e7e98fd, type: 3}
      propertyPath: m_AnchorMin.x
      value: 0
      objectReference: {fileID: 0}
    - target: {fileID: 6097034991250219954, guid: 9287671e6140d14408c351294e7e98fd, type: 3}
      propertyPath: m_AnchorMin.y
      value: 0
      objectReference: {fileID: 0}
    - target: {fileID: 6097034991250219954, guid: 9287671e6140d14408c351294e7e98fd, type: 3}
      propertyPath: m_SizeDelta.x
      value: 0
      objectReference: {fileID: 0}
    - target: {fileID: 6097034991250219954, guid: 9287671e6140d14408c351294e7e98fd, type: 3}
      propertyPath: m_SizeDelta.y
      value: 0
      objectReference: {fileID: 0}
    - target: {fileID: 6097034991250219954, guid: 9287671e6140d14408c351294e7e98fd, type: 3}
      propertyPath: m_LocalPosition.x
      value: 0
      objectReference: {fileID: 0}
    - target: {fileID: 6097034991250219954, guid: 9287671e6140d14408c351294e7e98fd, type: 3}
      propertyPath: m_LocalPosition.y
      value: 0
      objectReference: {fileID: 0}
    - target: {fileID: 6097034991250219954, guid: 9287671e6140d14408c351294e7e98fd, type: 3}
      propertyPath: m_LocalPosition.z
      value: 0
      objectReference: {fileID: 0}
    - target: {fileID: 6097034991250219954, guid: 9287671e6140d14408c351294e7e98fd, type: 3}
      propertyPath: m_LocalRotation.w
      value: 1
      objectReference: {fileID: 0}
    - target: {fileID: 6097034991250219954, guid: 9287671e6140d14408c351294e7e98fd, type: 3}
      propertyPath: m_LocalRotation.x
      value: 0
      objectReference: {fileID: 0}
    - target: {fileID: 6097034991250219954, guid: 9287671e6140d14408c351294e7e98fd, type: 3}
      propertyPath: m_LocalRotation.y
      value: 0
      objectReference: {fileID: 0}
    - target: {fileID: 6097034991250219954, guid: 9287671e6140d14408c351294e7e98fd, type: 3}
      propertyPath: m_LocalRotation.z
      value: 0
      objectReference: {fileID: 0}
    - target: {fileID: 6097034991250219954, guid: 9287671e6140d14408c351294e7e98fd, type: 3}
      propertyPath: m_AnchoredPosition.x
      value: 0
      objectReference: {fileID: 0}
    - target: {fileID: 6097034991250219954, guid: 9287671e6140d14408c351294e7e98fd, type: 3}
      propertyPath: m_AnchoredPosition.y
      value: 0
      objectReference: {fileID: 0}
    - target: {fileID: 6097034991250219954, guid: 9287671e6140d14408c351294e7e98fd, type: 3}
      propertyPath: m_LocalEulerAnglesHint.x
      value: 0
      objectReference: {fileID: 0}
    - target: {fileID: 6097034991250219954, guid: 9287671e6140d14408c351294e7e98fd, type: 3}
      propertyPath: m_LocalEulerAnglesHint.y
      value: 0
      objectReference: {fileID: 0}
    - target: {fileID: 6097034991250219954, guid: 9287671e6140d14408c351294e7e98fd, type: 3}
      propertyPath: m_LocalEulerAnglesHint.z
      value: 0
      objectReference: {fileID: 0}
    - target: {fileID: 6097034991270255967, guid: 9287671e6140d14408c351294e7e98fd, type: 3}
      propertyPath: m_SizeDelta.y
      value: 0
      objectReference: {fileID: 0}
    m_RemovedComponents: []
  m_SourcePrefab: {fileID: 100100000, guid: 9287671e6140d14408c351294e7e98fd, type: 3}
--- !u!224 &4300565008019804269 stripped
RectTransform:
  m_CorrespondingSourceObject: {fileID: 5054755825117266709, guid: 9287671e6140d14408c351294e7e98fd, type: 3}
  m_PrefabInstance: {fileID: 9045678530889601912}
  m_PrefabAsset: {fileID: 0}
