{
    "atcmds": [
        {
            "request": "AT#CGMM"
        },
        {
            "request": "AT#CGMR"
        },
        {
            "request": "AT#CGSN"
        },
        {
            "request": "AT#CGMF"
        },
        {
            "request": "AT#HWREV"
        },
        {
            "request": "AT#SWPKGV"
        },
        {
            "request": "AT#USBCFG?"
        },
        {
            "request": "AT#FWAUTOSIM?"
        },
        {
            "request": "AT#ESIMLPA?"
        },
        {
            "request": "AT#DPRCTL?"
        },
        {
            "request": "AT#B30TXDIS?"
        }
    ]
}