{
    "atcmds": [
        {
            "request": "AT+CGMM",
            "match": "LN920A12-WW"
        },
        {
            "request": "AT#CGMM",
            "match": "LN920A12-WW"
        },
        {
            "request": "AT+CGMR",
            "match": "M0L.000001"
        },
        {
            "request": "AT#CGMR",
            "match": "M0L.000001"
        },
        {
            "request": "AT+CGSN",
            "match": "35417575"
        },
        {
            "request": "AT#CGSN",
            "match": "35417575"
        },
        {
            "request": "AT#CGMF",
            "match": "1088_P0L.011138-05116"
        },
        {
            "request": "AT#HWREV",
            "match": "1.00"
        },
        {
            "request": "AT#SWPKGV",
            "match": "40.00.001-P0L.011138-05116"
        },
        {
            "request": "AT#USBCFG?",
            "match": "#USBCFG: 6"
        },
        {
            "request": "AT#FWSWITCH",
            "match": [
                "#FWSWITCH: 0,0,\"Generic GCF\",P0L.001138",
                "#FWSWITCH: 0,1,\"Generic PTCRB\",P0L.011138",
                "#FWSWITCH: 0,10,\"AT&T\",P0L.101348",
                "#FWSWITCH: 0,11,\"T-Mobile\",P0L.111418",
                "#FWSWITCH: 0,12,\"Verizon\",P0L.121258"
            ]
        },
        {
            "request": "AT#FWAUTOSIM?",
            "match": "#FWAUTOSIM: 1,1"
        },
        {
            "request": "AT#LOCAUTOSTART?",
            "match": "#LOCAUTOSTART: 1,4,255,1000,1"
        },
        {
            "request": "AT#LOCNMEATYPE?",
            "match": "#LOCNMEATYPE: 134020607"
        },
        {
            "request": "AT#ESIMLPA?",
            "match": "#ESIMLPA: 0"
        },
        {
            "request": "AT#DPRLIST?",
            "match": ""
        },
        {
            "request": "AT#DPRCTL?",
            "match": "#DPRCTL: 0"
        },
        {
            "request": "AT#ENSIM2?",
            "match": "#ENSIM2: 1"
        },
        {
            "request": "AT#BND?",
            "match": "#BND: 0,18,87E03B0E38DF,42"
        },
        {
            "request": "AT#B30TXDIS?",
            "match": "#B30TXDIS: 1"
        },
        {
            "request": "AT+M2M?",
            "match": "M2M: 1"
        }
    ]
}
