



zonecreate "SK_VSP_CL2E_DKDC2CTXPRDC004_HBA0","SK_VSP_CL2E;DKDC2CTXPRDC004_HBA0"
cfgadd "FABRIC1","SK_VSP_CL2E_DKDC2CTXPRDC004_HBA0"
cfgsave
cfgenable "FABRIC1" 

========================


DKDC2ORATSTA002

3C, 3E
6C, 6E

SW1-
c050760775ae011a
c050760775ae011c


alicreate "DKDC2ORATSTA002_HBA0","c0:50:76:07:75:ae:01:1a"
zonecreate "SK_VSP_CL3C_DKDC2ORATSTA002_HBA0","SK_VSP_CL3C;DKDC2ORATSTA002_HBA0"
cfgadd "FABRIC1","SK_VSP_CL3C_DKDC2ORATSTA002_HBA0"

alicreate "DKDC2ORATSTA002_HBA2","c0:50:76:07:75:ae:01:1c"
zonecreate "SK_VSP_CL3E_DKDC2ORATSTA002_HBA2","SK_VSP_CL3E;DKDC2ORATSTA002_HBA2"
cfgadd "FABRIC1","SK_VSP_CL3E_DKDC2ORATSTA002_HBA2"



cfgsave
cfgenable "FABRIC1"



======================================================

DKDC2TRFSAPDEV04

SW1-
c050760775ae0124
c050760775ae0122

alicreate "DKDC2TRFSAPDEV04_HBA0","c0:50:76:07:75:ae:01:24"
zonecreate "SK_VSP_CL3C_DKDC2TRFSAPDEV04_HBA0","SK_VSP_CL3C;DKDC2TRFSAPDEV04_HBA0"
cfgadd "FABRIC1","SK_VSP_CL3C_DKDC2TRFSAPDEV04_HBA0"

alicreate "DKDC2TRFSAPDEV04_HBA2","c0:50:76:07:75:ae:01:22"
zonecreate "SK_VSP_CL3E_DKDC2TRFSAPDEV04_HBA2","SK_VSP_CL3E;DKDC2TRFSAPDEV04_HBA2"
cfgadd "FABRIC1","SK_VSP_CL3E_DKDC2TRFSAPDEV04_HBA2"



cfgsave
cfgenable "FABRIC1"






========================================================

DKDC2TRFSAPDEV05
Fabric1--------------
sw1-
c050760775ae012a
c050760775ae012c

alicreate "DKDC2TRFSAPDEV05_HBA0","c0:50:76:07:75:ae:01:2a"
zonecreate "SK_VSP_CL3C_DKDC2TRFSAPDEV05_HBA0","SK_VSP_CL3C;DKDC2TRFSAPDEV05_HBA0"
cfgadd "FABRIC1","SK_VSP_CL3C_DKDC2TRFSAPDEV05_HBA0"

alicreate "DKDC2TRFSAPDEV05_HBA2","c0:50:76:07:75:ae:01:2c"
zonecreate "SK_VSP_CL3E_DKDC2TRFSAPDEV05_HBA2","SK_VSP_CL3E;DKDC2TRFSAPDEV05_HBA2"
cfgadd "FABRIC1","SK_VSP_CL3E_DKDC2TRFSAPDEV05_HBA2"

cfgsave
cfgenable "FABRIC1"

Host Name change---------------

Delete zone---

cfgremove "FABRIC1","SK_VSP_CL3C_DKDC2TRFSAPDEV05_HBA0"
zonedelete "SK_VSP_CL3C_DKDC2TRFSAPDEV05_HBA0"
alidelete "DKDC2TRFSAPDEV05_HBA0"


cfgremove "FABRIC1","SK_VSP_CL3E_DKDC2TRFSAPDEV05_HBA2"
zonedelete "SK_VSP_CL3E_DKDC2TRFSAPDEV05_HBA2"
alidelete "DKDC2TRFSAPDEV05_HBA2"

Zone add with new host name---

alicreate "DKDC2TRFSAPXIQ02_HBA0","c0:50:76:07:75:ae:01:2a"
zonecreate "SK_VSP_CL3C_DKDC2TRFSAPXIQ02_HBA0","SK_VSP_CL3C;DKDC2TRFSAPXIQ02_HBA0"
cfgadd "FABRIC1","SK_VSP_CL3C_DKDC2TRFSAPDEV05_HBA0"

alicreate "DKDC2TRFSAPXIQ02_HBA2","c0:50:76:07:75:ae:01:2c"
zonecreate "SK_VSP_CL3E_DKDC2TRFSAPXIQ02_HBA2","SK_VSP_CL3E;DKDC2TRFSAPXIQ02_HBA2"
cfgadd "FABRIC1","SK_VSP_CL3E_DKDC2TRFSAPXIQ02_HBA2"

cfgsave
cfgenable "FABRIC1"

Completed---------------------------------------------------------------------


=======================================================================
DC2 Server
FABRIC1---

DKDC2CAEPOCW001-----
1C, 1E
238900008734e122

alicreate "DKDC2CAEPOCW001_HBA0","23:89:00:00:87:34:e1:22"
zonecreate "SK_VSP_CL1C_DKDC2CAEPOCW001_HBA0","SK_VSP_CL1C;DKDC2CAEPOCW001_HBA0"
cfgadd "FABRIC1","SK_VSP_CL1C_DKDC2CAEPOCW001_HBA0"

alicreate "DKDC2CAEPOCW001_HBA2","23:89:00:00:87:34:e1:22"
zonecreate "SK_VSP_CL1E_DKDC2CAEPOCW001_HBA2","SK_VSP_CL1E;DKDC2CAEPOCW001_HBA2"
cfgadd "FABRIC1","SK_VSP_CL1E_DKDC2CAEPOCW001_HBA2"

cfgsave
cfgenable "FABRIC1"

======================
cfgremove "FABRIC1","SK_VSP_CL1C_DKDC2CAEPOCW001_HBA0"
cfgremove "FABRIC1","SK_VSP_CL1E_DKDC2CAEPOCW001_HBA2"
zonedelete "SK_VSP_CL1C_DKDC2CAEPOCW001_HBA0"
zonedelete "SK_VSP_CL1E_DKDC2CAEPOCW001_HBA2"
alidelete "DKDC2CAEPOCW001_HBA0"
alidelete "DKDC2CAEPOCW001_HBA2"

cfgremove "FABRIC1","SK_VSP_CL1C_DKDC2CAEPOCW002_HBA0"
cfgremove "FABRIC1","SK_VSP_CL1E_DKDC2CAEPOCW002_HBA2"
zonedelete "SK_VSP_CL1C_DKDC2CAEPOCW002_HBA0"
zonedelete "SK_VSP_CL1E_DKDC2CAEPOCW002_HBA2"
alidelete "DKDC2CAEPOCW002_HBA0"
alidelete "DKDC2CAEPOCW002_HBA2"

cfgremove "FABRIC1","SK_VSP_CL1C_DKDC2CAEPOCW003_HBA0"
cfgremove "FABRIC1","SK_VSP_CL1E_DKDC2CAEPOCW003_HBA2"
zonedelete "SK_VSP_CL1C_DKDC2CAEPOCW003_HBA0"
zonedelete "SK_VSP_CL1E_DKDC2CAEPOCW003_HBA2"
alidelete "DKDC2CAEPOCW003_HBA0"
alidelete "DKDC2CAEPOCW003_HBA2"

=======================

DKDC2CAEPOCW002-----
238900008734e132

alicreate "DKDC2CAEPOCW002_HBA0","23:89:00:00:87:34:e1:32"
zonecreate "SK_VSP_CL1C_DKDC2CAEPOCW002_HBA0","SK_VSP_CL1C;DKDC2CAEPOCW002_HBA0"
cfgadd "FABRIC1","SK_VSP_CL1C_DKDC2CAEPOCW002_HBA0"

alicreate "DKDC2CAEPOCW002_HBA2","23:89:00:00:87:34:e1:32"
zonecreate "SK_VSP_CL1E_DKDC2CAEPOCW002_HBA2","SK_VSP_CL1E;DKDC2CAEPOCW002_HBA2"
cfgadd "FABRIC1","SK_VSP_CL1E_DKDC2CAEPOCW002_HBA2"

cfgsave
cfgenable "FABRIC1"

======================
cfgremove "FABRIC1","SK_VSP_CL1E_DKDC2CAEPOCW002_HBA2"
zonedelete "SK_VSP_CL1E_DKDC2CAEPOCW002_HBA2"
alidelete "DKDC2CAEPOCW002_HBA2"
=======================



DKDC2CAEPOCW003-----
238900008734e142





alicreate "DKDC2CAEPOCW003_HBA0","23:89:00:00:87:34:e1:42"
zonecreate "SK_VSP_CL1C_DKDC2CAEPOCW003_HBA0","SK_VSP_CL1C;DKDC2CAEPOCW003_HBA0"
cfgadd "FABRIC1","SK_VSP_CL1C_DKDC2CAEPOCW003_HBA0"

alicreate "DKDC2CAEPOCW003_HBA2","23:89:00:00:87:34:e1:42"
zonecreate "SK_VSP_CL1E_DKDC2CAEPOCW003_HBA2","SK_VSP_CL1E;DKDC2CAEPOCW003_HBA2"
cfgadd "FABRIC1","SK_VSP_CL1E_DKDC2CAEPOCW003_HBA2"

cfgsave
cfgenable "FABRIC1"

======================
cfgremove "FABRIC1","SK_VSP_CL1E_DKDC2CAEPOCW003_HBA2"
zonedelete "SK_VSP_CL1E_DKDC2CAEPOCW003_HBA2"
alidelete "DKDC2CAEPOCW003_HBA2"
=======================


DKDC2HYVPRDW001
50:00:08:70:00:5b:8a:ea



cfgremove "FABRIC1","SK_VSP_CL1C_DKDC2HYVPRDW001_HBA0"
cfgremove "FABRIC1","SK_VSP_CL1E_DKDC2HYVPRDW001_HBA0"
zonedelete "SK_VSP_CL1C_DKDC2HYVPRDW001_HBA0"
zonedelete "SK_VSP_CL1E_DKDC2HYVPRDW001_HBA0"
alidelete "DKDC2HYVPRDW001_HBA0"
cfgsave




cfgremove "FABRIC2","SK_VSP_CL8C_DKDC2HYVPRDW001_HBA1"
cfgremove "FABRIC2","SK_VSP_CL8E_DKDC2HYVPRDW001_HBA1"
zonedelete "SK_VSP_CL8C_DKDC2HYVPRDW001_HBA1"
zonedelete "SK_VSP_CL8E_DKDC2HYVPRDW001_HBA1"
alidelete "DKDC2HYVPRDW001_HBA1"
cfgsave


=======================================

cfgremove "FABRIC1","SK_VSP_CL1C_DKDC2CAEPOCW004_HBA0"
cfgremove "FABRIC1","SK_VSP_CL1E_DKDC2CAEPOCW004_HBA0"
zonedelete "SK_VSP_CL1C_DKDC2CAEPOCW004_HBA0"
zonedelete "SK_VSP_CL1E_DKDC2CAEPOCW004_HBA0"
alidelete "DKDC2CAEPOCW004_HBA0"

cfgsave
cfgenable "FABRIC1"




cfgremove "FABRIC2","SK_VSP_CL8C_DKDC2CAEPOCW004_HBA1"
cfgremove "FABRIC2","SK_VSP_CL8E_DKDC2CAEPOCW004_HBA1"
zonedelete "SK_VSP_CL8C_DKDC2CAEPOCW004_HBA1"
zonedelete "SK_VSP_CL8E_DKDC2CAEPOCW004_HBA1"
alidelete "DKDC2CAEPOCW004_HBA1"

cfgsave
cfgenable "FABRIC2"

+++++++++++++++++++++++++++++++++++++++++++++++++++++++++++++

Server Name : DKDC1SQLPRDW013 
DC : DC1 (Ballerup)
WWPN:23890000873cc930, 
WWPN:23890000873cc932,


alicreate "DKDC1SQLPRDW013_HBA0","23:89:00:00:87:3c:c9:32"
zonecreate "BAL_VSP_CL1C_DKDC1SQLPRDW013_HBA0","BAL_VSP_CL1C;DKDC1SQLPRDW013_HBA0"
cfgadd "FABRIC1","BAL_VSP_CL1C_DKDC1SQLPRDW013_HBA0"

zonecreate "BAL_VSP_CL1E_DKDC1SQLPRDW013_HBA0","BAL_VSP_CL1E;DKDC1SQLPRDW013_HBA0"
cfgadd "FABRIC1","BAL_VSP_CL1E_DKDC1SQLPRDW013_HBA0"

cfgsave
cfgenable "FABRIC1"

---
zonecreate "LSAN_SK_VSP_CL1C_DKDC1SQLPRDW013_HBA0","SK_VSP_CL1C;DKDC1SQLPRDW013_HBA0"
cfgadd "FABRIC1","LSAN_SK_VSP_CL1C_DKDC1SQLPRDW013_HBA0"

zonecreate "LSAN_SK_VSP_CL1E_DKDC1SQLPRDW013_HBA0","SK_VSP_CL1E;DKDC1SQLPRDW013_HBA0"
cfgadd "FABRIC1","LSAN_SK_VSP_CL1E_DKDC1SQLPRDW013_HBA0"



============================================================
Server Name : DKDC2SQLPRDW013 
DC : DC2 (Skolundve)
WWPN:238900008734e150,
WWPN:238900008734e152,


alicreate "DKDC2SQLPRDW013_HBA0","23:89:00:00:87:34:e1:52"
zonecreate "SK_VSP_CL1C_DKDC2SQLPRDW013_HBA0","SK_VSP_CL1C;DKDC2SQLPRDW013_HBA0"
cfgadd "FABRIC1","SK_VSP_CL1C_DKDC2SQLPRDW013_HBA0"

zonecreate "SK_VSP_CL1E_DKDC2SQLPRDW013_HBA0","SK_VSP_CL1E;DKDC2SQLPRDW013_HBA0"
cfgadd "FABRIC1","SK_VSP_CL1E_DKDC2SQLPRDW013_HBA0"

cfgsave
cfgenable "FABRIC1"

---

zonecreate "LSAN_BAL_VSP_CL1C_DKDC2SQLPRDW013_HBA0","BAL_VSP_CL1C;DKDC2SQLPRDW013_HBA0"
cfgadd "FABRIC1","LSAN_BAL_VSP_CL1C_DKDC2SQLPRDW013_HBA0"

zonecreate "LSAN_BAL_VSP_CL1E_DKDC2SQLPRDW013_HBA0","BAL_VSP_CL1E;DKDC2SQLPRDW013_HBA0"
cfgadd "FABRIC1","LSAN_BAL_VSP_CL1E_DKDC2SQLPRDW013_HBA0"

===================================================================
+++++++++++++++++++++++++++++++++++++++++++++++++++++++++++++++++++


DC1 SAN SW 10.48.227.208----------
DKDC1SQLPRDW009

cfgremove "FABRIC1","BAL_VSP_CL1C_DKDC1SQLPRDW009_HBA0"
cfgremove "FABRIC1","BAL_VSP_CL1E_DKDC1SQLPRDW009_HBA0"
cfgremove "FABRIC1","LSAN_BAL_VSP_CL1E_DKDC1SQLPRDW009_HBA0"
cfgremove "FABRIC1","LSAN_SK_VSP_CL1C_DKDC1SQLPRDW009_HBA0"
cfgremove "FABRIC1","LSAN_SK_VSP_CL1E_DKDC1SQLPRDW009_HBA0"

zonedelete "BAL_VSP_CL1C_DKDC1SQLPRDW009_HBA0"
zonedelete "BAL_VSP_CL1E_DKDC1SQLPRDW009_HBA0"
zonedelete "LSAN_BAL_VSP_CL1E_DKDC1SQLPRDW009_HBA0"
zonedelete "LSAN_SK_VSP_CL1C_DKDC1SQLPRDW009_HBA0"
zonedelete "LSAN_SK_VSP_CL1E_DKDC1SQLPRDW009_HBA0"

alidelete "DKDC1SQLPRDW009_HBA0"

cfgsave
cfgenable "FABRIC1"

DC1 SAN SW 10.48.227.209----------
DKDC1SQLPRDW009

cfgremove "FABRIC2","BAL_VSP_CL8C_DKDC1SQLPRDW009_HBA1"
cfgremove "FABRIC2","BAL_VSP_CL8E_DKDC1SQLPRDW009_HBA1"
cfgremove "FABRIC2","LSAN_BAL_VSP_CL8E_DKDC1SQLPRDW009_HBA1"
cfgremove "FABRIC2","LSAN_SK_VSP_CL8C_DKDC1SQLPRDW009_HBA1"
cfgremove "FABRIC2","LSAN_SK_VSP_CL8E_DKDC1SQLPRDW009_HBA1"

zonedelete "BAL_VSP_CL8C_DKDC1SQLPRDW009_HBA1"
zonedelete "BAL_VSP_CL8E_DKDC1SQLPRDW009_HBA1"
zonedelete "LSAN_BAL_VSP_CL8E_DKDC1SQLPRDW009_HBA1"
zonedelete "LSAN_SK_VSP_CL8C_DKDC1SQLPRDW009_HBA1"
zonedelete "LSAN_SK_VSP_CL8E_DKDC1SQLPRDW009_HBA1"

alidelete "DKDC1SQLPRDW009_HBA1"

cfgsave
cfgenable "FABRIC2"
===================================================================
DKDC2SQLPRDW006
DC1 SAN SW 10.48.227.208----------

cfgremove "FABRIC1","SK_VSP_CL1C_DKDC2SQLPRDW006_HBA0"
cfgremove "FABRIC1","SK_VSP_CL1E_DKDC2SQLPRDW006_HBA0"
cfgremove "FABRIC1","LSAN_BAL_VSP_CL1C_DKDC2SQLPRDW006_HBA0"
cfgremove "FABRIC1","LSAN_BAL_VSP_CL1E_DKDC2SQLPRDW006_HBA0"

zonedelete "SK_VSP_CL1C_DKDC2SQLPRDW006_HBA0"
zonedelete "SK_VSP_CL1E_DKDC2SQLPRDW006_HBA0"
zonedelete "LSAN_BAL_VSP_CL1C_DKDC2SQLPRDW006_HBA0"
zonedelete "LSAN_BAL_VSP_CL1E_DKDC2SQLPRDW006_HBA0"

alidelete "DKDC2SQLPRDW006_HBA0"

cfgsave
cfgenable "FABRIC1"

DKDC2SQLPRDW006
DC1 SAN SW 10.48.227.209----------

cfgremove "FABRIC2","SK_VSP_CL8C_DKDC2SQLPRDW006_HBA1"
cfgremove "FABRIC2","SK_VSP_CL8E_DKDC2SQLPRDW006_HBA1"
cfgremove "FABRIC2","LSAN_BAL_VSP_CL8C_DKDC2SQLPRDW006_HBA1"
cfgremove "FABRIC2","LSAN_BAL_VSP_CL8E_DKDC2SQLPRDW006_HBA1"

zonedelete "SK_VSP_CL8C_DKDC2SQLPRDW006_HBA1"
zonedelete "SK_VSP_CL8E_DKDC2SQLPRDW006_HBA1"
zonedelete "LSAN_BAL_VSP_CL8C_DKDC2SQLPRDW006_HBA1"
zonedelete "LSAN_BAL_VSP_CL8E_DKDC2SQLPRDW006_HBA1"

alidelete "DKDC2SQLPRDW006_HBA1"

cfgsave
cfgenable "FABRIC2"


====================================================================
DKDC1ESXPRDE002
50:00:08:70:00:5d:08:60
50:00:08:70:00:5d:08:62

alicreate "DKDC1ESXPRDE002_HBA0","50:00:08:70:00:5d:08:62"
zonecreate "BAL_VSP_CL1C_DKDC1ESXPRDE002_HBA0","BAL_VSP_CL1C;DKDC1ESXPRDE002_HBA0"
cfgadd "FABRIC1","BAL_VSP_CL1C_DKDC1ESXPRDE002_HBA0"

zonecreate "BAL_VSP_CL1E_DKDC1ESXPRDE002_HBA0","BAL_VSP_CL1E;DKDC1ESXPRDE002_HBA0"
cfgadd "FABRIC1","BAL_VSP_CL1E_DKDC1ESXPRDE002_HBA0"

cfgsave
cfgenable "FABRIC1"

+++++++++++++++++++++++++++++++++++++++++++++++++++++++++++++++++++++++++++++++++++++++++++

cfgremove "FABRIC1","BAL_VSP_CL1E_DKDC1ESXPRDE002_HBA0"
cfgremove "FABRIC1","BAL_VSP_CL1C_DKDC1ESXPRDE002_HBA0"
cfgremove "FABRIC1","LSAN_SK_VSP_CL1C_DKDC1ESXPRDE002_HBA0"
cfgremove "FABRIC1","LSAN_SK_VSP_CL1E_DKDC1ESXPRDE002_HBA0"

zonedelete "BAL_VSP_CL1E_DKDC1ESXPRDE002_HBA0"
zonedelete "BAL_VSP_CL1C_DKDC1ESXPRDE002_HBA0"
zonedelete "LSAN_SK_VSP_CL1C_DKDC1ESXPRDE002_HBA0"
zonedelete "LSAN_SK_VSP_CL1E_DKDC1ESXPRDE002_HBA0"


alidelete "DKDC1ESXPRDE002_HBA0"

cfgsave
cfgenable "FABRIC1"


++++++++++

cfgremove "FABRIC1","SK_VSP_CL1E_DKDC2ESXPRDE003_HBA0"
cfgremove "FABRIC1","SK_VSP_CL1C_DKDC2ESXPRDE003_HBA0"
cfgremove "FABRIC1","LSAN_BAL_VSP_CL1C_DKDC2ESXPRDE003_HBA0"
cfgremove "FABRIC1","LSAN_BAL_VSP_CL1E_DKDC2ESXPRDE003_HBA0"

zonedelete "SK_VSP_CL1E_DKDC2ESXPRDE003_HBA0"
zonedelete "SK_VSP_CL1C_DKDC2ESXPRDE003_HBA0"
zonedelete "LSAN_BAL_VSP_CL1C_DKDC2ESXPRDE003_HBA0"
zonedelete "LSAN_BAL_VSP_CL1E_DKDC2ESXPRDE003_HBA0"

alidelete "DKDC2ESXPRDE003_HBA0"

cfgsave
cfgenable "FABRIC1"
+++++++++++++++++++++++++++++++++++++++++++++++++++++++++++++++++++++++++++++++++++++++++++

zonecreate "LSAN_SK_VSP_CL1C_DKDC1ESXPRDE002_HBA0","SK_VSP_CL1C;DKDC1ESXPRDE002_HBA0"
cfgadd "FABRIC1","LSAN_SK_VSP_CL1C_DKDC1ESXPRDE002_HBA0"

zonecreate "LSAN_SK_VSP_CL1E_DKDC1ESXPRDE002_HBA0","SK_VSP_CL1E;DKDC1ESXPRDE002_HBA0"
cfgadd "FABRIC1","LSAN_SK_VSP_CL1E_DKDC1ESXPRDE002_HBA0"

cfgsave
cfgenable "FABRIC1"
-----------


DKDC2ESXPRDE003
50:00:08:70:00:5b:8a:e8
50:00:08:70:00:5b:8a:ea

alicreate "DKDC2ESXPRDE003_HBA0","50:00:08:70:00:5b:8a:ea"
zonecreate "SK_VSP_CL1C_DKDC2ESXPRDE003_HBA0","SK_VSP_CL1C;DKDC2ESXPRDE003_HBA0"
cfgadd "FABRIC1","SK_VSP_CL1C_DKDC2ESXPRDE003_HBA0"

zonecreate "SK_VSP_CL1E_DKDC2ESXPRDE003_HBA0","SK_VSP_CL1E;DKDC2ESXPRDE003_HBA0"
cfgadd "FABRIC1","SK_VSP_CL1E_DKDC2ESXPRDE003_HBA0"

cfgsave
cfgenable "FABRIC1"

---

zonecreate "LSAN_BAL_VSP_CL1C_DKDC2ESXPRDE003_HBA0","BAL_VSP_CL1C;DKDC2ESXPRDE003_HBA0"
cfgadd "FABRIC1","LSAN_BAL_VSP_CL1C_DKDC2ESXPRDE003_HBA0"

zonecreate "LSAN_BAL_VSP_CL1E_DKDC2ESXPRDE003_HBA0","BAL_VSP_CL1E;DKDC2ESXPRDE003_HBA0"
cfgadd "FABRIC1","LSAN_BAL_VSP_CL1E_DKDC2ESXPRDE003_HBA0"

cfgsave
cfgenable "FABRIC1"

===================================================================================================================
CR - 40474---------

Please assign 60 GB boot LUN to each server from one path for now and once OS is installed ,we will let you know to add the remaining paths and the data LUNs.

Server Hostname :  DKDC1RPLDEVW001
WWPN1 : 23890000873B3920
WWPN2 : 23890000873B3922


Server Hostname : DKDC1RPLDEVW002
WWPN1 : 23890000873CA920
WWPN2 :  23890000873CA922

=====================================================================================================

Server Hostname :  DKDC1RPLDEVW001
WWPN1 : 23890000873B3920
WWPN2 : 23890000873B3922

alicreate "DKDC1RPLDEVW001_HBA0","23:89:00:00:87:3B:39:22"
zonecreate "BAL_VSP_CL1C_DKDC1RPLDEVW001_HBA0","BAL_VSP_CL1C;DKDC1RPLDEVW001_HBA0"
cfgadd "FABRIC1","BAL_VSP_CL1C_DKDC1RPLDEVW001_HBA0"

zonecreate "BAL_VSP_CL1E_DKDC1RPLDEVW001_HBA0","BAL_VSP_CL1E;DKDC1RPLDEVW001_HBA0"
cfgadd "FABRIC1","BAL_VSP_CL1E_DKDC1RPLDEVW001_HBA0"

cfgsave
cfgenable "FABRIC1"

===

Server Hostname : DKDC1RPLDEVW002
WWPN1 : 23890000873CA920
WWPN2 : 23890000873CA922

alicreate "DKDC1RPLDEVW002_HBA0","23:89:00:00:87:3C:A9:22"
zonecreate "BAL_VSP_CL1C_DKDC1RPLDEVW002_HBA0","BAL_VSP_CL1C;DKDC1RPLDEVW002_HBA0"
cfgadd "FABRIC1","BAL_VSP_CL1C_DKDC1RPLDEVW002_HBA0"

zonecreate "BAL_VSP_CL1E_DKDC1RPLDEVW002_HBA0","BAL_VSP_CL1E;DKDC1RPLDEVW002_HBA0"
cfgadd "FABRIC1","BAL_VSP_CL1E_DKDC1RPLDEVW002_HBA0"

cfgsave
cfgenable "FABRIC1"

+++++++++++++++++++++++++++++++++++++++++++++++++++++++++++++++++++++++++++++++++++++++++


DKDC1SASPRDW001  HBA1  23890000873f7130  
DKDC1SASPRDW001  HBA2  23890000873f7132 

alicreate "DKDC1SASPRDW001_HBA0","23:89:00:00:87:3f:71:32"
zonecreate "BAL_VSP_CL1C_DKDC1SASPRDW001_HBA0","BAL_VSP_CL1C;DKDC1SASPRDW001_HBA0"
cfgadd "FABRIC1","BAL_VSP_CL1C_DKDC1SASPRDW001_HBA0"

zonecreate "BAL_VSP_CL1E_DKDC1SASPRDW001_HBA0","BAL_VSP_CL1E;DKDC1SASPRDW001_HBA0"
cfgadd "FABRIC1","BAL_VSP_CL1E_DKDC1SASPRDW001_HBA0"

cfgsave
cfgenable "FABRIC1"

============================================================
DKDC1SASPRDW007_HYPW001  HBA1  50000870005d0860  
DKDC1SASPRDW007_HYPW001  HBA2  50000870005d0862 

alicreate "DKDC1SASPRDW007_HYPW001_HBA0","50:00:08:70:00:5d:08:62"
zonecreate "BAL_VSP_CL1C_DKDC1SASPRDW007_HYPW001_HBA0","BAL_VSP_CL1C;DKDC1SASPRDW007_HYPW001_HBA0"
cfgadd "FABRIC1","BAL_VSP_CL1C_DKDC1SASPRDW007_HYPW001_HBA0"

zonecreate "BAL_VSP_CL1E_DKDC1SASPRDW007_HYPW001_HBA0","BAL_VSP_CL1E;DKDC1SASPRDW007_HYPW001_HBA0"
cfgadd "FABRIC1","BAL_VSP_CL1E_DKDC1SASPRDW007_HYPW001_HBA0"

cfgsave
cfgenable "FABRIC1"
================================================================================

Server Name : DHDC1HYPPRDW001 
DC : DC1 (Ballerup)
Ports - 1C, 1E.
WWPN:21000024FF774206 
WWPN:21000024FF774207


alicreate "DHDC1HYPPRDW001_HBA0","21:00:00:24:FF:77:42:06"
zonecreate "BAL_VSP_CL1C_DHDC1HYPPRDW001_HBA0","BAL_VSP_CL1C;DHDC1HYPPRDW001_HBA0"
cfgadd "FABRIC1","BAL_VSP_CL1C_DHDC1HYPPRDW001_HBA0"

zonecreate "BAL_VSP_CL1E_DHDC1HYPPRDW001_HBA0","BAL_VSP_CL1E;DHDC1HYPPRDW001_HBA0"
cfgadd "FABRIC1","BAL_VSP_CL1E_DHDC1HYPPRDW001_HBA0"

cfgsave
cfgenable "FABRIC1"


+++++++++++++++++++++++++++++++++++++++++++++++++++++++++++++++++++++++++++++++++++++++++++++++++++++++++++++++++++++++++++++++++++++++++++++++++++++++++++++++++++++++++++++++++++++++++++++++++++++++++++++++++++++++++++++++++++++++++++++
Monday-----------------------------------

UNIX ----
Ports - 3C, 3E

dkdc1esbprda003---

c050760775ac0138
c050760775ac013a

alicreate "DKDC1ESBPRDA003_HBA0","c0:50:76:07:75:ac:01:38"
zonecreate "BAL_VSP_CL3C_DKDC1ESBPRDA003_HBA0","BAL_VSP_CL3C;DKDC1ESBPRDA003_HBA0"
cfgadd "FABRIC1","BAL_VSP_CL3C_DKDC1ESBPRDA003_HBA0"

alicreate "DKDC1ESBPRDA003_HBA2","c0:50:76:07:75:ac:01:3a"
zonecreate "BAL_VSP_CL3E_DKDC1ESBPRDA003_HBA2","BAL_VSP_CL3E;DKDC1ESBPRDA003_HBA2"
cfgadd "FABRIC1","BAL_VSP_CL3E_DKDC1ESBPRDA003_HBA2"

cfgsave
cfgenable "FABRIC1"

================




======================================

dkdc1bpmprda001---

c050760775ac0140
c050760775ac0142

alicreate "DKDC1BPMPRDA001_HBA0","c0:50:76:07:75:ac:01:40"
zonecreate "BAL_VSP_CL3C_DKDC1BPMPRDA001_HBA0","BAL_VSP_CL3C;DKDC1BPMPRDA001_HBA0"
cfgadd "FABRIC1","BAL_VSP_CL3C_DKDC1BPMPRDA001_HBA0"

alicreate "DKDC1BPMPRDA001_HBA2","c0:50:76:07:75:ac:01:42"
zonecreate "BAL_VSP_CL3E_DKDC1BPMPRDA001_HBA2","BAL_VSP_CL3E;DKDC1BPMPRDA001_HBA2"
cfgadd "FABRIC1","BAL_VSP_CL3E_DKDC1BPMPRDA001_HBA2"

cfgsave
cfgenable "FABRIC1"

======================================

dkdc1bpmprda002---

c050760775ac014a
c050760775ac014c

alicreate "DKDC1BPMPRDA002_HBA0","c0:50:76:07:75:ac:01:4a"
zonecreate "BAL_VSP_CL3C_DKDC1BPMPRDA002_HBA0","BAL_VSP_CL3C;DKDC1BPMPRDA002_HBA0"
cfgadd "FABRIC1","BAL_VSP_CL3C_DKDC1BPMPRDA002_HBA0"

alicreate "DKDC1BPMPRDA002_HBA2","c0:50:76:07:75:ac:01:4c"
zonecreate "BAL_VSP_CL3E_DKDC1BPMPRDA002_HBA2","BAL_VSP_CL3E;DKDC1BPMPRDA002_HBA2"
cfgadd "FABRIC1","BAL_VSP_CL3E_DKDC1BPMPRDA002_HBA2"

cfgsave
cfgenable "FABRIC1"
======================================

dkdc2esbprda003---

c050760775ae0156
c050760775ae0154

alicreate "DKDC2ESBPRDA003_HBA0","c0:50:76:07:75:ae:01:56"
zonecreate "SK_VSP_CL3C_DKDC2ESBPRDA003_HBA0","SK_VSP_CL3C;DKDC2ESBPRDA003_HBA0"
cfgadd "FABRIC1","SK_VSP_CL3C_DKDC2ESBPRDA003_HBA0"

alicreate "DKDC2ESBPRDA003_HBA2","c0:50:76:07:75:ae:01:54"
zonecreate "SK_VSP_CL3E_DKDC2ESBPRDA003_HBA2","SK_VSP_CL3E;DKDC2ESBPRDA003_HBA2"
cfgadd "FABRIC1","SK_VSP_CL3E_DKDC2ESBPRDA003_HBA2"

cfgsave
cfgenable "FABRIC1"

======================================

dkdc2bpmprda001---

c050760775ae015c
c050760775ae015a

alicreate "DKDC2BPMPRDA001_HBA0","c0:50:76:07:75:ae:01:5c"
zonecreate "SK_VSP_CL3C_DKDC2BPMPRDA001_HBA0","SK_VSP_CL3C;DKDC2BPMPRDA001_HBA0"
cfgadd "FABRIC1","SK_VSP_CL3C_DKDC2BPMPRDA001_HBA0"

alicreate "DKDC2BPMPRDA001_HBA2","c0:50:76:07:75:ae:01:5a"
zonecreate "SK_VSP_CL3E_DKDC2BPMPRDA001_HBA2","SK_VSP_CL3E;DKDC2BPMPRDA001_HBA2"
cfgadd "FABRIC1","SK_VSP_CL3E_DKDC2BPMPRDA001_HBA2"

cfgsave
cfgenable "FABRIC1"

======================================

dkdc2bpmprda002---

c050760775ae0164
c050760775ae0162

alicreate "DKDC2BPMPRDA002_HBA0","c0:50:76:07:75:ae:01:64"
zonecreate "SK_VSP_CL3C_DKDC2BPMPRDA002_HBA0","SK_VSP_CL3C;DKDC2BPMPRDA002_HBA0"
cfgadd "FABRIC1","SK_VSP_CL3C_DKDC2BPMPRDA002_HBA0"

alicreate "DKDC2BPMPRDA002_HBA2","c0:50:76:07:75:ae:01:62"
zonecreate "SK_VSP_CL3E_DKDC2BPMPRDA002_HBA2","SK_VSP_CL3E;DKDC2BPMPRDA002_HBA2"
cfgadd "FABRIC1","SK_VSP_CL3E_DKDC2BPMPRDA002_HBA2"

cfgsave
cfgenable "FABRIC1"

++++++++++++++++++++++++++++++++++++++++++++++++++++++++++++++++++++++++++++++++++++++++++++++++++++++++++++++++++++++++++++++++++++++++++++++++++++++++++++++++++++++++++++++++++++++++++++++++++++++++++++++++++++++++++++++++++++++++++++

DKDC2BKPPRDW005

23:89:00:00:87:3d:91:40
23:89:00:00:87:3d:91:42

alicreate "DKDC2BKPPRDW005_HBA0","23:89:00:00:87:3d:91:42"
zonecreate "SK_VSP_CL1C_DKDC2BKPPRDW005_HBA0","SK_VSP_CL1C;DKDC2BKPPRDW005_HBA0"
cfgadd "FABRIC1","SK_VSP_CL1C_DKDC2BKPPRDW005_HBA0"

zonecreate "SK_VSP_CL1E_DKDC2BKPPRDW005_HBA0","SK_VSP_CL1E;DKDC2BKPPRDW005_HBA0"
cfgadd "FABRIC1","SK_VSP_CL1E_DKDC2BKPPRDW005_HBA0"

cfgsave
cfgenable "FABRIC1"

==================================================

alicreate "DKDC1VIOA001_HBA2","10:00:00:90:FA:53:54:23"
zonecreate "BAL_VSP_CL3E_DKDC1VIOA001_HBA2","BAL_VSP_CL3E;DKDC1VIOA001_HBA2"
cfgadd "FABRIC1","BAL_VSP_CL3E_DKDC1VIOA001_HBA2"

cfgsave
cfgenable "FABRIC1"

=================================================

3E 
DKDC1VIOA002_HBA2
10000090FA5353B1

alicreate "DKDC1VIOA002_HBA2","10:00:00:90:FA:53:53:B1"
zonecreate "BAL_VSP_CL3E_DKDC1VIOA002_HBA2","BAL_VSP_CL3E;DKDC1VIOA002_HBA2"
cfgadd "FABRIC1","BAL_VSP_CL3E_DKDC1VIOA002_HBA2"

cfgsave
cfgenable "FABRIC1"

================================================
********************************************************************************************
DKDC2BKPPRDW005
23:89:00:00:87:3d:91:42
HUS Port - 0D , 1D

zonecreate "SK_HUS_Port_0D_DKDC2BKPPRDW005_HBA0","SK_HUS_Port_0D;DKDC2BKPPRDW005_HBA0"
cfgadd "FABRIC1","SK_HUS_Port_0D_DKDC2BKPPRDW005_HBA0"


Tape Library Zoning:-

Skovlounde

alicreate "SK_TL_DRV1_HBA0","50:01:04:f0:00:d2:35:93"
alicreate "SK_TL_DRV2_HBA0","50:01:04:f0:00:d2:35:96"

zonecreate "SK_TL_DRV1_HBA0_DKDC2BKPPRDW005_HBA0","SK_TL_DRV1_HBA0;DKDC2BKPPRDW005_HBA0"
cfgadd "FABRIC1","SK_TL_DRV1_HBA0_DKDC2BKPPRDW005_HBA0"

zonecreate "SK_TL_DRV2_HBA0_DKDC2BKPPRDW005_HBA0","SK_TL_DRV2_HBA0;DKDC2BKPPRDW005_HBA0"
cfgadd "FABRIC1","SK_TL_DRV2_HBA0_DKDC2BKPPRDW005_HBA0"


======================================================
DKDC1BKPPRDW005
23:89:00:00:87:3b:39:32
HUS Port - 0D , 1H

zonecreate "BAL_HUS_Port_0D_DKDC1BKPPRDW005_HBA0","BAL_HUS_Port_0D;DKDC1BKPPRDW005_HBA0"
cfgadd "FABRIC1","BAL_HUS_Port_0D_DKDC1BKPPRDW005_HBA0"



Tape Library Zoning:-

Ballerup

zonecreate "BAL_TL_DRV1_HBA0_DKDC1BKPPRDW005_HBA0","BAL_TL_DRV1_HBA0;DKDC1BKPPRDW005_HBA0"
cfgadd "FABRIC1","BAL_TL_DRV1_HBA0_DKDC1BKPPRDW005_HBA0"

zonecreate "BAL_TL_DRV2_HBA0_DKDC1BKPPRDW005_HBA0","BAL_TL_DRV2_HBA0;DKDC1BKPPRDW005_HBA0"
cfgadd "FABRIC1","BAL_TL_DRV2_HBA0_DKDC1BKPPRDW005_HBA0"

G600 Zoning:


zonecreate "BAL_G600_CL3E_DKDC1BKPPRDW005_HBA0","BAL_G600_CL3E;DKDC1BKPPRDW005_HBA0"
cfgadd "FABRIC1","BAL_G600_CL3E_DKDC1BKPPRDW005_HBA0"



zonecreate "BAL_G600_CL3F_DKDC1BKPPRDW005_HBA0","BAL_G600_CL3F;DKDC1BKPPRDW005_HBA0"
cfgadd "FABRIC1","BAL_G600_CL3F_DKDC1BKPPRDW005_HBA0"

cfgsave
cfgenable "FABRIC1"
========================================================


DKDC1XENPRDC065	10:00:00:90:fa:b3:45:6c
10:00:00:90:fa:b3:45:6d
2C, 2E

alicreate "DKDC1XENPRDC065_HBA0","10:00:00:90:fa:b3:45:6d"
zonecreate "BAL_VSP_CL2C_DKDC1XENPRDC065_HBA0","BAL_VSP_CL2C;DKDC1XENPRDC065_HBA0"
zonecreate "BAL_VSP_CL2E_DKDC1XENPRDC065_HBA0","BAL_VSP_CL2E;DKDC1XENPRDC065_HBA0"
cfgadd "FABRIC1","BAL_VSP_CL2C_DKDC1XENPRDC065_HBA0"
cfgadd "FABRIC1","BAL_VSP_CL2E_DKDC1XENPRDC065_HBA0"

cfgsave
cfgenable "FABRIC1"

Boot - F4:4B - 100GB

CRQ000000045905 

Assign following luns from HUS 150 to each server.

500 GB from SSD + SAS10K pool
10 GB from regular pool
10 TB from regular pool



========================================

23890000873b3932
1C
DKDC1BKPPRDW005_HBA0



23890000873b3930
8C
DKDC1BKPPRDW005_HBA1

========================================****************************************++++++++++++++++++++++++++++

DKDC1XENPRDC066	
10:00:00:90:fa:b3:05:49
2C, 2E

alicreate "DKDC1XENPRDC066_HBA0","10:00:00:90:fa:b3:05:49"
zonecreate "BAL_VSP_CL2C_DKDC1XENPRDC066_HBA0","BAL_VSP_CL2C;DKDC1XENPRDC066_HBA0"
zonecreate "BAL_VSP_CL2E_DKDC1XENPRDC066_HBA0","BAL_VSP_CL2E;DKDC1XENPRDC066_HBA0"
cfgadd "FABRIC1","BAL_VSP_CL2C_DKDC1XENPRDC066_HBA0"
cfgadd "FABRIC1","BAL_VSP_CL2E_DKDC1XENPRDC066_HBA0"

cfgsave
cfgenable "FABRIC1"


=================================

DKDC1XENPRDC067
10:00:00:90:fa:b3:43:b1
2C, 2E

alicreate "DKDC1XENPRDC067_HBA0","10:00:00:90:fa:b3:43:b1"
zonecreate "BAL_VSP_CL2C_DKDC1XENPRDC067_HBA0","BAL_VSP_CL2C;DKDC1XENPRDC067_HBA0"
zonecreate "BAL_VSP_CL2E_DKDC1XENPRDC067_HBA0","BAL_VSP_CL2E;DKDC1XENPRDC067_HBA0"
cfgadd "FABRIC1","BAL_VSP_CL2C_DKDC1XENPRDC067_HBA0"
cfgadd "FABRIC1","BAL_VSP_CL2E_DKDC1XENPRDC067_HBA0"

cfgsave
cfgenable "FABRIC1"

================================

DKDC1XENPRDC068
10:00:00:90:fa:b3:44:29
2C, 2E

alicreate "DKDC1XENPRDC068_HBA0","10:00:00:90:fa:b3:44:29"
zonecreate "BAL_VSP_CL2C_DKDC1XENPRDC068_HBA0","BAL_VSP_CL2C;DKDC1XENPRDC068_HBA0"
zonecreate "BAL_VSP_CL2E_DKDC1XENPRDC068_HBA0","BAL_VSP_CL2E;DKDC1XENPRDC068_HBA0"
cfgadd "FABRIC1","BAL_VSP_CL2C_DKDC1XENPRDC068_HBA0"
cfgadd "FABRIC1","BAL_VSP_CL2E_DKDC1XENPRDC068_HBA0"

cfgsave
cfgenable "FABRIC1"

done......
===================================

DKDC1XENPRDC069
10:00:00:90:fa:b3:44:bf
2C, 2E

alicreate "DKDC1XENPRDC069_HBA0","10:00:00:90:fa:b3:44:bf"
zonecreate "BAL_VSP_CL2C_DKDC1XENPRDC069_HBA0","BAL_VSP_CL2C;DKDC1XENPRDC069_HBA0"
zonecreate "BAL_VSP_CL2E_DKDC1XENPRDC069_HBA0","BAL_VSP_CL2E;DKDC1XENPRDC069_HBA0"
cfgadd "FABRIC1","BAL_VSP_CL2C_DKDC1XENPRDC069_HBA0"
cfgadd "FABRIC1","BAL_VSP_CL2E_DKDC1XENPRDC069_HBA0"

cfgsave
cfgenable "FABRIC1"


===========================================


DKDC1XENPRDC070
10:00:00:90:fa:b3:06:b1
2C, 2E

alicreate "DKDC1XENPRDC070_HBA0","10:00:00:90:fa:b3:06:b1"
zonecreate "BAL_VSP_CL2C_DKDC1XENPRDC070_HBA0","BAL_VSP_CL2C;DKDC1XENPRDC070_HBA0"
zonecreate "BAL_VSP_CL2E_DKDC1XENPRDC070_HBA0","BAL_VSP_CL2E;DKDC1XENPRDC070_HBA0"
cfgadd "FABRIC1","BAL_VSP_CL2C_DKDC1XENPRDC070_HBA0"
cfgadd "FABRIC1","BAL_VSP_CL2E_DKDC1XENPRDC070_HBA0"

cfgsave
cfgenable "FABRIC1"

========================================


DKDC1XENPRDC071
10:00:00:90:fa:b3:05:1c
2C, 2E

alicreate "DKDC1XENPRDC071_HBA0","10:00:00:90:fa:b3:05:1c"
zonecreate "BAL_VSP_CL2C_DKDC1XENPRDC071_HBA0","BAL_VSP_CL2C;DKDC1XENPRDC071_HBA0"
zonecreate "BAL_VSP_CL2E_DKDC1XENPRDC071_HBA0","BAL_VSP_CL2E;DKDC1XENPRDC071_HBA0"
cfgadd "FABRIC1","BAL_VSP_CL2C_DKDC1XENPRDC071_HBA0"
cfgadd "FABRIC1","BAL_VSP_CL2E_DKDC1XENPRDC071_HBA0"

cfgsave
cfgenable "FABRIC1"

==============================================================================================================
FB:41
FB:42
FB:43
FB:44
FB:45
FB:46

===========================================================================


dkdc1esbdmoa001

3C, 3E
6C, 6E

SW1-
c050760775ac0158
c050760775ac015a


alicreate "dkdc1esbdmoa001_HBA0","c0:50:76:07:75:ac:01:58"
zonecreate "BAL_VSP_CL3C_dkdc1esbdmoa001_HBA0","BAL_VSP_CL3C;dkdc1esbdmoa001_HBA0"
cfgadd "FABRIC1","BAL_VSP_CL3C_dkdc1esbdmoa001_HBA0"

alicreate "dkdc1esbdmoa001_HBA2","c0:50:76:07:75:ac:01:5a"
zonecreate "BAL_VSP_CL3E_dkdc1esbdmoa001_HBA2","BAL_VSP_CL3E;dkdc1esbdmoa001_HBA2"
cfgadd "FABRIC1","BAL_VSP_CL3E_dkdc1esbdmoa001_HBA2"


cfgsave
cfgenable "FABRIC1"

F4:4c - 75GB
F4:4D - 75GB
===========================

dkdc1bpmdmoa001

3C, 3E
6C, 6E

SW1-
c050760775ac0160
c050760775ac0162


alicreate "dkdc1bpmdmoa001_HBA0","c0:50:76:07:75:ac:01:60"
zonecreate "BAL_VSP_CL3C_dkdc1bpmdmoa001_HBA0","BAL_VSP_CL3C;dkdc1bpmdmoa001_HBA0"
cfgadd "FABRIC1","BAL_VSP_CL3C_dkdc1bpmdmoa001_HBA0"

alicreate "dkdc1bpmdmoa001_HBA2","c0:50:76:07:75:ac:01:62"
zonecreate "BAL_VSP_CL3E_dkdc1bpmdmoa001_HBA2","BAL_VSP_CL3E;dkdc1bpmdmoa001_HBA2"
cfgadd "FABRIC1","BAL_VSP_CL3E_dkdc1bpmdmoa001_HBA2"


cfgsave
cfgenable "FABRIC1" 

F4:4E - 75GB
F4:4F - 75GB
====================================================================================================


DKDC2MGRTSTW001 
23890000873c9910
23890000873c9912

alicreate "DKDC2MGRTSTW001_HBA0","23:89:00:00:87:3c:99:12"
zonecreate "SK_VSP_CL1C_DKDC2MGRTSTW001_HBA0","SK_VSP_CL1C;DKDC2MGRTSTW001_HBA0"
cfgadd "FABRIC1","SK_VSP_CL1C_DKDC2MGRTSTW001_HBA0"

zonecreate "SK_VSP_CL1E_DKDC2MGRTSTW001_HBA0","SK_VSP_CL1E;DKDC2MGRTSTW001_HBA0"
cfgadd "FABRIC1","SK_VSP_CL1E_DKDC2MGRTSTW001_HBA0"

cfgsave
cfgenable "FABRIC1"


----------------------------------------------------------------------------------------

DKDC2MGRTSTW002
23890000873c9920
23890000873c9922

alicreate "DKDC2MGRTSTW002_HBA0","23:89:00:00:87:3c:99:22"
zonecreate "SK_VSP_CL1C_DKDC2MGRTSTW002_HBA0","SK_VSP_CL1C;DKDC2MGRTSTW002_HBA0"
cfgadd "FABRIC1","SK_VSP_CL1C_DKDC2MGRTSTW002_HBA0"

zonecreate "SK_VSP_CL1E_DKDC2MGRTSTW002_HBA0","SK_VSP_CL1E;DKDC2MGRTSTW002_HBA0"
cfgadd "FABRIC1","SK_VSP_CL1E_DKDC2MGRTSTW002_HBA0"

cfgsave
cfgenable "FABRIC1"

----------------------------------------------------------------------------------------

DKDC2MGRTSTW003 
23890000873c9930
23890000873c9932

alicreate "DKDC2MGRTSTW003_HBA0","23:89:00:00:87:3c:99:32"
zonecreate "SK_VSP_CL1C_DKDC2MGRTSTW003_HBA0","SK_VSP_CL1C;DKDC2MGRTSTW003_HBA0"
cfgadd "FABRIC1","SK_VSP_CL1C_DKDC2MGRTSTW003_HBA0"

zonecreate "SK_VSP_CL1E_DKDC2MGRTSTW003_HBA0","SK_VSP_CL1E;DKDC2MGRTSTW003_HBA0"
cfgadd "FABRIC1","SK_VSP_CL1E_DKDC2MGRTSTW003_HBA0"

cfgsave
cfgenable "FABRIC1"

---------------------------------------------------------------------------------------------

DKDC2MGRTSTW001- F4:50
DKDC2MGRTSTW002 - F4:51
DKDC2MGRTSTW003 - F4:52

__________________________________________________________________________

DKDC2XENPRDC049
10:00:00:90:fa:b3:45:33
10:00:00:90:fa:b3:45:34
2C, 2E

alicreate "DKDC2XENPRDC049_HBA0","10:00:00:90:fa:b3:45:34"
zonecreate "SK_VSP_CL2C_DKDC2XENPRDC049_HBA0","SK_VSP_CL2C;DKDC2XENPRDC049_HBA0"
zonecreate "SK_VSP_CL2E_DKDC2XENPRDC049_HBA0","SK_VSP_CL2E;DKDC2XENPRDC049_HBA0"
cfgadd "FABRIC1","SK_VSP_CL2C_DKDC2XENPRDC049_HBA0"
cfgadd "FABRIC1","SK_VSP_CL2E_DKDC2XENPRDC049_HBA0"

cfgsave
cfgenable "FABRIC1"

=============

DKDC2XENPRDC050
10:00:00:90:fa:b3:43:ef
10:00:00:90:fa:b3:43:f0

alicreate "DKDC2XENPRDC050_HBA0","10:00:00:90:fa:b3:43:f0"
zonecreate "SK_VSP_CL2C_DKDC2XENPRDC050_HBA0","SK_VSP_CL2C;DKDC2XENPRDC050_HBA0"
zonecreate "SK_VSP_CL2E_DKDC2XENPRDC050_HBA0","SK_VSP_CL2E;DKDC2XENPRDC050_HBA0"
cfgadd "FABRIC1","SK_VSP_CL2C_DKDC2XENPRDC050_HBA0"
cfgadd "FABRIC1","SK_VSP_CL2E_DKDC2XENPRDC050_HBA0"

cfgsave
cfgenable "FABRIC1"

=============

DKDC2XENPRDC051
10:00:00:90:fa:b3:43:d4
10:00:00:90:fa:b3:43:d5

alicreate "DKDC2XENPRDC051_HBA0","10:00:00:90:fa:b3:43:d5"
zonecreate "SK_VSP_CL2C_DKDC2XENPRDC051_HBA0","SK_VSP_CL2C;DKDC2XENPRDC051_HBA0"
zonecreate "SK_VSP_CL2E_DKDC2XENPRDC051_HBA0","SK_VSP_CL2E;DKDC2XENPRDC051_HBA0"
cfgadd "FABRIC1","SK_VSP_CL2C_DKDC2XENPRDC051_HBA0"
cfgadd "FABRIC1","SK_VSP_CL2E_DKDC2XENPRDC051_HBA0"

cfgsave
cfgenable "FABRIC1"

=============++++++++++++++++++++++++++++++++++++++++++++++++++++++============================

DKDC2XENPRDC052
10:00:00:90:fa:b3:42:e6
10:00:00:90:fa:b3:42:e7

F4:63 - 100GB

alicreate "DKDC2XENPRDC052_HBA0","10:00:00:90:fa:b3:42:e7"
zonecreate "SK_VSP_CL2C_DKDC2XENPRDC052_HBA0","SK_VSP_CL2C;DKDC2XENPRDC052_HBA0"
zonecreate "SK_VSP_CL2E_DKDC2XENPRDC052_HBA0","SK_VSP_CL2E;DKDC2XENPRDC052_HBA0"
cfgadd "FABRIC1","SK_VSP_CL2C_DKDC2XENPRDC052_HBA0"
cfgadd "FABRIC1","SK_VSP_CL2E_DKDC2XENPRDC052_HBA0"

cfgsave
cfgenable "FABRIC1"

=====

cfgremove "FABRIC1","SK_VSP_CL2C_DKDC2XENPRDC052_HBA0"
cfgremove "FABRIC1","SK_VSP_CL2E_DKDC2XENPRDC052_HBA0"
zonedelete "SK_VSP_CL2C_DKDC2XENPRDC052_HBA0"
zonedelete "SK_VSP_CL2E_DKDC2XENPRDC052_HBA0"
alidelete "DKDC2XENPRDC052_HBA0"



















=============&&&&&&&&&&&&&&&&&&&&&&&&&&&&&&&&&&&&&&&&&&&&&=====================================

DKDC2XENPRDC053
10:00:00:90:fa:b3:43:76
10:00:00:90:fa:b3:43:77

alicreate "DKDC2XENPRDC053_HBA0","10:00:00:90:fa:b3:43:77"
zonecreate "SK_VSP_CL2C_DKDC2XENPRDC053_HBA0","SK_VSP_CL2C;DKDC2XENPRDC053_HBA0"
zonecreate "SK_VSP_CL2E_DKDC2XENPRDC053_HBA0","SK_VSP_CL2E;DKDC2XENPRDC053_HBA0"
cfgadd "FABRIC1","SK_VSP_CL2C_DKDC2XENPRDC053_HBA0"
cfgadd "FABRIC1","SK_VSP_CL2E_DKDC2XENPRDC053_HBA0"

cfgsave
cfgenable "FABRIC1"

=============

DKDC2XENPRDC054
10:00:00:90:fa:b3:45:51
10:00:00:90:fa:b3:45:52

alicreate "DKDC2XENPRDC054_HBA0","10:00:00:90:fa:b3:45:52"
zonecreate "SK_VSP_CL2C_DKDC2XENPRDC054_HBA0","SK_VSP_CL2C;DKDC2XENPRDC054_HBA0"
zonecreate "SK_VSP_CL2E_DKDC2XENPRDC054_HBA0","SK_VSP_CL2E;DKDC2XENPRDC054_HBA0"
cfgadd "FABRIC1","SK_VSP_CL2C_DKDC2XENPRDC054_HBA0"
cfgadd "FABRIC1","SK_VSP_CL2E_DKDC2XENPRDC054_HBA0"

cfgsave
cfgenable "FABRIC1"

=============

DKDC2XENPRDC055
10:00:00:90:fa:b3:44:07
10:00:00:90:fa:b3:44:08

alicreate "DKDC2XENPRDC055_HBA0","10:00:00:90:fa:b3:44:08"
zonecreate "SK_VSP_CL2C_DKDC2XENPRDC055_HBA0","SK_VSP_CL2C;DKDC2XENPRDC055_HBA0"
zonecreate "SK_VSP_CL2E_DKDC2XENPRDC055_HBA0","SK_VSP_CL2E;DKDC2XENPRDC055_HBA0"
cfgadd "FABRIC1","SK_VSP_CL2C_DKDC2XENPRDC055_HBA0"
cfgadd "FABRIC1","SK_VSP_CL2E_DKDC2XENPRDC055_HBA0"

cfgsave
cfgenable "FABRIC1"

=============

DKDC2XENPRDC056
10:00:00:90:fa:b3:41:ff
10:00:00:90:fa:b3:42:00

alicreate "DKDC2XENPRDC056_HBA0","10:00:00:90:fa:b3:42:00"
zonecreate "SK_VSP_CL2C_DKDC2XENPRDC056_HBA0","SK_VSP_CL2C;DKDC2XENPRDC056_HBA0"
zonecreate "SK_VSP_CL2E_DKDC2XENPRDC056_HBA0","SK_VSP_CL2E;DKDC2XENPRDC056_HBA0"
cfgadd "FABRIC1","SK_VSP_CL2C_DKDC2XENPRDC056_HBA0"
cfgadd "FABRIC1","SK_VSP_CL2E_DKDC2XENPRDC056_HBA0"

cfgsave
cfgenable "FABRIC1"

=================================================================================

Skovlounde HUS
1D
0D
1B
1C


HNAS 4 PORTS-----

FABRIC 1-

SK_HNAS_CL1_HBA0 - 50:03:01:70:00:05:e3:e1 - Used
SK_HNAS_CL1_HBA2 - 
SK_HNAS_CL2_HBA0 - 50:03:01:70:00:05:e3:c1 - 
SK_HNAS_CL2_HBA2 

------------------------------------------
Done-

zonecreate "SK_HUS_Port_1D_SK_HNAS_CL1_HBA0","SK_HUS_Port_1D;SK_HNAS_CL1_HBA0"
cfgadd "FABRIC1","SK_HUS_Port_1D_SK_HNAS_CL1_HBA0"

zonecreate "SK_HUS_Port_0D_SK_HNAS_CL2_HBA0","SK_HUS_Port_0D;SK_HNAS_CL2_HBA0"
cfgadd "FABRIC1","SK_HUS_Port_0D_SK_HNAS_CL2_HBA0"

---

zonecreate "SK_HUS_Port_1B_SK_HNAS_CL1_HBA2","SK_HUS_Port_1B;SK_HNAS_CL1_HBA2"
cfgadd "FABRIC1","SK_HUS_Port_1B_SK_HNAS_CL1_HBA2"

zonecreate "SK_HUS_Port_1C_SK_HNAS_CL2_HBA2","SK_HUS_Port_1C;SK_HNAS_CL2_HBA2"
cfgadd "FABRIC1","SK_HUS_Port_1C_SK_HNAS_CL2_HBA2"

cfgsave
cfgenable "FABRIC1"

-


cfgremove "FABRIC1","SK_HUS_Port_1D_SK_HNAS_CL2_HBA0"
zonedelete "SK_HUS_Port_1D_SK_HNAS_CL2_HBA0"

==========================================
SKHUS_HNAS_CL2_HBA0 - 0D
SKHUS_HNAS_CL1_HBA0 - 1D

SKHUS_HNAS_CL1_HBA1 - 0H
SKHUS_HNAS_CL1_HBA1 - 1H

DC2 HUS LUN ID for HNAS---------

HLUN	VOL
0030	0117
0040	0119
0041	0120
0042	0121
0043	0122
0044	0123
0045	0124
0046	0125
0047	0126
0048	0112
0049	0113
0050	0114
0051	0115



*******************************************************************************

DC1 Server: DKDC1TRFSAPBWT01
WWPN:
fcs0=C0:50:76:07:75:AC:00:B6 - F1
fcs1=C0:50:76:07:75:AC:00:B8 - F1
fcs2=C0:50:76:07:75:AC:00:BA
fcs3=C0:50:76:07:75:AC:00:A6

zonecreate "LSAN_SK_VSP_CL3C_DKDC1TRFSAPBWT01_HBA0","SK_VSP_CL3C;DKDC1TRFSAPBWT01_HBA0"
cfgadd "FABRIC1","LSAN_SK_VSP_CL3C_DKDC1TRFSAPBWT01_HBA0"

zonecreate "LSAN_SK_VSP_CL3E_DKDC1TRFSAPBWT01_HBA2","SK_VSP_CL3E;DKDC1TRFSAPBWT01_HBA2"
cfgadd "FABRIC1","LSAN_SK_VSP_CL3E_DKDC1TRFSAPBWT01_HBA2"

cfgsave
cfgenable "FABRIC1"


===============================================================

DKDC1ESBPRDA003

c050760775ac0138
c050760775ac013a



zonecreate "LSAN_SK_VSP_CL3C_DKDC1ESBPRDA003_HBA0","SK_VSP_CL3C;DKDC1ESBPRDA003_HBA0"
cfgadd "FABRIC1","LSAN_SK_VSP_CL3C_DKDC1ESBPRDA003_HBA0"

zonecreate "LSAN_SK_VSP_CL3E_DKDC1ESBPRDA003_HBA2","SK_VSP_CL3E;DKDC1ESBPRDA003_HBA2"
cfgadd "FABRIC1","LSAN_SK_VSP_CL3E_DKDC1ESBPRDA003_HBA2"

cfgsave
cfgenable "FABRIC1"


===================================

DKDC2ESBPRDA003

c050760775ae0156
c050760775ae0154-----3E



zonecreate "LSAN_BAL_VSP_CL3C_DKDC2ESBPRDA003_HBA0","BAL_VSP_CL3C;DKDC2ESBPRDA003_HBA0"
cfgadd "FABRIC1","LSAN_BAL_VSP_CL3C_DKDC2ESBPRDA003_HBA0"

zonecreate "LSAN_BAL_VSP_CL3E_DKDC2ESBPRDA003_HBA2","BAL_VSP_CL3E;DKDC2ESBPRDA003_HBA2"
cfgadd "FABRIC1","LSAN_BAL_VSP_CL3E_DKDC2ESBPRDA003_HBA2"

cfgsave
cfgenable "FABRIC1" 

================================================================
*****

dkdc1bpmprda001---


alicreate "DKDC1BPMPRDA001_HBA0","c0:50:76:07:75:ac:01:40"
alicreate "DKDC1BPMPRDA001_HBA2","c0:50:76:07:75:ac:01:42"

zonecreate "LSAN_SK_VSP_CL3C_DKDC1BPMPRDA001_HBA0","SK_VSP_CL3C;DKDC1BPMPRDA001_HBA0"
cfgadd "FABRIC1","LSAN_SK_VSP_CL3C_DKDC1BPMPRDA001_HBA0"

zonecreate "LSAN_SK_VSP_CL3E_DKDC1BPMPRDA001_HBA2","SK_VSP_CL3E;DKDC1BPMPRDA001_HBA2"
cfgadd "FABRIC1","LSAN_SK_VSP_CL3E_DKDC1BPMPRDA001_HBA2"

cfgsave
cfgenable "FABRIC1"

---
alicreate "DKDC2BPMPRDA001_HBA0","c0:50:76:07:75:ae:01:5c"
alicreate "DKDC2BPMPRDA001_HBA2","c0:50:76:07:75:ae:01:5a"

dkdc2bpmprda001---

c050760775ae015c
c050760775ae015a

zonecreate "LSAN_BAL_VSP_CL3C_DKDC2BPMPRDA001_HBA0","BAL_VSP_CL3C;DKDC2BPMPRDA001_HBA0"
cfgadd "FABRIC1","LSAN_BAL_VSP_CL3C_DKDC2BPMPRDA001_HBA0"

zonecreate "LSAN_BAL_VSP_CL3E_DKDC2BPMPRDA001_HBA2","BAL_VSP_CL3E;DKDC2BPMPRDA001_HBA2"
cfgadd "FABRIC1","LSAN_BAL_VSP_CL3E_DKDC2BPMPRDA001_HBA2"

cfgsave
cfgenable "FABRIC1"


DC1 VSP - HB LUN - F7:64 - 1 GB

DC2 VSP - HB LUN - F7:49 - 1 GB

======================================================================================

alicreate "dkdc1bpmdmoa001_HBA0","c0:50:76:07:75:ac:01:60"

zonecreate "LSAN_SK_VSP_CL3C_dkdc1bpmdmoa001_HBA0","SK_VSP_CL3C;dkdc1bpmdmoa001_HBA0"
cfgadd "FABRIC1","LSAN_SK_VSP_CL3C_dkdc1bpmdmoa001_HBA0"

alicreate "dkdc1bpmdmoa001_HBA2","c0:50:76:07:75:ac:01:62"

zonecreate "LSAN_SK_VSP_CL3E_dkdc1bpmdmoa001_HBA2","SK_VSP_CL3E;dkdc1bpmdmoa001_HBA2"
cfgadd "FABRIC1","LSAN_SK_VSP_CL3E_dkdc1bpmdmoa001_HBA2"


cfgsave
cfgenable "FABRIC1"

DKDC1BPMDMOA001_HBA0

=====================================

DKDC2BPMDMOA001
c0:50:76:07:75:ae:01:74 - HBA0
c0:50:76:07:75:ae:01:72 - HBA2

zonecreate "LSAN_BAL_VSP_CL3C_dkdc2bpmdmoa001_HBA0","BAL_VSP_CL3C;dkdc2bpmdmoa001_HBA0"
cfgadd "FABRIC1","LSAN_BAL_VSP_CL3C_dkdc2bpmdmoa001_HBA0"

zonecreate "LSAN_BAL_VSP_CL3E_dkdc2bpmdmoa001_HBA2","BAL_VSP_CL3E;dkdc2bpmdmoa001_HBA2"
cfgadd "FABRIC1","LSAN_BAL_VSP_CL3E_dkdc2bpmdmoa001_HBA2"

cfgsave
cfgenable "FABRIC1"

DKDC2BPMDMOA001_HBA0

DC1 VSP F7:65 - 1GB
DC2 VSP F7:4A - 1GB

===================================================
LPAR-------------

DKDC2IAMPOCW001
238900008734E120
238900008734E122

alicreate "DKDC2IAMPOCW001_HBA0","23:89:00:00:87:34:E1:22"
zonecreate "SK_VSP_CL1C_DKDC2IAMPOCW001_HBA0","SK_VSP_CL1C;DKDC2IAMPOCW001_HBA0"
cfgadd "FABRIC1","SK_VSP_CL1C_DKDC2IAMPOCW001_HBA0"

zonecreate "SK_VSP_CL1E_DKDC2IAMPOCW001_HBA0","SK_VSP_CL1E;DKDC2IAMPOCW001_HBA0"
cfgadd "FABRIC1","SK_VSP_CL1E_DKDC2IAMPOCW001_HBA0"

cfgsave
cfgenable "FABRIC1"

Boot - FC:02
----------------------------

DKDC2IAMPOCW002
238900008734E130
238900008734E132

alicreate "DKDC2IAMPOCW002_HBA0","23:89:00:00:87:34:E1:32"
zonecreate "SK_VSP_CL1C_DKDC2IAMPOCW002_HBA0","SK_VSP_CL1C;DKDC2IAMPOCW002_HBA0"
cfgadd "FABRIC1","SK_VSP_CL1C_DKDC2IAMPOCW002_HBA0"

zonecreate "SK_VSP_CL1E_DKDC2IAMPOCW002_HBA0","SK_VSP_CL1E;DKDC2IAMPOCW002_HBA0"
cfgadd "FABRIC1","SK_VSP_CL1E_DKDC2IAMPOCW002_HBA0"

cfgsave
cfgenable "FABRIC1"

Boot - FC:05
----------------------------

DKDC2IAMPOCW003 
238900008734E140
238900008734E142

alicreate "DKDC2IAMPOCW003_HBA0","23:89:00:00:87:34:E1:42"
zonecreate "SK_VSP_CL1C_DKDC2IAMPOCW003_HBA0","SK_VSP_CL1C;DKDC2IAMPOCW003_HBA0"
cfgadd "FABRIC1","SK_VSP_CL1C_DKDC2IAMPOCW003_HBA0"

zonecreate "SK_VSP_CL1E_DKDC2IAMPOCW003_HBA0","SK_VSP_CL1E;DKDC2IAMPOCW003_HBA0"
cfgadd "FABRIC1","SK_VSP_CL1E_DKDC2IAMPOCW003_HBA0"

cfgsave
cfgenable "FABRIC1"

Boot - FC:08

===================================================================================================

DKDC2MGRPRDW006

WWPN:23890000873c9950 
WWPN:23890000873c9952

alicreate "DKDC2MGRPRDW006_HBA0","23:89:00:00:87:3C:99:52"
zonecreate "SK_VSP_CL1C_DKDC2MGRPRDW006_HBA0","SK_VSP_CL1C;DKDC2MGRPRDW006_HBA0"
cfgadd "FABRIC1","SK_VSP_CL1C_DKDC2MGRPRDW006_HBA0"

zonecreate "SK_VSP_CL1E_DKDC2MGRPRDW006_HBA0","SK_VSP_CL1E;DKDC2MGRPRDW006_HBA0"
cfgadd "FABRIC1","SK_VSP_CL1E_DKDC2MGRPRDW006_HBA0"

cfgsave
cfgenable "FABRIC1"

------------------------------------------------------------------------------------

DKDC2MGRPRDW007

WWPN:23890000873c9960
WWPN:23890000873c9962

alicreate "DKDC2MGRPRDW007_HBA0","23:89:00:00:87:3C:99:62"
zonecreate "SK_VSP_CL1C_DKDC2MGRPRDW007_HBA0","SK_VSP_CL1C;DKDC2MGRPRDW007_HBA0"
cfgadd "FABRIC1","SK_VSP_CL1C_DKDC2MGRPRDW007_HBA0"

zonecreate "SK_VSP_CL1E_DKDC2MGRPRDW007_HBA0","SK_VSP_CL1E;DKDC2MGRPRDW007_HBA0"
cfgadd "FABRIC1","SK_VSP_CL1E_DKDC2MGRPRDW007_HBA0"

cfgsave
cfgenable "FABRIC1"


=================================================================================================

DKDC2REPLPRDL001

50:00:08:70:00:5B:A1:50
50:00:08:70:00:5B:A1:52


alicreate "DKDC2REPLPRDL001_HBA0","50:00:08:70:00:5B:A1:52"
zonecreate "SK_VSP_CL3C_DKDC2REPLPRDL001_HBA0","SK_VSP_CL3C;DKDC2REPLPRDL001_HBA0"
cfgadd "FABRIC1","SK_VSP_CL3C_DKDC2REPLPRDL001_HBA0"

zonecreate "SK_VSP_CL3E_DKDC2REPLPRDL001_HBA0","SK_VSP_CL3E;DKDC2REPLPRDL001_HBA0"
cfgadd "FABRIC1","SK_VSP_CL3E_DKDC2REPLPRDL001_HBA0"

cfgsave
cfgenable "FABRIC1"

Boot - F4:36 - 60 GB

=================================================================================================

DKDC1XENPRDC072k
10:00:00:90:FA:B3:D1:60
10:00:00:90:FA:B3:D1:61

alicreate "DKDC1XENPRDC072k_HBA0","10:00:00:90:FA:B3:D1:61"
zonecreate "BAL_VSP_CL2C_DKDC1XENPRDC072k_HBA0","BAL_VSP_CL2C;DKDC1XENPRDC072k_HBA0"
zonecreate "BAL_VSP_CL2E_DKDC1XENPRDC072k_HBA0","BAL_VSP_CL2E;DKDC1XENPRDC072k_HBA0"
cfgadd "FABRIC1","BAL_VSP_CL2C_DKDC1XENPRDC072k_HBA0"
cfgadd "FABRIC1","BAL_VSP_CL2E_DKDC1XENPRDC072k_HBA0"

cfgsave
cfgenable "FABRIC1"

----------------------------------------------------------------------------------------


alicreate "_HBA0","50:00:08:70:00:5B:A1:52"
zonecreate "SK_VSP_CL3C_DKDC2REPLPRDL001_HBA0","SK_VSP_CL3C;DKDC2REPLPRDL001_HBA0"
cfgadd "FABRIC1","SK_VSP_CL3C_DKDC2REPLPRDL001_HBA0"

zonecreate "SK_VSP_CL3E_DKDC2REPLPRDL001_HBA0","SK_VSP_CL3E;DKDC2REPLPRDL001_HBA0"
cfgadd "FABRIC1","SK_VSP_CL3E_DKDC2REPLPRDL001_HBA0"

cfgsave
cfgenable "FABRIC1"

===

CRQ000000054214

Decommission of AIX server TVGDBSCOPT02

6C - C050760775AE0040
6E - C050760775AE0046

3C - C050760775AE0044
3E - C050760775AE0042

zoneshow -i |grep "DKDC2TVGDBSCOPT02_HBA0"


cfgremove "FABRIC1","SK_VSP_CL3C_DKDC2TVGDBSCOPT02_HBA0"
zonedelete "SK_VSP_CL3C_DKDC2TVGDBSCOPT02_HBA0"
alidelete "DKDC2TVGDBSCOPT02_HBA0"

cfgremove "FABRIC1","SK_VSP_CL3E_DKDC2TVGDBSCOPT02_HBA2"
cfgremove "FABRIC1","LSAN_BAL_VSP_CL3E_DKDC2TVGDBSCOPT02_HBA2"
zonedelete "SK_VSP_CL3E_DKDC2TVGDBSCOPT02_HBA2"
zonedelete "LSAN_BAL_VSP_CL3E_DKDC2TVGDBSCOPT02_HBA2"
alidelete "DKDC2TVGDBSCOPT02_HBA2"

cfgsave
cfgenable "FABRIC1"

=========================================================================

DKDC1XENPRDC073
10:00:00:90:FA:B3:D0:F4
10:00:00:90:FA:B3:D0:F5

alicreate "DKDC1XENPRDC073_HBA0","10:00:00:90:FA:B3:D0:F4"
zonecreate "BAL_VSP_CL2C_DKDC1XENPRDC073_HBA0","BAL_VSP_CL2C;DKDC1XENPRDC073_HBA0"
zonecreate "BAL_VSP_CL2E_DKDC1XENPRDC073_HBA0","BAL_VSP_CL2E;DKDC1XENPRDC073_HBA0"
cfgadd "FABRIC1","BAL_VSP_CL2C_DKDC1XENPRDC073_HBA0"
cfgadd "FABRIC1","BAL_VSP_CL2E_DKDC1XENPRDC073_HBA0"

cfgsave
cfgenable "FABRIC1"

FB:00 - 100 GB Boot LUN

=====================

DKDC1XENPRDC074
10:00:00:90:FA:B3:43:97
10:00:00:90:FA:B3:43:98

alicreate "DKDC1XENPRDC074_HBA0","10:00:00:90:FA:B3:43:97"
zonecreate "BAL_VSP_CL2C_DKDC1XENPRDC074_HBA0","BAL_VSP_CL2C;DKDC1XENPRDC074_HBA0"
zonecreate "BAL_VSP_CL2E_DKDC1XENPRDC074_HBA0","BAL_VSP_CL2E;DKDC1XENPRDC074_HBA0"
cfgadd "FABRIC1","BAL_VSP_CL2C_DKDC1XENPRDC074_HBA0"
cfgadd "FABRIC1","BAL_VSP_CL2E_DKDC1XENPRDC074_HBA0"

cfgsave
cfgenable "FABRIC1"


FB:47 - 100 GB Boot LUN

=====================

DKDC1XENPRDC075
10:00:00:90:FA:B3:43:2B (B-F1)
10:00:00:90:FA:B3:43:2C

alicreate "DKDC1XENPRDC075_HBA0","10:00:00:90:FA:B3:43:2B"
zonecreate "BAL_VSP_CL2C_DKDC1XENPRDC075_HBA0","BAL_VSP_CL2C;DKDC1XENPRDC075_HBA0"
zonecreate "BAL_VSP_CL2E_DKDC1XENPRDC075_HBA0","BAL_VSP_CL2E;DKDC1XENPRDC075_HBA0"
cfgadd "FABRIC1","BAL_VSP_CL2C_DKDC1XENPRDC075_HBA0"
cfgadd "FABRIC1","BAL_VSP_CL2E_DKDC1XENPRDC075_HBA0"

cfgsave
cfgenable "FABRIC1"


FB:48 - 100 GB Boot LUN

==================================================================================================

DKDC1XENPRDC076
10:00:00:90:fa:b3:42:73	
10:00:00:90:fa:b3:42:74

alicreate "DKDC1XENPRDC076_HBA0","10:00:00:90:fa:b3:42:73"
zonecreate "BAL_VSP_CL2C_DKDC1XENPRDC076_HBA0","BAL_VSP_CL2C;DKDC1XENPRDC076_HBA0"
zonecreate "BAL_VSP_CL2E_DKDC1XENPRDC076_HBA0","BAL_VSP_CL2E;DKDC1XENPRDC076_HBA0"
cfgadd "FABRIC1","BAL_VSP_CL2C_DKDC1XENPRDC076_HBA0"
cfgadd "FABRIC1","BAL_VSP_CL2E_DKDC1XENPRDC076_HBA0"

cfgsave
cfgenable "FABRIC1"

FB:49 - 100 GB BOOT LUN

===============================================

DKDC1XENPRDC077	
10:00:00:90:fa:b3:42:5f	
10:00:00:90:fa:b3:42:60

alicreate "DKDC1XENPRDC077_HBA0","10:00:00:90:fa:b3:42:5f"
zonecreate "BAL_VSP_CL2C_DKDC1XENPRDC077_HBA0","BAL_VSP_CL2C;DKDC1XENPRDC077_HBA0"
zonecreate "BAL_VSP_CL2E_DKDC1XENPRDC077_HBA0","BAL_VSP_CL2E;DKDC1XENPRDC077_HBA0"
cfgadd "FABRIC1","BAL_VSP_CL2C_DKDC1XENPRDC077_HBA0"
cfgadd "FABRIC1","BAL_VSP_CL2E_DKDC1XENPRDC077_HBA0"

cfgsave
cfgenable "FABRIC1"

FB:4A - 100 GB BOOT LUN

===============================================
DKDC1XENPRDC078	
10:00:00:90:fa:b3:d0:5b	
10:00:00:90:fa:b3:d0:5c

alicreate "DKDC1XENPRDC078_HBA0","10:00:00:90:fa:b3:d0:5b"
zonecreate "BAL_VSP_CL2C_DKDC1XENPRDC078_HBA0","BAL_VSP_CL2C;DKDC1XENPRDC078_HBA0"
zonecreate "BAL_VSP_CL2E_DKDC1XENPRDC078_HBA0","BAL_VSP_CL2E;DKDC1XENPRDC078_HBA0"
cfgadd "FABRIC1","BAL_VSP_CL2C_DKDC1XENPRDC078_HBA0"
cfgadd "FABRIC1","BAL_VSP_CL2E_DKDC1XENPRDC078_HBA0"

cfgsave
cfgenable "FABRIC1"

FB:4B - 100 GB BOOT LUN

===============================================
DKDC1XENPRDC079	
10:00:00:90:fa:b3:42:4f	
10:00:00:90:fa:b3:42:50

alicreate "DKDC1XENPRDC079_HBA0","10:00:00:90:fa:b3:42:4f"
zonecreate "BAL_VSP_CL2C_DKDC1XENPRDC079_HBA0","BAL_VSP_CL2C;DKDC1XENPRDC079_HBA0"
zonecreate "BAL_VSP_CL2E_DKDC1XENPRDC079_HBA0","BAL_VSP_CL2E;DKDC1XENPRDC079_HBA0"
cfgadd "FABRIC1","BAL_VSP_CL2C_DKDC1XENPRDC079_HBA0"
cfgadd "FABRIC1","BAL_VSP_CL2E_DKDC1XENPRDC079_HBA0"

cfgsave
cfgenable "FABRIC1"

FB:4C - 100 GB BOOT LUN

===============================================
DKDC1XENPRDC080	
10:00:00:90:fa:b3:d0:16	
10:00:00:90:fa:b3:d0:17

alicreate "DKDC1XENPRDC080_HBA0","10:00:00:90:fa:b3:d0:16"
zonecreate "BAL_VSP_CL2C_DKDC1XENPRDC080_HBA0","BAL_VSP_CL2C;DKDC1XENPRDC080_HBA0"
zonecreate "BAL_VSP_CL2E_DKDC1XENPRDC080_HBA0","BAL_VSP_CL2E;DKDC1XENPRDC080_HBA0"
cfgadd "FABRIC1","BAL_VSP_CL2C_DKDC1XENPRDC080_HBA0"
cfgadd "FABRIC1","BAL_VSP_CL2E_DKDC1XENPRDC080_HBA0"

cfgsave
cfgenable "FABRIC1"

FB:4D - 100 GB BOOT LUN
___________________________________________________
_______________________________________________________

Server - DKDC2BKPTESTLPAR
Boot LUN - 60 GB ----F4:37

WWPN:23890000873d9150 
WWPN:23890000873d9152


alicreate "DKDC2BKPTESTLPAR_HBA0","23:89:00:00:87:3d:91:52"
zonecreate "SK_VSP_CL1C_DKDC2BKPTESTLPAR_HBA0","SK_VSP_CL1C;DKDC2BKPTESTLPAR_HBA0"
cfgadd "FABRIC1","SK_VSP_CL1C_DKDC2BKPTESTLPAR_HBA0"

zonecreate "SK_VSP_CL1E_DKDC2BKPTESTLPAR_HBA0","SK_VSP_CL1E;DKDC2BKPTESTLPAR_HBA0"
cfgadd "FABRIC1","SK_VSP_CL1E_DKDC2BKPTESTLPAR_HBA0"

cfgsave
cfgenable "FABRIC1"
===============================================================


zonecreate "BAL_G600_CL3E_DKDC1TVGPDBCPH2_HBA0",""BAL_G600_CL3E;DKDC1TVGPDBCPH2_HBA0"
cfgadd "FABRIC1","BAL_G600_CL3E_DKDC1TVGPDBCPH2_HBA0"

zonecreate "BAL_G600_CL3G_DKDC1TVGPDBCPH2_HBA0",""BAL_G600_CL3G;DKDC1TVGPDBCPH2_HBA0"
cfgadd "FABRIC1","BAL_G600_CL3G_DKDC1TVGPDBCPH2_HBA0"


cfgsave
cfgenable "FABRIC1"



----------------------------------------------------------------------



fcs0 c050760775ac0150	SAN SW 1 -HBA0
fcs2 c050760775ac0154	SAN SW 2 -HBA1
fcs1 c050760775ac0152	SAN SW 1 -HBA2
fcs3 c050760775ac0156	SAN SW 2 -HBA3


dkdc1oratsta003_HBA0
DKDC1ORATSTA003_HBA0

zonecreate "BAL_G600_CL2E_dkdc1oratsta003_HBA0","BAL_G600_CL2E;dkdc1oratsta003_HBA0"
cfgadd "FABRIC1","BAL_G600_CL2E_dkdc1oratsta003_HBA0"

zonecreate "BAL_G600_CL2F_dkdc1oratsta003_HBA2","BAL_G600_CL2F;dkdc1oratsta003_HBA2"
cfgadd "FABRIC1","BAL_G600_CL2F_dkdc1oratsta003_HBA2"


cfgsave
cfgenable "FABRIC1"

-------------------------------------------------------------------------------

DKDC1BKPPRDW006_HBA0
23890000873f7942


alicreate "DKDC1BKPPRDW006_HBA0","23:89:00:00:87:3f:79:42"
zonecreate "BAL_VSP_CL1C_DKDC1BKPPRDW006_HBA0","BAL_VSP_CL1C;DKDC1BKPPRDW006_HBA0"
cfgadd "FABRIC1","BAL_VSP_CL1C_DKDC1BKPPRDW006_HBA0"

zonecreate "BAL_VSP_CL1E_DKDC1BKPPRDW006_HBA0","BAL_VSP_CL1E;DKDC1BKPPRDW006_HBA0"
cfgadd "FABRIC1","BAL_VSP_CL1E_DKDC1BKPPRDW006_HBA0"

cfgsave
cfgenable "FABRIC1"

zonecreate "BAL_HUS_Port_0D_DKDC1BKPPRDW006_HBA0","BAL_HUS_Port_0D;DKDC1BKPPRDW006_HBA0"
cfgadd "FABRIC1","BAL_HUS_Port_0D_DKDC1BKPPRDW006_HBA0"


Tape Library Zoning:-

Ballerup


zonecreate "BAL_TL_DRV1_HBA0_DKDC1BKPPRDW006_HBA0","BAL_TL_DRV1_HBA0;DKDC1BKPPRDW006_HBA0"
cfgadd "FABRIC1","BAL_TL_DRV1_HBA0_DKDC1BKPPRDW006_HBA0"

zonecreate "BAL_TL_DRV2_HBA0_DKDC1BKPPRDW006_HBA0","BAL_TL_DRV2_HBA0;DKDC1BKPPRDW006_HBA0"
cfgadd "FABRIC1","BAL_TL_DRV2_HBA0_DKDC1BKPPRDW006_HBA0"





---------------------------------------------------------------------------------------

alicreate "DKDC1ALKAPODB003_HBA0","c0:50:76:0b:04:c8:00:24"

zonecreate "BAL_G600_CL1E_DKDC1ALKAPODB003_HBA0","BAL_G600_CL1E;DKDC1ALKAPODB003_HBA0"
cfgadd "FABRIC1","BAL_G600_CL1E_DKDC1ALKAPODB003_HBA0"

alicreate "DKDC1ALKAPODB003_HBA2","c0:50:76:0b:04:c8:00:20"

zonecreate "BAL_G600_CL1F_DKDC1ALKAPODB003_HBA2","BAL_G600_CL1F;DKDC1ALKAPODB003_HBA2"
cfgadd "FABRIC1","BAL_G600_CL1F_DKDC1ALKAPODB003_HBA2"


cfgsave
cfgenable "FABRIC1"

-------------------------------------------------------------------------------------------


alicreate "DKDC1ALKAPODB005_HBA0","c0:50:76:0b:04:c8:00:2a"

zonecreate "BAL_G600_CL1E_DKDC1ALKAPODB005_HBA0","BAL_G600_CL1E;DKDC1ALKAPODB005_HBA0"
cfgadd "FABRIC1","BAL_G600_CL1E_DKDC1ALKAPODB005_HBA0"

zonecreate "SK_G600_CL1E_DKDC1ALKAPODB005_HBA0","SK_G600_CL1E;DKDC1ALKAPODB005_HBA0"
cfgadd "FABRIC1","SK_G600_CL1E_DKDC1ALKAPODB005_HBA0"

alicreate "DKDC1ALKAPODB005_HBA2","c0:50:76:0b:04:c8:00:2c"

zonecreate "BAL_G600_CL1F_DKDC1ALKAPODB005_HBA2","BAL_G600_CL1F;DKDC1ALKAPODB005_HBA2"
cfgadd "FABRIC1","BAL_G600_CL1F_DKDC1ALKAPODB005_HBA2"

zonecreate "SK_G600_CL1F_DKDC1ALKAPODB005_HBA2","SK_G600_CL1F;DKDC1ALKAPODB005_HBA2"
cfgadd "FABRIC1","SK_G600_CL1F_DKDC1ALKAPODB005_HBA2"


cfgsave
cfgenable "FABRIC1"

-----------------------------------------------------------------------------------------------

c050760b04c8003a
c050760b04c8003c



alicreate "DKDC1ALKASODB005_HBA0","c0:50:76:0b:04:c8:00:3a"

zonecreate "BAL_G600_CL1E_DKDC1ALKASODB005_HBA0","BAL_G600_CL1E;DKDC1ALKASODB005_HBA0"
cfgadd "FABRIC1","BAL_G600_CL1E_DKDC1ALKASODB005_HBA0"

alicreate "DKDC1ALKASODB005_HBA2","c0:50:76:0b:04:c8:00:3c"

zonecreate "BAL_G600_CL1F_DKDC1ALKASODB005_HBA2","BAL_G600_CL1F;DKDC1ALKASODB005_HBA2"
cfgadd "FABRIC1","BAL_G600_CL1F_DKDC1ALKASODB005_HBA2"


cfgsave
cfgenable "FABRIC1"

---------------------------------------------------------------------------------------------------------


c050760b04c2004a
c050760b04c20046



alicreate "DKDC2ALKASODB002_HBA0","c0:50:76:0b:04:c2:00:4a"

zonecreate "SK_G600_CL1E_DKDC2ALKASODB002_HBA0","SK_G600_CL1E;DKDC2ALKASODB002_HBA0"
cfgadd "FABRIC1","SK_G600_CL1E_DKDC2ALKASODB002_HBA0"

alicreate "DKDC2ALKASODB002_HBA2","c0:50:76:0b:04:c2:00:46"

zonecreate "SK_G600_CL1F_DKDC2ALKASODB002_HBA2","SK_G600_CL1F;DKDC2ALKASODB002_HBA2"
cfgadd "FABRIC1","SK_G600_CL1F_DKDC2ALKASODB002_HBA2"


cfgsave
cfgenable "FABRIC1"


------------------------------------------------------------------------------------------------


alicreate "DKDC2ALKAPODB002_HBA0","c0:50:76:0b:04:c2:00:4e"
zonecreate "SK_G600_CL1E_DKDC2ALKAPODB002_HBA0","SK_G600_CL1E;DKDC2ALKAPODB002_HBA0"
cfgadd "FABRIC1","SK_G600_CL1E_DKDC2ALKAPODB002_HBA0"

alicreate "DKDC2ALKAPODB002_HBA2","c0:50:76:0b:04:c2:00:54"
zonecreate "SK_G600_CL1F_DKDC2ALKAPODB002_HBA2","SK_G600_CL1F;DKDC2ALKAPODB002_HBA2"
cfgadd "FABRIC1","SK_G600_CL1F_DKDC2ALKAPODB002_HBA2"

cfgsave
cfgenable "FABRIC1"


c050760b04c2004e


------------------------------------------------------------------------------------------------
FABRIC 1 ---
alicreate "SK_STWZ_PORT11","50:05:07:68:0D:04:B8:5D"
alicreate "SK_STWZ_PORT12","50:05:07:68:0D:04:B8:5E"


zonecreate "SK_STWZ_PORT11_DKDC2ALKASODB002_HBA0","SK_STWZ_PORT11;DKDC2ALKASODB002_HBA0"
zonecreate "SK_STWZ_PORT12_DKDC2ALKASODB002_HBA2","SK_STWZ_PORT12;DKDC2ALKASODB002_HBA2"

zonecreate "SK_STWZ_PORT11_DKDC2ALKASODB002_HBA2","SK_STWZ_PORT11;DKDC2ALKASODB002_HBA2"
zonecreate "SK_STWZ_PORT12_DKDC2ALKASODB002_HBA0","SK_STWZ_PORT12;DKDC2ALKASODB002_HBA0"


cfgadd "FABRIC1","SK_STWZ_PORT11_DKDC2ALKASODB002_HBA0"
cfgadd "FABRIC1","SK_STWZ_PORT12_DKDC2ALKASODB002_HBA2"

cfgadd "FABRIC1","SK_STWZ_PORT11_DKDC2ALKASODB002_HBA2"
cfgadd "FABRIC1","SK_STWZ_PORT12_DKDC2ALKASODB002_HBA0"

cfgsave
cfgenable "FABRIC1"






---------------------------------------------------------------------------------------------------




zonecreate "SK_STWZ_PORT11_DKDC2ALKAPODB002_HBA0","SK_STWZ_PORT11;DKDC2ALKAPODB002_HBA0"
zonecreate "SK_STWZ_PORT12_DKDC2ALKAPODB002_HBA2","SK_STWZ_PORT12;DKDC2ALKAPODB002_HBA2"

zonecreate "SK_STWZ_PORT11_DKDC2ALKAPODB002_HBA2","SK_STWZ_PORT11;DKDC2ALKAPODB002_HBA2"
zonecreate "SK_STWZ_PORT12_DKDC2ALKAPODB002_HBA0","SK_STWZ_PORT12;DKDC2ALKAPODB002_HBA0"


cfgadd "FABRIC1","SK_STWZ_PORT11_DKDC2ALKAPODB002_HBA2"
cfgadd "FABRIC1","SK_STWZ_PORT12_DKDC2ALKAPODB002_HBA0"

cfgsave
cfgenable "FABRIC1"
-------------------------------------------------------------------------------------



------------------------------------------------------------------------------
c050760b04c80040
c050760b04c80044



alicreate "DKDC1ESBDMOA001NEW_HBA0","c0:50:76:0b:04:c8:00:40"
zonecreate "BAL_G600_CL1E_DKDC1ESBDMOA001NEW_HBA0","BAL_G600_CL1E;DKDC1ESBDMOA001NEW_HBA0"
cfgadd "FABRIC1","BAL_G600_CL1E_DKDC1ESBDMOA001NEW_HBA0"

alicreate "DKDC1ESBDMOA001NEW_HBA2","c0:50:76:0b:04:c8:00:44"
zonecreate "BAL_G600_CL1F_DKDC1ESBDMOA001NEW_HBA2","BAL_G600_CL1F;DKDC1ESBDMOA001NEW_HBA2"
cfgadd "FABRIC1","BAL_G600_CL1F_DKDC1ESBDMOA001NEW_HBA2"

cfgsave
cfgenable "FABRIC1"

----------------------------------------------------------------------------------------

c050760b04c20062
c050760b04c20060



alicreate "DKDC2ESBDEVA003NEW_HBA0","c0:50:76:0b:04:c2:00:62"
zonecreate "SK_G600_CL1E_DKDC2ESBDEVA003NEW_HBA0","SK_G600_CL1E;DKDC2ESBDEVA003NEW_HBA0"
cfgadd "FABRIC1","SK_G600_CL1E_DKDC2ESBDEVA003NEW_HBA0"

alicreate "DKDC2ESBDEVA003NEW_HBA2","c0:50:76:0b:04:c2:00:60"
zonecreate "SK_G600_CL1F_DKDC2ESBDEVA003NEW_HBA2","SK_G600_CL1F;DKDC2ESBDEVA003NEW_HBA2"
cfgadd "FABRIC1","SK_G600_CL1F_DKDC2ESBDEVA003NEW_HBA2"

cfgsave
cfgenable "FABRIC1"

----------------------------------------------------------------------------------------

c050760b04c80048
c050760b04c8004e


alicreate "DKDC1ESBPRDA003NEW_HBA0","c0:50:76:0b:04:c8:00:48"
zonecreate "BAL_G600_CL1E_DKDC1ESBPRDA003NEW_HBA0","BAL_G600_CL1E;DKDC1ESBPRDA003NEW_HBA0"
cfgadd "FABRIC1","BAL_G600_CL1E_DKDC1ESBPRDA003NEW_HBA0"



alicreate "DKDC1ESBPRDA003NEW_HBA2","c0:50:76:0b:04:c8:00:4e"
zonecreate "BAL_G600_CL1F_DKDC1ESBPRDA003NEW_HBA2","BAL_G600_CL1F;DKDC1ESBPRDA003NEW_HBA2"
cfgadd "FABRIC1","BAL_G600_CL1F_DKDC1ESBPRDA003NEW_HBA2"

zonecreate "SK_G600_CL1E_DKDC1ESBPRDA003NEW_HBA0","SK_G600_CL1E;DKDC1ESBPRDA003NEW_HBA0"
cfgadd "FABRIC1","SK_G600_CL1E_DKDC1ESBPRDA003NEW_HBA0"

zonecreate "SK_G600_CL1F_DKDC1ESBPRDA003NEW_HBA2","SK_G600_CL1F;DKDC1ESBPRDA003NEW_HBA2"
cfgadd "FABRIC1","SK_G600_CL1F_DKDC1ESBPRDA003NEW_HBA2"

cfgsave
cfgenable "FABRIC1"

-----------------------------------------------------------------------------------------------------

c050760b04c20066
c050760b04c2006a


alicreate "DKDC2ESBPRDA003NEW_HBA0","c0:50:76:0b:04:c2:00:66"
zonecreate "BAL_G600_CL1E_DKDC2ESBPRDA003NEW_HBA0","BAL_G600_CL1E;DKDC2ESBPRDA003NEW_HBA0"
cfgadd "FABRIC1","BAL_G600_CL1E_DKDC2ESBPRDA003NEW_HBA0"



alicreate "DKDC2ESBPRDA003NEW_HBA2","c0:50:76:0b:04:c2:00:6a"
zonecreate "BAL_G600_CL1F_DKDC2ESBPRDA003NEW_HBA2","BAL_G600_CL1F;DKDC2ESBPRDA003NEW_HBA2"
cfgadd "FABRIC1","BAL_G600_CL1F_DKDC2ESBPRDA003NEW_HBA2"

zonecreate "SK_G600_CL1E_DKDC2ESBPRDA003NEW_HBA0","SK_G600_CL1E;DKDC2ESBPRDA003NEW_HBA0"
cfgadd "FABRIC1","SK_G600_CL1E_DKDC2ESBPRDA003NEW_HBA0"

zonecreate "SK_G600_CL1F_DKDC2ESBPRDA003NEW_HBA2","SK_G600_CL1F;DKDC2ESBPRDA003NEW_HBA2"
cfgadd "FABRIC1","SK_G600_CL1F_DKDC2ESBPRDA003NEW_HBA2"

cfgsave
cfgenable "FABRIC1"

-----------------------------------------------------------------------------------------------------
c050760b04c80054
c050760b04c80052


TVGDBSCOPP02


alicreate "DKDC1TVGDBSCOPP02NEW_HBA0","c0:50:76:0b:04:c8:00:54"
zonecreate "BAL_G600_CL1E_DKDC1TVGDBSCOPP02NEW_HBA0","BAL_G600_CL1E;DKDC1TVGDBSCOPP02NEW_HBA0"
cfgadd "FABRIC1","BAL_G600_CL1E_DKDC1TVGDBSCOPP02NEW_HBA0"

alicreate "DKDC1TVGDBSCOPP02NEW_HBA2","c0:50:76:0b:04:c8:00:52"
zonecreate "BAL_G600_CL1F_DKDC1TVGDBSCOPP02NEW_HBA2","BAL_G600_CL1F;DKDC1TVGDBSCOPP02NEW_HBA2"
cfgadd "FABRIC1","BAL_G600_CL1F_DKDC1TVGDBSCOPP02NEW_HBA2"

cfgsave
cfgenable "FABRIC1"

----------------------------------------------------------------------------------------------------------

c050760b04c80058
c050760b04c8005e


TVGDBSCOPQ01

alicreate "DKDC1TVGDBSCOPQ01NEW_HBA0","c0:50:76:0b:04:c8:00:58"
zonecreate "BAL_G600_CL1E_DKDC1TVGDBSCOPQ01NEW_HBA0","BAL_G600_CL1E;DKDC1TVGDBSCOPQ01NEW_HBA0"
cfgadd "FABRIC1","BAL_G600_CL1E_DKDC1TVGDBSCOPQ01NEW_HBA0"

zonecreate "SK_G600_CL1E_DKDC1TVGDBSCOPQ01NEW_HBA0","SK_G600_CL1E;DKDC1TVGDBSCOPQ01NEW_HBA0"
cfgadd "FABRIC1","SK_G600_CL1E_DKDC1TVGDBSCOPQ01NEW_HBA0"

alicreate "DKDC1TVGDBSCOPQ01NEW_HBA2","c0:50:76:0b:04:c8:00:5e"
zonecreate "BAL_G600_CL1F_DKDC1TVGDBSCOPQ01NEW_HBA2","BAL_G600_CL1F;DKDC1TVGDBSCOPQ01NEW_HBA2"
cfgadd "FABRIC1","BAL_G600_CL1F_DKDC1TVGDBSCOPQ01NEW_HBA2"

zonecreate "SK_G600_CL1F_DKDC1TVGDBSCOPQ01NEW_HBA2","SK_G600_CL1F;DKDC1TVGDBSCOPQ01NEW_HBA2"
cfgadd "FABRIC1","SK_G600_CL1F_DKDC1TVGDBSCOPQ01NEW_HBA2"

cfgsave
cfgenable "FABRIC1"

----------------------------------------------------------------------------------------------------------
c050760b04c20080
c050760b04c2007a

DKDC2TVGDBSCOPP01


alicreate "DKDC2TVGDBSCOPP01NEW_HBA0","c0:50:76:0b:04:c2:00:80"
zonecreate "SK_G600_CL1E_DKDC2TVGDBSCOPP01NEW_HBA0","SK_G600_CL1E;DKDC2TVGDBSCOPP01NEW_HBA0"
cfgadd "FABRIC1","SK_G600_CL1E_DKDC2TVGDBSCOPP01NEW_HBA0"


zonecreate "BAL_G600_CL1E_DKDC2TVGDBSCOPP01NEW_HBA0","BAL_G600_CL1E;DKDC2TVGDBSCOPP01NEW_HBA0"
cfgadd "FABRIC1","BAL_G600_CL1E_DKDC2TVGDBSCOPP01NEW_HBA0"

alicreate "DKDC2TVGDBSCOPP01NEW_HBA2","c0:50:76:0b:04:c2:00:7a"
zonecreate "SK_G600_CL1F_DKDC2TVGDBSCOPP01NEW_HBA2","SK_G600_CL1F;DKDC2TVGDBSCOPP01NEW_HBA2"
cfgadd "FABRIC1","SK_G600_CL1F_DKDC2TVGDBSCOPP01NEW_HBA2"

zonecreate "BAL_G600_CL1F_DKDC2TVGDBSCOPP01NEW_HBA2","BAL_G600_CL1F;DKDC2TVGDBSCOPP01NEW_HBA2"
cfgadd "FABRIC1","BAL_G600_CL1F_DKDC2TVGDBSCOPP01NEW_HBA2"

cfgsave
cfgenable "FABRIC1"
---------------------------------------------------------------------------------------------------------------

c050760b04c80066
c050760b04c80062

DKDC1TRFSAPR3U01


alicreate "DKDC1TRFSAPR3U01NEW_HBA0","c0:50:76:0b:04:c8:00:66"
zonecreate "BAL_G600_CL1E_DKDC1TRFSAPR3U01NEW_HBA0","BAL_G600_CL1E;DKDC1TRFSAPR3U01NEW_HBA0"
cfgadd "FABRIC1","BAL_G600_CL1E_DKDC1TRFSAPR3U01NEW_HBA0"

alicreate "DKDC1TRFSAPR3U01NEW_HBA2","c0:50:76:0b:04:c8:00:62"
zonecreate "BAL_G600_CL1F_DKDC1TRFSAPR3U01NEW_HBA2","BAL_G600_CL1F;DKDC1TRFSAPR3U01NEW_HBA2"
cfgadd "FABRIC1","BAL_G600_CL1F_DKDC1TRFSAPR3U01NEW_HBA2"

cfgsave
cfgenable "FABRIC1"
------------------------------------------------------------------------------------------------------------------
c050760b04c20082
c050760b04c20088

DKDC2SAPTSTA001

alicreate "DKDC2SAPTSTA001NEW_HBA0","c0:50:76:0b:04:c2:00:82"
zonecreate "SK_G600_CL1E_DKDC2SAPTSTA001NEW_HBA0","SK_G600_CL1E;DKDC2SAPTSTA001NEW_HBA0"
cfgadd "FABRIC1","SK_G600_CL1E_DKDC2SAPTSTA001NEW_HBA0"

alicreate "DKDC2SAPTSTA001NEW_HBA2","c0:50:76:0b:04:c2:00:88"
zonecreate "SK_G600_CL1F_DKDC2SAPTSTA001NEW_HBA2","SK_G600_CL1F;DKDC2SAPTSTA001NEW_HBA2"
cfgadd "FABRIC1","SK_G600_CL1F_DKDC2SAPTSTA001NEW_HBA2"

cfgsave
cfgenable "FABRIC1"
---------------------------------------------------------------------------------------------------------------
c050760b04c80068
c050760b04c8006e


DKDC1TRFSAPR3T01

alicreate "DKDC1TRFSAPR3T01NEW_HBA0","c0:50:76:0b:04:c8:00:68"
zonecreate "BAL_G600_CL1E_DKDC1TRFSAPR3T01NEW_HBA0","BAL_G600_CL1E;DKDC1TRFSAPR3T01NEW_HBA0"
cfgadd "FABRIC1","BAL_G600_CL1E_DKDC1TRFSAPR3T01NEW_HBA0"

alicreate "DKDC1TRFSAPR3T01NEW_HBA2","c0:50:76:0b:04:c8:00:6e"
zonecreate "BAL_G600_CL1F_DKDC1TRFSAPR3T01NEW_HBA2","BAL_G600_CL1F;DKDC1TRFSAPR3T01NEW_HBA2"
cfgadd "FABRIC1","BAL_G600_CL1F_DKDC1TRFSAPR3T01NEW_HBA2"

cfgsave
cfgenable "FABRIC1"
--------------------------------------------------------------------------------------------

c050760b04c20096
c050760b04c20094

DKDC2TRFR3TR2

alicreate "DKDC2TRFR3TR2NEW_HBA0","c0:50:76:0b:04:c2:00:96"
zonecreate "SK_G600_CL1E_DKDC2TRFR3TR2NEW_HBA0","SK_G600_CL1E;DKDC2TRFR3TR2NEW_HBA0"
cfgadd "FABRIC1","SK_G600_CL1E_DKDC2TRFR3TR2NEW_HBA0"

alicreate "DKDC2TRFR3TR2NEW_HBA2","c0:50:76:0b:04:c2:00:94"
zonecreate "SK_G600_CL1F_DKDC2TRFR3TR2NEW_HBA2","SK_G600_CL1F;DKDC2TRFR3TR2NEW_HBA2"
cfgadd "FABRIC1","SK_G600_CL1F_DKDC2TRFR3TR2NEW_HBA2"

cfgsave
cfgenable "FABRIC1"
--------------------------------------------------------------------------------------------------
c050760b04c2009e
c050760b04c2009c

DKDC2TRFSAPR3P01

alicreate "DKDC2TRFSAPR3P01NEW_HBA0","c0:50:76:0b:04:c2:00:9e"
zonecreate "SK_G600_CL1E_DKDC2TRFSAPR3P01NEW_HBA0","SK_G600_CL1E;DKDC2TRFSAPR3P01NEW_HBA0"
cfgadd "FABRIC1","SK_G600_CL1E_DKDC2TRFSAPR3P01NEW_HBA0"

zonecreate "BAL_G600_CL1E_DKDC2TRFSAPR3P01NEW_HBA0","BAL_G600_CL1E;DKDC2TRFSAPR3P01NEW_HBA0"
cfgadd "FABRIC1","BAL_G600_CL1E_DKDC2TRFSAPR3P01NEW_HBA0"

alicreate "DKDC2TRFSAPR3P01NEW_HBA2","c0:50:76:0b:04:c2:00:9c"
zonecreate "SK_G600_CL1F_DKDC2TRFSAPR3P01NEW_HBA2","SK_G600_CL1F;DKDC2TRFSAPR3P01NEW_HBA2"
cfgadd "FABRIC1","SK_G600_CL1F_DKDC2TRFSAPR3P01NEW_HBA2"

zonecreate "BAL_G600_CL1F_DKDC2TRFSAPR3P01NEW_HBA2","BAL_G600_CL1F;DKDC2TRFSAPR3P01NEW_HBA2"
cfgadd "FABRIC1","BAL_G600_CL1F_DKDC2TRFSAPR3P01NEW_HBA2"

cfgsave
cfgenable "FABRIC1"

------------------------------------------------------------------------------------------------------

c050760b04c200ac
c050760b04c200ae

TRFDKNSDCOP01

alicreate "DKDC2TRFDKNSDCOP01NEW_HBA0","c0:50:76:0b:04:c2:00:ac"
zonecreate "SK_G600_CL1E_DKDC2TRFDKNSDCOP01NEW_HBA0","SK_G600_CL1E;DKDC2TRFDKNSDCOP01NEW_HBA0"
cfgadd "FABRIC1","SK_G600_CL1E_DKDC2TRFDKNSDCOP01NEW_HBA0"

alicreate "DKDC2TRFDKNSDCOP01NEW_HBA2","c0:50:76:0b:04:c2:00:ae"
zonecreate "SK_G600_CL1F_DKDC2TRFDKNSDCOP01NEW_HBA2","SK_G600_CL1F;DKDC2TRFDKNSDCOP01NEW_HBA2"
cfgadd "FABRIC1","SK_G600_CL1F_DKDC2TRFDKNSDCOP01NEW_HBA2"

cfgsave
cfgenable "FABRIC1"

-----------------------------------------------------------------------------------------------------
c050760b04c200ba
c050760b04c200c2

DKDC2TRFPKNSDCOP02

alicreate "DKDC2TRFPKNSDCOP02NEW_HBA0","c0:50:76:0b:04:c2:00:ba"
zonecreate "SK_G600_CL1E_DKDC2TRFPKNSDCOP02NEW_HBA0","SK_G600_CL1E;DKDC2TRFPKNSDCOP02NEW_HBA0"
cfgadd "FABRIC1","SK_G600_CL1E_DKDC2TRFPKNSDCOP02NEW_HBA0"

zonecreate "BAL_G600_CL1E_DKDC2TRFPKNSDCOP02NEW_HBA0","BAL_G600_CL1E;DKDC2TRFPKNSDCOP02NEW_HBA0"
cfgadd "FABRIC1","BAL_G600_CL1E_DKDC2TRFPKNSDCOP02NEW_HBA0"

alicreate "DKDC2TRFPKNSDCOP02NEW_HBA2","c0:50:76:0b:04:c2:00:c2"
zonecreate "SK_G600_CL1F_DKDC2TRFPKNSDCOP02NEW_HBA2","SK_G600_CL1F;DKDC2TRFPKNSDCOP02NEW_HBA2"
cfgadd "FABRIC1","SK_G600_CL1F_DKDC2TRFPKNSDCOP02NEW_HBA2"

zonecreate "BAL_G600_CL1F_DKDC2TRFPKNSDCOP02NEW_HBA2","BAL_G600_CL1F;DKDC2TRFPKNSDCOP02NEW_HBA2"
cfgadd "FABRIC1","BAL_G600_CL1F_DKDC2TRFPKNSDCOP02NEW_HBA2"

cfgsave
cfgenable "FABRIC1"
----------------------------------------------------------------------------------------
c050760b04c80096
c050760b04c80090

DKDC1TRFPKNSDCOP02

alicreate "DKDC1TRFPKNSDCOP01NEW_HBA0","c0:50:76:0b:04:c8:00:96"
zonecreate "SK_G600_CL1E_DKDC1TRFPKNSDCOP01NEW_HBA0","SK_G600_CL1E;DKDC1TRFPKNSDCOP01NEW_HBA0"
cfgadd "FABRIC1","SK_G600_CL1E_DKDC1TRFPKNSDCOP01NEW_HBA0"

zonecreate "BAL_G600_CL1E_DKDC1TRFPKNSDCOP01NEW_HBA0","BAL_G600_CL1E;DKDC1TRFPKNSDCOP01NEW_HBA0"
cfgadd "FABRIC1","BAL_G600_CL1E_DKDC1TRFPKNSDCOP01NEW_HBA0"

alicreate "DKDC1TRFPKNSDCOP01NEW_HBA2","c0:50:76:0b:04:c8:00:90"
zonecreate "SK_G600_CL1F_DKDC1TRFPKNSDCOP01NEW_HBA2","SK_G600_CL1F;DKDC1TRFPKNSDCOP01NEW_HBA2"
cfgadd "FABRIC1","SK_G600_CL1F_DKDC1TRFPKNSDCOP01NEW_HBA2"

zonecreate "BAL_G600_CL1F_DKDC1TRFPKNSDCOP01NEW_HBA2","BAL_G600_CL1F;DKDC1TRFPKNSDCOP01NEW_HBA2"
cfgadd "FABRIC1","BAL_G600_CL1F_DKDC1TRFPKNSDCOP01NEW_HBA2"

cfgsave
cfgenable "FABRIC1"
--------------------------------------------------------------------------------------------------
c050760b04c20018
c050760b04c20014

DKDC2ALKAAIX003

alicreate "DKDC2ALKAAIX003NEW_HBA0","c0:50:76:0b:04:c2:00:18"
zonecreate "SK_STWZ_PORT11_DKDC2ALKAAIX003NEW_HBA0","SK_STWZ_PORT11;DKDC2ALKAAIX003NEW_HBA0"
cfgadd "FABRIC1","SK_STWZ_PORT11_DKDC2ALKAAIX003NEW_HBA0"

zonecreate "SK_STWZ_PORT12_DKDC2ALKAAIX003NEW_HBA0","SK_STWZ_PORT12;DKDC2ALKAAIX003NEW_HBA0"
cfgadd "FABRIC1","SK_STWZ_PORT12_DKDC2ALKAAIX003NEW_HBA0"

zonecreate "SK_G600_CL1E_DKDC2ALKAAIX003NEW_HBA0","SK_G600_CL1E;DKDC2ALKAAIX003NEW_HBA0"
cfgadd "FABRIC1","SK_G600_CL1E_DKDC2ALKAAIX003NEW_HBA0"


alicreate "DKDC2ALKAAIX003NEW_HBA2","c0:50:76:0b:04:c2:00:14"
zonecreate "SK_STWZ_PORT12_DKDC2ALKAAIX003NEW_HBA2","SK_STWZ_PORT12;DKDC2ALKAAIX003NEW_HBA2"
cfgadd "FABRIC1","SK_STWZ_PORT12_DKDC2ALKAAIX003NEW_HBA2"

zonecreate "SK_STWZ_PORT11_DKDC2ALKAAIX003NEW_HBA2","SK_STWZ_PORT11;DKDC2ALKAAIX003NEW_HBA2"
cfgadd "FABRIC1","SK_STWZ_PORT11_DKDC2ALKAAIX003NEW_HBA2"

zonecreate "SK_G600_CL1F_DKDC2ALKAAIX003NEW_HBA2","SK_G600_CL1F;DKDC2ALKAAIX003NEW_HBA2"
cfgadd "FABRIC1","SK_G600_CL1F_DKDC2ALKAAIX003NEW_HBA2"

cfgsave
cfgenable "FABRIC1"
------------------------------------------------------------------------------------------------------
c050760b04c8009e
c050760b04c80098


DKDC1TRFTSBLDCOP01

alicreate "DKDC1TRFTSBLDCOP01NEW_HBA0","c0:50:76:0b:04:c8:00:9e"
zonecreate "BAL_G600_CL1E_DKDC1TRFTSBLDCOP01NEW_HBA0","BAL_G600_CL1E;DKDC1TRFTSBLDCOP01NEW_HBA0"
cfgadd "FABRIC1","BAL_G600_CL1E_DKDC1TRFTSBLDCOP01NEW_HBA0"

alicreate "DKDC1TRFTSBLDCOP01NEW_HBA2","c0:50:76:0b:04:c8:00:98"
zonecreate "BAL_G600_CL1F_DKDC1TRFTSBLDCOP01NEW_HBA2","BAL_G600_CL1F;DKDC1TRFTSBLDCOP01NEW_HBA2"
cfgadd "FABRIC1","BAL_G600_CL1F_DKDC1TRFTSBLDCOP01NEW_HBA2"

cfgsave
cfgenable "FABRIC1"

---------------------------------------------------------------------------------------------------------------------
c050760b04c200ca
c050760b04c200c6

DKDC2TRFSAPBWP01

alicreate "DKDC2TRFSAPBWP01NEW_HBA0","c0:50:76:0b:04:c2:00:ca"
zonecreate "SK_G600_CL1E_DKDC2TRFSAPBWP01NEW_HBA0","SK_G600_CL1E;DKDC2TRFSAPBWP01NEW_HBA0"
cfgadd "FABRIC1","SK_G600_CL1E_DKDC2TRFSAPBWP01NEW_HBA0"

zonecreate "BAL_G600_CL1E_DKDC2TRFSAPBWP01NEW_HBA0","BAL_G600_CL1E;DKDC2TRFSAPBWP01NEW_HBA0"
cfgadd "FABRIC1","BAL_G600_CL1E_DKDC2TRFSAPBWP01NEW_HBA0"

alicreate "DKDC2TRFSAPBWP01NEW_HBA2","c0:50:76:0b:04:c2:00:c6"
zonecreate "SK_G600_CL1F_DKDC2TRFSAPBWP01NEW_HBA2","SK_G600_CL1F;DKDC2TRFSAPBWP01NEW_HBA2"
cfgadd "FABRIC1","SK_G600_CL1F_DKDC2TRFSAPBWP01NEW_HBA2"

zonecreate "BAL_G600_CL1F_DKDC2TRFSAPBWP01NEW_HBA2","BAL_G600_CL1F;DKDC2TRFSAPBWP01NEW_HBA2"
cfgadd "FABRIC1","BAL_G600_CL1F_DKDC2TRFSAPBWP01NEW_HBA2"

cfgsave
cfgenable "FABRIC1"
-------------------------------------------------------------------------------------------------------------
c050760b04c800a6
c050760b04c800a0


DKDC1TRFSAPBWQ01

alicreate "DKDC1TRFSAPBWQ01NEW_HBA0","c0:50:76:0b:04:c8:00:a6"
zonecreate "SK_G600_CL1E_DKDC1TRFSAPBWQ01NEW_HBA0","SK_G600_CL1E;DKDC1TRFSAPBWQ01NEW_HBA0"
cfgadd "FABRIC1","SK_G600_CL1E_DKDC1TRFSAPBWQ01NEW_HBA0"

zonecreate "BAL_G600_CL1E_DKDC1TRFSAPBWQ01NEW_HBA0","BAL_G600_CL1E;DKDC1TRFSAPBWQ01NEW_HBA0"
cfgadd "FABRIC1","BAL_G600_CL1E_DKDC1TRFSAPBWQ01NEW_HBA0"

alicreate "DKDC1TRFSAPBWQ01NEW_HBA2","c0:50:76:0b:04:c8:00:a0"
zonecreate "SK_G600_CL1F_DKDC1TRFSAPBWQ01NEW_HBA2","SK_G600_CL1F;DKDC1TRFSAPBWQ01NEW_HBA2"
cfgadd "FABRIC1","SK_G600_CL1F_DKDC1TRFSAPBWQ01NEW_HBA2"

zonecreate "BAL_G600_CL1F_DKDC1TRFSAPBWQ01NEW_HBA2","BAL_G600_CL1F;DKDC1TRFSAPBWQ01NEW_HBA2"
cfgadd "FABRIC1","BAL_G600_CL1F_DKDC1TRFSAPBWQ01NEW_HBA2"

cfgsave
cfgenable "FABRIC1"

-------------------------------------------------------------------------------------------------------------


c050760b04c200d0
c050760b04c200d4

DKDC2TVGDLOKDB1

alicreate "DKDC2TVGDLOKDB1NEW_HBA0","c0:50:76:0b:04:c2:00:d0"
zonecreate "SK_G600_CL1E_DKDC2TVGDLOKDB1NEW_HBA0","SK_G600_CL1E;DKDC2TVGDLOKDB1NEW_HBA0"
cfgadd "FABRIC1","SK_G600_CL1E_DKDC2TVGDLOKDB1NEW_HBA0"

alicreate "DKDC2TVGDLOKDB1NEW_HBA2","c0:50:76:0b:04:c2:00:d4"
zonecreate "SK_G600_CL1F_DKDC2TVGDLOKDB1NEW_HBA2","SK_G600_CL1F;DKDC2TVGDLOKDB1NEW_HBA2"
cfgadd "FABRIC1","SK_G600_CL1F_DKDC2TVGDLOKDB1NEW_HBA2"

cfgsave
cfgenable "FABRIC1"

----------------------------------------------------------------------------------------------------------------

c050760b04c800b2
c050760b04c800b6


DKDC1ORATSTA003

alicreate "DKDC1ORATSTA003NEW_HBA0","c0:50:76:0b:04:c8:00:b2"
zonecreate "BAL_G600_CL1E_DKDC1ORATSTA003NEW_HBA0","BAL_G600_CL1E;DKDC1ORATSTA003NEW_HBA0"
cfgadd "FABRIC1","BAL_G600_CL1E_DKDC1ORATSTA003NEW_HBA0"

alicreate "DKDC1ORATSTA003NEW_HBA2","c0:50:76:0b:04:c8:00:b6"
zonecreate "BAL_G600_CL1F_DKDC1ORATSTA003NEW_HBA2","BAL_G600_CL1F;DKDC1ORATSTA003NEW_HBA2"
cfgadd "FABRIC1","BAL_G600_CL1F_DKDC1ORATSTA003NEW_HBA2"


zonecreate "BAL_VSP_CL3C_DKDC1ORATSTA003NEW_HBA0","BAL_VSP_CL3C;DKDC1ORATSTA003NEW_HBA0"
cfgadd "FABRIC1","BAL_VSP_CL3C_DKDC1ORATSTA003NEW_HBA0"


zonecreate "BAL_VSP_CL3E_DKDC1ORATSTA003NEW_HBA2","BAL_VSP_CL3E;DKDC1ORATSTA003NEW_HBA2"
cfgadd "FABRIC1","BAL_VSP_CL3E_DKDC1ORATSTA003NEW_HBA2"


cfgsave
cfgenable "FABRIC1"
--------------------------------------------------------------------------------------------------------


c050760b04c800ac
c050760b04c800a8


DKDC1TRFTODBAIXVR1

alicreate "DKDC1TRFTODBAIXVR1NEW_HBA0","c0:50:76:0b:04:c8:00:ac"
zonecreate "BAL_G600_CL1E_DKDC1TRFTODBAIXVR1NEW_HBA0","BAL_G600_CL1E;DKDC1TRFTODBAIXVR1NEW_HBA0"
cfgadd "FABRIC1","BAL_G600_CL1E_DKDC1TRFTODBAIXVR1NEW_HBA0"

alicreate "DKDC1TRFTODBAIXVR1NEW_HBA2","c0:50:76:0b:04:c8:00:a8"
zonecreate "BAL_G600_CL1F_DKDC1TRFTODBAIXVR1NEW_HBA2","BAL_G600_CL1F;DKDC1TRFTODBAIXVR1NEW_HBA2"
cfgadd "FABRIC1","BAL_G600_CL1F_DKDC1TRFTODBAIXVR1NEW_HBA2"

zonecreate "BAL_VSP_CL3C_DKDC1TRFTODBAIXVR1NEW_HBA0","BAL_VSP_CL3C;DKDC1TRFTODBAIXVR1NEW_HBA0"
cfgadd "FABRIC1","BAL_VSP_CL3C_DKDC1TRFTODBAIXVR1NEW_HBA0"


zonecreate "BAL_VSP_CL3E_DKDC1TRFTODBAIXVR1NEW_HBA2","BAL_VSP_CL3E;DKDC1TRFTODBAIXVR1NEW_HBA2"
cfgadd "FABRIC1","BAL_VSP_CL3E_DKDC1TRFTODBAIXVR1NEW_HBA2"

cfgsave
cfgenable "FABRIC1"

-----------------------------------------------------------------------------------------------------------

c050760b04c800d0
c050760b04c800d4


DKDC1TRFDTNSDCOP01

alicreate "DKDC1TRFDTNSDCOP01NEW_HBA0","c0:50:76:0b:04:c8:00:d0"
zonecreate "BAL_G600_CL1E_DKDC1TRFDTNSDCOP01NEW_HBA0","BAL_G600_CL1E;DKDC1TRFDTNSDCOP01NEW_HBA0"
cfgadd "FABRIC1","BAL_G600_CL1E_DKDC1TRFDTNSDCOP01NEW_HBA0"

alicreate "DKDC1TRFDTNSDCOP01NEW_HBA2","c0:50:76:0b:04:c8:00:d4"
zonecreate "BAL_G600_CL1F_DKDC1TRFDTNSDCOP01NEW_HBA2","BAL_G600_CL1F;DKDC1TRFDTNSDCOP01NEW_HBA2"
cfgadd "FABRIC1","BAL_G600_CL1F_DKDC1TRFDTNSDCOP01NEW_HBA2"

cfgsave
cfgenable "FABRIC1"
-----------------------------------------------------------------------------------------------------------
c050760b04c800d8
c050760b04c800de

DKDC1TRFPTNSDCOP02

alicreate "DKDC1TRFPTNSDCOP02NEW_HBA0","c0:50:76:0b:04:c8:00:d8"
zonecreate "SK_G600_CL1E_DKDC1TRFPTNSDCOP02NEW_HBA0","SK_G600_CL1E;DKDC1TRFPTNSDCOP02NEW_HBA0"
cfgadd "FABRIC1","SK_G600_CL1E_DKDC1TRFPTNSDCOP02NEW_HBA0"

zonecreate "BAL_G600_CL1E_DKDC1TRFPTNSDCOP02NEW_HBA0","BAL_G600_CL1E;DKDC1TRFPTNSDCOP02NEW_HBA0"
cfgadd "FABRIC1","BAL_G600_CL1E_DKDC1TRFPTNSDCOP02NEW_HBA0"

alicreate "DKDC1TRFPTNSDCOP02NEW_HBA2","c0:50:76:0b:04:c8:00:de"
zonecreate "SK_G600_CL1F_DKDC1TRFPTNSDCOP02NEW_HBA2","SK_G600_CL1F;DKDC1TRFPTNSDCOP02NEW_HBA2"
cfgadd "FABRIC1","SK_G600_CL1F_DKDC1TRFPTNSDCOP02NEW_HBA2"

zonecreate "BAL_G600_CL1F_DKDC1TRFPTNSDCOP02NEW_HBA2","BAL_G600_CL1F;DKDC1TRFPTNSDCOP02NEW_HBA2"
cfgadd "FABRIC1","BAL_G600_CL1F_DKDC1TRFPTNSDCOP02NEW_HBA2"

cfgsave
cfgenable "FABRIC1"
------------------------------------------------------------------------------------------------------------------
c050760b04c200e8
c050760b04c200ea

DKDC2TRFPTNSDCOP01

alicreate "DKDC2TRFPTNSDCOP01NEW_HBA0","c0:50:76:0b:04:c2:00:e8"
zonecreate "SK_G600_CL1E_DKDC2TRFPTNSDCOP01NEW_HBA0","SK_G600_CL1E;DKDC2TRFPTNSDCOP01NEW_HBA0"
cfgadd "FABRIC1","SK_G600_CL1E_DKDC2TRFPTNSDCOP01NEW_HBA0"

zonecreate "BAL_G600_CL1E_DKDC2TRFPTNSDCOP01NEW_HBA0","BAL_G600_CL1E;DKDC2TRFPTNSDCOP01NEW_HBA0"
cfgadd "FABRIC1","BAL_G600_CL1E_DKDC2TRFPTNSDCOP01NEW_HBA0"

alicreate "DKDC2TRFPTNSDCOP01NEW_HBA2","c0:50:76:0b:04:c2:00:ea"
zonecreate "SK_G600_CL1F_DKDC2TRFPTNSDCOP01NEW_HBA2","SK_G600_CL1F;DKDC2TRFPTNSDCOP01NEW_HBA2"
cfgadd "FABRIC1","SK_G600_CL1F_DKDC2TRFPTNSDCOP01NEW_HBA2"

zonecreate "BAL_G600_CL1F_DKDC2TRFPTNSDCOP01NEW_HBA2","BAL_G600_CL1F;DKDC2TRFPTNSDCOP01NEW_HBA2"
cfgadd "FABRIC1","BAL_G600_CL1F_DKDC2TRFPTNSDCOP01NEW_HBA2"

cfgsave
cfgenable "FABRIC1"
------------------------------------------------------------------------------------------------------------------------
c050760b04c800e0
c050760b04c800e4


DKDC1BPMDMOA001

alicreate "DKDC1BPMDMOA001NEW_HBA0","c0:50:76:0b:04:c8:00:e0"
zonecreate "BAL_G600_CL1E_DKDC1BPMDMOA001NEW_HBA0","BAL_G600_CL1E;DKDC1BPMDMOA001NEW_HBA0"
cfgadd "FABRIC1","BAL_G600_CL1E_DKDC1BPMDMOA001NEW_HBA0"

zonecreate "SK_G600_CL1E_DKDC1BPMDMOA001NEW_HBA0","SK_G600_CL1E;DKDC1BPMDMOA001NEW_HBA0"
cfgadd "FABRIC1","SK_G600_CL1E_DKDC1BPMDMOA001NEW_HBA0"

alicreate "DKDC1BPMDMOA001NEW_HBA2","c0:50:76:0b:04:c8:00:e4"
zonecreate "BAL_G600_CL1F_DKDC1BPMDMOA001NEW_HBA2","BAL_G600_CL1F;DKDC1BPMDMOA001NEW_HBA2"
cfgadd "FABRIC1","BAL_G600_CL1F_DKDC1BPMDMOA001NEW_HBA2"

zonecreate "SK_G600_CL1F_DKDC1BPMDMOA001NEW_HBA2","SK_G600_CL1F;DKDC1BPMDMOA001NEW_HBA2"
cfgadd "FABRIC1","SK_G600_CL1F_DKDC1BPMDMOA001NEW_HBA2"

cfgsave
cfgenable "FABRIC1"

----------------------------------------------------------------------------------------------------------------------------

c050760b04c200f2
c050760b04c200f0


DKDC2ORATSTA001

alicreate "DKDC2ORATSTA001NEW_HBA0","c0:50:76:0b:04:c2:00:f2"
zonecreate "SK_G600_CL1E_DKDC2ORATSTA001NEW_HBA0","SK_G600_CL1E;DKDC2ORATSTA001NEW_HBA0"
cfgadd "FABRIC1","SK_G600_CL1E_DKDC2ORATSTA001NEW_HBA0"

alicreate "DKDC2ORATSTA001NEW_HBA2","c0:50:76:0b:04:c2:00:f0"
zonecreate "SK_G600_CL1F_DKDC2ORATSTA001NEW_HBA2","SK_G600_CL1F;DKDC2ORATSTA001NEW_HBA2"
cfgadd "FABRIC1","SK_G600_CL1F_DKDC2ORATSTA001NEW_HBA2"

zonecreate "SK_VSP_CL3C_DKDC2ORATSTA001NEW_HBA0","SK_VSP_CL3C;DKDC2ORATSTA001NEW_HBA0"
cfgadd "FABRIC1","SK_VSP_CL3C_DKDC2ORATSTA001NEW_HBA0"


zonecreate "SK_VSP_CL3E_DKDC2ORATSTA001NEW_HBA2","SK_VSP_CL3E;DKDC2ORATSTA001NEW_HBA2"
cfgadd "FABRIC1","SK_VSP_CL3E_DKDC2ORATSTA001NEW_HBA2"

cfgsave
cfgenable "FABRIC1"

-----------------------------------------------------------------------------------------------------------------------------

c050760b04c200fe
c050760b04c20102

DKDC2BPMTSTA001

alicreate "DKDC2BPMTSTA001NEW_HBA0","c0:50:76:0b:04:c2:00:fe"
zonecreate "SK_G600_CL1E_DKDC2BPMTSTA001NEW_HBA0","SK_G600_CL1E;DKDC2BPMTSTA001NEW_HBA0"
cfgadd "FABRIC1","SK_G600_CL1E_DKDC2BPMTSTA001NEW_HBA0"

alicreate "DKDC2BPMTSTA001NEW_HBA2","c0:50:76:0b:04:c2:01:02"
zonecreate "SK_G600_CL1F_DKDC2BPMTSTA001NEW_HBA2","SK_G600_CL1F;DKDC2BPMTSTA001NEW_HBA2"
cfgadd "FABRIC1","SK_G600_CL1F_DKDC2BPMTSTA001NEW_HBA2"

cfgsave
cfgenable "FABRIC1"

-------------------------------------------------------------------------------------------------------------------------
c050760b04c2010c
c050760b04c20108


DKDC2BPMPRDA001

alicreate "DKDC2BPMPRDA001NEW_HBA0","c0:50:76:0b:04:c2:01:0c"
zonecreate "BAL_G600_CL1E_DKDC2BPMPRDA001NEW_HBA0","BAL_G600_CL1E;DKDC2BPMPRDA001NEW_HBA0"
cfgadd "FABRIC1","BAL_G600_CL1E_DKDC2BPMPRDA001NEW_HBA0"

zonecreate "SK_G600_CL1E_DKDC2BPMPRDA001NEW_HBA0","SK_G600_CL1E;DKDC2BPMPRDA001NEW_HBA0"
cfgadd "FABRIC1","SK_G600_CL1E_DKDC2BPMPRDA001NEW_HBA0"

alicreate "DKDC2BPMPRDA001NEW_HBA2","c0:50:76:0b:04:c2:01:08"
zonecreate "BAL_G600_CL1F_DKDC2BPMPRDA001NEW_HBA2","BAL_G600_CL1F;DKDC2BPMPRDA001NEW_HBA2"
cfgadd "FABRIC1","BAL_G600_CL1F_DKDC2BPMPRDA001NEW_HBA2"

zonecreate "SK_G600_CL1F_DKDC2BPMPRDA001NEW_HBA2","SK_G600_CL1F;DKDC2BPMPRDA001NEW_HBA2"
cfgadd "FABRIC1","SK_G600_CL1F_DKDC2BPMPRDA001NEW_HBA2"

cfgsave
cfgenable "FABRIC1"

-----------------------------------------------------------------------------------------------------------------------

c050760b04c20118
c050760b04c2011c

DKDC2TRFSAPDEV04

alicreate "DKDC2TRFSAPDEV04NEW_HBA0","c0:50:76:0b:04:c2:01:18"
zonecreate "SK_G600_CL1E_DKDC2TRFSAPDEV04NEW_HBA0","SK_G600_CL1E;DKDC2TRFSAPDEV04NEW_HBA0"
cfgadd "FABRIC1","SK_G600_CL1E_DKDC2TRFSAPDEV04NEW_HBA0"

alicreate "DKDC2TRFSAPDEV04NEW_HBA2","c0:50:76:0b:04:c2:01:1c"
zonecreate "SK_G600_CL1F_DKDC2TRFSAPDEV04NEW_HBA2","SK_G600_CL1F;DKDC2TRFSAPDEV04NEW_HBA2"
cfgadd "FABRIC1","SK_G600_CL1F_DKDC2TRFSAPDEV04NEW_HBA2"

cfgsave
cfgenable "FABRIC1"

------------------------------------------------------------------------------------------------------------------------
c050760b04c20124
c050760b04c2011e

DKDC2TRFSAPXIQ02

alicreate "DKDC2TRFSAPXIQ02NEW_HBA0","c0:50:76:0b:04:c2:01:24"
zonecreate "SK_G600_CL1E_DKDC2TRFSAPXIQ02NEW_HBA0","SK_G600_CL1E;DKDC2TRFSAPXIQ02NEW_HBA0"
cfgadd "FABRIC1","SK_G600_CL1E_DKDC2TRFSAPXIQ02NEW_HBA0"

alicreate "DKDC2TRFSAPXIQ02NEW_HBA2","c0:50:76:0b:04:c2:01:1e"
zonecreate "SK_G600_CL1F_DKDC2TRFSAPXIQ02NEW_HBA2","SK_G600_CL1F;DKDC2TRFSAPXIQ02NEW_HBA2"
cfgadd "FABRIC1","SK_G600_CL1F_DKDC2TRFSAPXIQ02NEW_HBA2"

cfgsave
cfgenable "FABRIC1"

-----------------------------------------------------------------------------------------------------------------
c050760b04c800fa
c050760b04c800fe


DKDC1TRFSAPDEV03

alicreate "DKDC1TRFSAPDEV03NEW_HBA0","c0:50:76:0b:04:c8:00:fa"
zonecreate "BAL_G600_CL1E_DKDC1TRFSAPDEV03NEW_HBA0","BAL_G600_CL1E;DKDC1TRFSAPDEV03NEW_HBA0"
cfgadd "FABRIC1","BAL_G600_CL1E_DKDC1TRFSAPDEV03NEW_HBA0"

alicreate "DKDC1TRFSAPDEV03NEW_HBA2","c0:50:76:0b:04:c8:00:fe"
zonecreate "BAL_G600_CL1F_DKDC1TRFSAPDEV03NEW_HBA2","BAL_G600_CL1F;DKDC1TRFSAPDEV03NEW_HBA2"
cfgadd "FABRIC1","BAL_G600_CL1F_DKDC1TRFSAPDEV03NEW_HBA2"

cfgsave
cfgenable "FABRIC1"

-----------------------------------------------------------------------------------------------------------

c050760b04c80108
c050760b04c80106


DKDC1TRFSAPXIQ01

alicreate "DKDC1TRFSAPXIQ01NEW_HBA0","c0:50:76:0b:04:c8:01:08"
zonecreate "BAL_G600_CL1E_DKDC1TRFSAPXIQ01NEW_HBA0","BAL_G600_CL1E;DKDC1TRFSAPXIQ01NEW_HBA0"
cfgadd "FABRIC1","BAL_G600_CL1E_DKDC1TRFSAPXIQ01NEW_HBA0"

zonecreate "SK_G600_CL1E_DKDC1TRFSAPXIQ01NEW_HBA0","SK_G600_CL1E;DKDC1TRFSAPXIQ01NEW_HBA0"
cfgadd "FABRIC1","SK_G600_CL1E_DKDC1TRFSAPXIQ01NEW_HBA0"




alicreate "DKDC1TRFSAPXIQ01NEW_HBA2","c0:50:76:0b:04:c8:01:06"
zonecreate "BAL_G600_CL1F_DKDC1TRFSAPXIQ01NEW_HBA2","BAL_G600_CL1F;DKDC1TRFSAPXIQ01NEW_HBA2"
cfgadd "FABRIC1","BAL_G600_CL1F_DKDC1TRFSAPXIQ01NEW_HBA2"

zonecreate "SK_G600_CL1F_DKDC1TRFSAPXIQ01NEW_HBA2","SK_G600_CL1F;DKDC1TRFSAPXIQ01NEW_HBA2"
cfgadd "FABRIC1","SK_G600_CL1F_DKDC1TRFSAPXIQ01NEW_HBA2"



cfgsave
cfgenable "FABRIC1"

------------------------------------------------------------------------------------------------------------------


zonecreate "SK_VSP_CL3C_DKDC2TRFSAPXIP01NEW_HBA0","SK_VSP_CL3C;DKDC2TRFSAPXIP01NEW_HBA0"
cfgadd "FABRIC1","SK_VSP_CL3C_DKDC2TRFSAPXIP01NEW_HBA0"

zonecreate "SK_VSP_CL3E_DKDC2TRFSAPXIP01NEW_HBA2","SK_VSP_CL3E;DKDC2TRFSAPXIP01NEW_HBA2"
cfgadd "FABRIC1","SK_VSP_CL3E_DKDC2TRFSAPXIP01NEW_HBA2"



------------------------------------------------------------------------------------------------
c050760b04c8010c
c050760b04c80110


DKDC1TRFTCMWCOP01

alicreate "DKDC1TRFTCMWCOP01NEW_HBA0","c0:50:76:0b:04:c8:01:0c"
zonecreate "BAL_G600_CL1E_DKDC1TRFTCMWCOP01NEW_HBA0","BAL_G600_CL1E;DKDC1TRFTCMWCOP01NEW_HBA0"
cfgadd "FABRIC1","BAL_G600_CL1E_DKDC1TRFTCMWCOP01NEW_HBA0"

alicreate "DKDC1TRFTCMWCOP01NEW_HBA2","c0:50:76:0b:04:c8:01:10"
zonecreate "BAL_G600_CL1F_DKDC1TRFTCMWCOP01NEW_HBA2","BAL_G600_CL1F;DKDC1TRFTCMWCOP01NEW_HBA2"
cfgadd "FABRIC1","BAL_G600_CL1F_DKDC1TRFTCMWCOP01NEW_HBA2"

cfgsave
cfgenable "FABRIC1"

---------------------------------------------------------------------------------------------

c050760b04c80118
c050760b04c80116


DKDC1TRFTODBCOP01

alicreate "DKDC1TRFTODBCOP01NEW_HBA0","c0:50:76:0b:04:c8:01:18"
zonecreate "BAL_G600_CL1E_DKDC1TRFTODBCOP01NEW_HBA0","BAL_G600_CL1E;DKDC1TRFTODBCOP01NEW_HBA0"
cfgadd "FABRIC1","BAL_G600_CL1E_DKDC1TRFTODBCOP01NEW_HBA0"

alicreate "DKDC1TRFTODBCOP01NEW_HBA2","c0:50:76:0b:04:c8:01:16"
zonecreate "BAL_G600_CL1F_DKDC1TRFTODBCOP01NEW_HBA2","BAL_G600_CL1F;DKDC1TRFTODBCOP01NEW_HBA2"
cfgadd "FABRIC1","BAL_G600_CL1F_DKDC1TRFTODBCOP01NEW_HBA2"

cfgsave
cfgenable "FABRIC1"

--------------------------------------------------------------------------------------------------

c050760b04c2012e
c050760b04c20132


DKDC2TRFPECMCOP002

alicreate "DKDC2TRFPECMCOP002NEW_HBA0","c0:50:76:0b:04:c2:01:2e"
zonecreate "BAL_G600_CL1E_DKDC2TRFPECMCOP002NEW_HBA0","BAL_G600_CL1E;DKDC2TRFPECMCOP002NEW_HBA0"
cfgadd "FABRIC1","BAL_G600_CL1E_DKDC2TRFPECMCOP002NEW_HBA0"

zonecreate "SK_G600_CL1E_DKDC2TRFPECMCOP002NEW_HBA0","SK_G600_CL1E;DKDC2TRFPECMCOP002NEW_HBA0"
cfgadd "FABRIC1","SK_G600_CL1E_DKDC2TRFPECMCOP002NEW_HBA0"




alicreate "DKDC2TRFPECMCOP002NEW_HBA2","c0:50:76:0b:04:c2:01:32"
zonecreate "BAL_G600_CL1F_DKDC2TRFPECMCOP002NEW_HBA2","BAL_G600_CL1F;DKDC2TRFPECMCOP002NEW_HBA2"
cfgadd "FABRIC1","BAL_G600_CL1F_DKDC2TRFPECMCOP002NEW_HBA2"

zonecreate "SK_G600_CL1F_DKDC2TRFPECMCOP002NEW_HBA2","SK_G600_CL1F;DKDC2TRFPECMCOP002NEW_HBA2"
cfgadd "FABRIC1","SK_G600_CL1F_DKDC2TRFPECMCOP002NEW_HBA2"



cfgsave
cfgenable "FABRIC1"

-------------------------------------------------------------------------------------------------

c050760b04c8011c
c050760b04c80120


DKDC1TRFPECMCOP001

alicreate "DKDC1TRFPECMCOP001NEW_HBA0","c0:50:76:0b:04:c8:01:1c"
zonecreate "BAL_G600_CL1E_DKDC1TRFPECMCOP001NEW_HBA0","BAL_G600_CL1E;DKDC1TRFPECMCOP001NEW_HBA0"
cfgadd "FABRIC1","BAL_G600_CL1E_DKDC1TRFPECMCOP001NEW_HBA0"

zonecreate "SK_G600_CL1E_DKDC1TRFPECMCOP001NEW_HBA0","SK_G600_CL1E;DKDC1TRFPECMCOP001NEW_HBA0"
cfgadd "FABRIC1","SK_G600_CL1E_DKDC1TRFPECMCOP001NEW_HBA0"




alicreate "DKDC1TRFPECMCOP001NEW_HBA2","c0:50:76:0b:04:c8:01:20"
zonecreate "BAL_G600_CL1F_DKDC1TRFPECMCOP001NEW_HBA2","BAL_G600_CL1F;DKDC1TRFPECMCOP001NEW_HBA2"
cfgadd "FABRIC1","BAL_G600_CL1F_DKDC1TRFPECMCOP001NEW_HBA2"

zonecreate "SK_G600_CL1F_DKDC1TRFPECMCOP001NEW_HBA2","SK_G600_CL1F;DKDC1TRFPECMCOP001NEW_HBA2"
cfgadd "FABRIC1","SK_G600_CL1F_DKDC1TRFPECMCOP001NEW_HBA2"



cfgsave
cfgenable "FABRIC1"
---------------------------------------------------------------------------------------------------

c050760b04c2013a
c050760b04c20138

DKDC2TRFPFNPCOP003

alicreate "DKDC2TRFPFNPCOP003NEW_HBA0","c0:50:76:0b:04:c2:01:3a"
zonecreate "SK_G600_CL1E_DKDC2TRFPFNPCOP003NEW_HBA0","SK_G600_CL1E;DKDC2TRFPFNPCOP003NEW_HBA0"
cfgadd "FABRIC1","SK_G600_CL1E_DKDC2TRFPFNPCOP003NEW_HBA0"

alicreate "DKDC2TRFPFNPCOP003NEW_HBA2","c0:50:76:0b:04:c2:01:38"
zonecreate "SK_G600_CL1F_DKDC2TRFPFNPCOP003NEW_HBA2","SK_G600_CL1F;DKDC2TRFPFNPCOP003NEW_HBA2"
cfgadd "FABRIC1","SK_G600_CL1F_DKDC2TRFPFNPCOP003NEW_HBA2"

cfgsave
cfgenable "FABRIC1"

-------------------------------------------------------------------------------------------------------


c050760b04c2013e
c050760b04c20142

DKDC2TVGUTFDBCPH2

alicreate "DKDC2TVGUTFDBCPH2NEW_HBA0","c0:50:76:0b:04:c2:01:3e"
zonecreate "SK_G600_CL1E_DKDC2TVGUTFDBCPH2NEW_HBA0","SK_G600_CL1E;DKDC2TVGUTFDBCPH2NEW_HBA0"
cfgadd "FABRIC1","SK_G600_CL1E_DKDC2TVGUTFDBCPH2NEW_HBA0"

alicreate "DKDC2TVGUTFDBCPH2NEW_HBA2","c0:50:76:0b:04:c2:01:42"
zonecreate "SK_G600_CL1F_DKDC2TVGUTFDBCPH2NEW_HBA2","SK_G600_CL1F;DKDC2TVGUTFDBCPH2NEW_HBA2"
cfgadd "FABRIC1","SK_G600_CL1F_DKDC2TVGUTFDBCPH2NEW_HBA2"

cfgsave
cfgenable "FABRIC1"

-------------------------------------------------------------------------------------------------------
c050760b04c20148
c050760b04c2014c

DKDC2TVGPDBCPH1

alicreate "DKDC2TVGPDBCPH1NEW_HBA0","c0:50:76:0b:04:c2:01:48"
zonecreate "SK_G600_CL1E_DKDC2TVGPDBCPH1NEW_HBA0","SK_G600_CL1E;DKDC2TVGPDBCPH1NEW_HBA0"
cfgadd "FABRIC1","SK_G600_CL1E_DKDC2TVGPDBCPH1NEW_HBA0"

alicreate "DKDC2TVGPDBCPH1NEW_HBA2","c0:50:76:0b:04:c2:01:4c"
zonecreate "SK_G600_CL1F_DKDC2TVGPDBCPH1NEW_HBA2","SK_G600_CL1F;DKDC2TVGPDBCPH1NEW_HBA2"
cfgadd "FABRIC1","SK_G600_CL1F_DKDC2TVGPDBCPH1NEW_HBA2"

cfgsave
cfgenable "FABRIC1"

---------------------------------------------------------------------------------------------------------
10000090fa505129

DKDC2XENPRDC001

alicreate "DKDC2XENPRDC001_HBA0","10:00:00:90:fa:50:51:29"
zonecreate "SK_VSP_CL2C_DKDC2XENPRDC001_HBA0","SK_VSP_CL2C;DKDC2XENPRDC001_HBA0"
cfgadd "FABRIC1","SK_VSP_CL2C_DKDC2XENPRDC001_HBA0"

zonecreate "SK_VSP_CL2E_DKDC2XENPRDC001_HBA0","SK_VSP_CL2E;DKDC2XENPRDC001_HBA0"
cfgadd "FABRIC1","SK_VSP_CL2E_DKDC2XENPRDC001_HBA0"

cfgsave
cfgenable "FABRIC1"
-------------------------------------------------------------------------------------------------------------
c050760b04c20156
c050760b04c2015c

DKDC2VEBP1101

alicreate "DKDC2VEBP1101NEW_HBA0","c0:50:76:0b:04:c2:01:56"
zonecreate "SK_G600_CL1E_DKDC2VEBP1101NEW_HBA0","SK_G600_CL1E;DKDC2VEBP1101NEW_HBA0"
cfgadd "FABRIC1","SK_G600_CL1E_DKDC2VEBP1101NEW_HBA0"

alicreate "DKDC2VEBP1101NEW_HBA2","c0:50:76:0b:04:c2:01:5c"
zonecreate "SK_G600_CL1F_DKDC2VEBP1101NEW_HBA2","SK_G600_CL1F;DKDC2VEBP1101NEW_HBA2"
cfgadd "FABRIC1","SK_G600_CL1F_DKDC2VEBP1101NEW_HBA2"

cfgsave
cfgenable "FABRIC1"

---------------------------------------------------------------------------------------------------------------
c050760b04c20160
c050760b04c20162

DKDC2TRFNMPCPH001

alicreate "DKDC2TRFNMPCPH001NEW_HBA0","c0:50:76:0b:04:c2:01:60"
zonecreate "SK_G600_CL1E_DKDC2TRFNMPCPH001NEW_HBA0","SK_G600_CL1E;DKDC2TRFNMPCPH001NEW_HBA0"
cfgadd "FABRIC1","SK_G600_CL1E_DKDC2TRFNMPCPH001NEW_HBA0"

alicreate "DKDC2TRFNMPCPH001NEW_HBA2","c0:50:76:0b:04:c2:01:62"
zonecreate "SK_G600_CL1F_DKDC2TRFNMPCPH001NEW_HBA2","SK_G600_CL1F;DKDC2TRFNMPCPH001NEW_HBA2"
cfgadd "FABRIC1","SK_G600_CL1F_DKDC2TRFNMPCPH001NEW_HBA2"

cfgsave
cfgenable "FABRIC1"
---------------------------------------------------------------------------------------------------------

DKDC1ESXPRDE001

50000870005ba2c9
50000870005ba2c8

alicreate "DKDC1ESXPRDE001NEW_HBA0","50:00:08:70:00:5b:a2:c9"
zonecreate "BAL_G600_CL3E_DKDC1ESXPRDE001NEW_HBA0","BAL_G600_CL3E;DKDC1ESXPRDE001NEW_HBA0"
cfgadd "FABRIC1","BAL_G600_CL3E_DKDC1ESXPRDE001NEW_HBA0"

zonecreate "SK_G600_CL3E_DKDC1ESXPRDE001NEW_HBA0","SK_G600_CL3E;DKDC1ESXPRDE001NEW_HBA0"
cfgadd "FABRIC1","SK_G600_CL3E_DKDC1ESXPRDE001NEW_HBA0"

alicreate "DKDC1ESXPRDE001NEW_HBA2","50:00:08:70:00:5b:a2:c8"
zonecreate "BAL_G600_CL3F_DKDC1ESXPRDE001NEW_HBA2","BAL_G600_CL3F;DKDC1ESXPRDE001NEW_HBA2"
cfgadd "FABRIC1","BAL_G600_CL3F_DKDC1ESXPRDE001NEW_HBA2"

zonecreate "SK_G600_CL3F_DKDC1ESXPRDE001NEW_HBA2","SK_G600_CL3F;DKDC1ESXPRDE001NEW_HBA2"
cfgadd "FABRIC1","SK_G600_CL3F_DKDC1ESXPRDE001NEW_HBA2"

cfgsave
cfgenable "FABRIC1"
--------------------------------------------------------------------------------------------------------
DKDC2ESXPRDE001

50000870005ba189
50000870005ba188


alicreate "DKDC2ESXPRDE001NEW_HBA0","50:00:08:70:00:5b:a1:89"
zonecreate "BAL_G600_CL3E_DKDC2ESXPRDE001NEW_HBA0","BAL_G600_CL3E;DKDC2ESXPRDE001NEW_HBA0"
cfgadd "FABRIC1","BAL_G600_CL3E_DKDC2ESXPRDE001NEW_HBA0"

zonecreate "SK_G600_CL3E_DKDC2ESXPRDE001NEW_HBA0","SK_G600_CL3E;DKDC2ESXPRDE001NEW_HBA0"
cfgadd "FABRIC1","SK_G600_CL3E_DKDC2ESXPRDE001NEW_HBA0"

alicreate "DKDC2ESXPRDE001NEW_HBA2","50:00:08:70:00:5b:a1:88"
zonecreate "BAL_G600_CL3F_DKDC2ESXPRDE001NEW_HBA2","BAL_G600_CL3F;DKDC2ESXPRDE001NEW_HBA2"
cfgadd "FABRIC1","BAL_G600_CL3F_DKDC2ESXPRDE001NEW_HBA2"

zonecreate "SK_G600_CL3F_DKDC2ESXPRDE001NEW_HBA2","SK_G600_CL3F;DKDC2ESXPRDE001NEW_HBA2"
cfgadd "FABRIC1","SK_G600_CL3F_DKDC2ESXPRDE001NEW_HBA2"

cfgsave
cfgenable "FABRIC1"

--------------------------------------------------------------------------------------------------------------
cfgsave
cfgenable "FABRIC1"
----------------------------------------------------------------------------------------------------------

DKDC1TSTINFA001

c050760b04c800c2

c0:50:76:0b:04:c8:00:c2

c050760b04c800c4

c0:50:76:0b:04:c8:00:c4

alicreate "DKDC1TSTINFA001NEW_HBA0","c0:50:76:0b:04:c8:00:c2"
zonecreate "BAL_G600_CL1E_DKDC1TSTINFA001NEW_HBA0","BAL_G600_CL1E;DKDC1TSTINFA001NEW_HBA0"
cfgadd "FABRIC1","BAL_G600_CL1E_DKDC1TSTINFA001NEW_HBA0"

alicreate "DKDC1TSTINFA001NEW_HBA2","c0:50:76:0b:04:c8:00:c4"
zonecreate "BAL_G600_CL1F_DKDC1TSTINFA001NEW_HBA2","BAL_G600_CL1F;DKDC1TSTINFA001NEW_HBA2"
cfgadd "FABRIC1","BAL_G600_CL1F_DKDC1TSTINFA001NEW_HBA2"


zonecreate "BAL_VSP_CL3C_DKDC1TSTINFA001NEW_HBA0","BAL_VSP_CL3C;DKDC1TSTINFA001NEW_HBA0"
cfgadd "FABRIC1","BAL_VSP_CL3C_DKDC1TSTINFA001NEW_HBA0"

zonecreate "BAL_VSP_CL3E_DKDC1TSTINFA001NEW_HBA2","BAL_VSP_CL3E;DKDC1TSTINFA001NEW_HBA2"
cfgadd "FABRIC1","BAL_VSP_CL3E_DKDC1TSTINFA001NEW_HBA2"

cfgsave
cfgenable "FABRIC1"
--------------------------------------------------------------------------------------------------------------
DKDC1CLSINFA001

c050760b04c800ba

c0:50:76:0b:04:c8:00:ba

c050760b04c800bc

c0:50:76:0b:04:c8:00:bc

alicreate "DKDC1CLSINFA001NEW_HBA0","c0:50:76:0b:04:c8:00:ba"
zonecreate "BAL_G600_CL1E_DKDC1CLSINFA001NEW_HBA0","BAL_G600_CL1E;DKDC1CLSINFA001NEW_HBA0"
cfgadd "FABRIC1","BAL_G600_CL1E_DKDC1CLSINFA001NEW_HBA0"

zonecreate "SK_G600_CL1E_DKDC1CLSINFA001NEW_HBA0","SK_G600_CL1E;DKDC1CLSINFA001NEW_HBA0"
cfgadd "FABRIC1","SK_G600_CL1E_DKDC1CLSINFA001NEW_HBA0"


alicreate "DKDC1CLSINFA001NEW_HBA2","c0:50:76:0b:04:c8:00:bc"
zonecreate "BAL_G600_CL1F_DKDC1CLSINFA001NEW_HBA2","BAL_G600_CL1F;DKDC1CLSINFA001NEW_HBA2"
cfgadd "FABRIC1","BAL_G600_CL1F_DKDC1CLSINFA001NEW_HBA2"

zonecreate "SK_G600_CL1F_DKDC1CLSINFA001NEW_HBA2","SK_G600_CL1F;DKDC1CLSINFA001NEW_HBA2"
cfgadd "FABRIC1","SK_G600_CL1F_DKDC1CLSINFA001NEW_HBA2"

zonecreate "BAL_VSP_CL3C_DKDC1CLSINFA001NEW_HBA0","BAL_VSP_CL3C;DKDC1CLSINFA001NEW_HBA0"
cfgadd "FABRIC1","BAL_VSP_CL3C_DKDC1CLSINFA001NEW_HBA0"

zonecreate "BAL_VSP_CL3E_DKDC1CLSINFA001NEW_HBA2","BAL_VSP_CL3E;DKDC1CLSINFA001NEW_HBA2"
cfgadd "FABRIC1","BAL_VSP_CL3E_DKDC1CLSINFA001NEW_HBA2"

cfgsave
cfgenable "FABRIC1"
--------------------------------------------------------------------------------------------------------------
DKDC2TSTINFA001

c050760b04c200e2

c0:50:76:0b:04:c2:00:e2

c050760b04c200de

c0:50:76:0b:04:c2:00:de

alicreate "DKDC2TSTINFA001NEW_HBA0","c0:50:76:0b:04:c2:00:e2"
zonecreate "SK_G600_CL1E_DKDC2TSTINFA001NEW_HBA0","SK_G600_CL1E;DKDC2TSTINFA001NEW_HBA0"
cfgadd "FABRIC1","SK_G600_CL1E_DKDC2TSTINFA001NEW_HBA0"

alicreate "DKDC2TSTINFA001NEW_HBA2","c0:50:76:0b:04:c2:00:de"
zonecreate "SK_G600_CL1F_DKDC2TSTINFA001NEW_HBA2","SK_G600_CL1F;DKDC2TSTINFA001NEW_HBA2"
cfgadd "FABRIC1","SK_G600_CL1F_DKDC2TSTINFA001NEW_HBA2"

zonecreate "SK_VSP_CL3C_DKDC2TSTINFA001NEW_HBA0","SK_VSP_CL3C;DKDC2TSTINFA001NEW_HBA0"
cfgadd "FABRIC1","SK_VSP_CL3C_DKDC2TSTINFA001NEW_HBA0"

zonecreate "SK_VSP_CL3E_DKDC2TSTINFA001NEW_HBA2","SK_VSP_CL3E;DKDC2TSTINFA001NEW_HBA2"
cfgadd "FABRIC1","SK_VSP_CL3E_DKDC2TSTINFA001NEW_HBA2"

cfgsave
cfgenable "FABRIC1"
-----------------------------------------------------------------------------------------------------------------
DKDC2CLSINFA001

c050760b04c200d8

c0:50:76:0b:04:c2:00:d8

c050760b04c200dc

c0:50:76:0b:04:c2:00:dc

alicreate "DKDC2CLSINFA001NEW_HBA0","c0:50:76:0b:04:c2:00:d8"
zonecreate "BAL_G600_CL1E_DKDC2CLSINFA001NEW_HBA0","BAL_G600_CL1E;DKDC2CLSINFA001NEW_HBA0"
cfgadd "FABRIC1","BAL_G600_CL1E_DKDC2CLSINFA001NEW_HBA0"

zonecreate "SK_G600_CL1E_DKDC2CLSINFA001NEW_HBA0","SK_G600_CL1E;DKDC2CLSINFA001NEW_HBA0"
cfgadd "FABRIC1","SK_G600_CL1E_DKDC2CLSINFA001NEW_HBA0"


alicreate "DKDC2CLSINFA001NEW_HBA2","c0:50:76:0b:04:c2:00:dc"
zonecreate "BAL_G600_CL1F_DKDC2CLSINFA001NEW_HBA2","BAL_G600_CL1F;DKDC2CLSINFA001NEW_HBA2"
cfgadd "FABRIC1","BAL_G600_CL1F_DKDC2CLSINFA001NEW_HBA2"

zonecreate "SK_G600_CL1F_DKDC2CLSINFA001NEW_HBA2","SK_G600_CL1F;DKDC2CLSINFA001NEW_HBA2"
cfgadd "FABRIC1","SK_G600_CL1F_DKDC2CLSINFA001NEW_HBA2"

zonecreate "SK_VSP_CL3C_DKDC2CLSINFA001NEW_HBA0","SK_VSP_CL3C;DKDC2CLSINFA001NEW_HBA0"
cfgadd "FABRIC1","SK_VSP_CL3C_DKDC2CLSINFA001NEW_HBA0"

zonecreate "SK_VSP_CL3E_DKDC2CLSINFA001NEW_HBA2","SK_VSP_CL3E;DKDC2CLSINFA001NEW_HBA2"
cfgadd "FABRIC1","SK_VSP_CL3E_DKDC2CLSINFA001NEW_HBA2"

cfgsave
cfgenable "FABRIC1"
--------------------------------------------------------------------------------------------------------------

TEMP_PAPY_001

50:00:08:70:00:5b:a2:d3


alicreate "DKDC1TEMP_PAPY_001_HBA0","50:00:08:70:00:5b:a2:d3"
zonecreate "BAL_VSP_CL1C_DKDC1TEMP_PAPY_001_HBA0","BAL_VSP_CL1C;DKDC1TEMP_PAPY_001_HBA0"
cfgadd "FABRIC1","BAL_VSP_CL1C_DKDC1TEMP_PAPY_001_HBA0"

zonecreate "BAL_VSP_CL1E_DKDC1TEMP_PAPY_001_HBA0","BAL_VSP_CL1E;DKDC1TEMP_PAPY_001_HBA0"
cfgadd "FABRIC1","BAL_VSP_CL1E_DKDC1TEMP_PAPY_001_HBA0"

cfgsave
cfgenable "FABRIC1"
--------------------------------------------------------------------------------------------------------------------

=============================================Test_KT=====================================================


c0:50:76:0b:04:c8:01:38 - 
c0:50:76:0b:04:c8:01:36 -

alicreate "dkdc1sanzona001_HBA0","c0:50:76:0b:04:c8:01:38"
zonecreate "BAL_G600_CL1E_dkdc1sanzona001_HBA0","BAL_G600_CL1E;dkdc1sanzona001_HBA0"
cfgadd "FABRIC1","BAL_G600_CL1E_dkdc1sanzona001_HBA0"

zonecreate "SK_G600_CL1E_dkdc1sanzona001_HBA0","SK_G600_CL1E;dkdc1sanzona001_HBA0"
cfgadd "FABRIC1","SK_G600_CL1E_dkdc1sanzona001_HBA0"

alicreate "dkdc1sanzona001_HBA2","c0:50:76:0b:04:c8:01:36"
zonecreate "BAL_G600_CL1F_dkdc1sanzona001_HBA2","BAL_G600_CL1F;dkdc1sanzona001_HBA2"
cfgadd "FABRIC1","BAL_G600_CL1F_dkdc1sanzona001_HBA2"

zonecreate "SK_G600_CL1F_dkdc1sanzona001_HBA2","SK_G600_CL1F;dkdc1sanzona001_HBA2"
cfgadd "FABRIC1","SK_G600_CL1F_dkdc1sanzona001_HBA2"


cfgsave
cfgenable "FABRIC1"


c050760b04c80138 - HBA0
c050760b04c80136 - HBA2
============================================================================================

c0:50:76:0b:04:c2:01:70
c0:50:76:0b:04:c2:01:74

alicreate "dkdc2sanzona001_HBA0","c0:50:76:0b:04:c2:01:70"
zonecreate "BAL_G600_CL1E_dkdc2sanzona001_HBA0","BAL_G600_CL1E;dkdc2sanzona001_HBA0"
cfgadd "FABRIC1","BAL_G600_CL1E_dkdc2sanzona001_HBA0"

zonecreate "SK_G600_CL1E_dkdc2sanzona001_HBA0","SK_G600_CL1E;dkdc2sanzona001_HBA0"
cfgadd "FABRIC1","SK_G600_CL1E_dkdc2sanzona001_HBA0"

alicreate "dkdc2sanzona001_HBA2","c0:50:76:0b:04:c2:01:74"
zonecreate "BAL_G600_CL1F_dkdc2sanzona001_HBA2","BAL_G600_CL1F;dkdc2sanzona001_HBA2"
cfgadd "FABRIC1","BAL_G600_CL1F_dkdc2sanzona001_HBA2"

zonecreate "SK_G600_CL1F_dkdc2sanzona001_HBA2","SK_G600_CL1F;dkdc2sanzona001_HBA2"
cfgadd "FABRIC1","SK_G600_CL1F_dkdc2sanzona001_HBA2"

c050760b04c20170- HBA0
c050760b04c20174 - HBA2

============================================================================================

c0:50:76:0b:04:c8:01:32
c0:50:76:0b:04:c8:01:2e

alicreate "DKDC1G600A001_HBA0","c0:50:76:0b:04:c8:01:32"
zonecreate "BAL_G600_CL1E_DKDC1G600A001_HBA0","BAL_G600_CL1E;DKDC1G600A001_HBA0"
cfgadd "FABRIC1","BAL_G600_CL1E_DKDC1G600A001_HBA0"

alicreate "DKDC1G600A001_HBA2","c0:50:76:0b:04:c8:01:2e"
zonecreate "BAL_G600_CL1F_DKDC1G600A001_HBA2","BAL_G600_CL1F;DKDC1G600A001_HBA2"
cfgadd "FABRIC1","BAL_G600_CL1F_DKDC1G600A001_HBA2"


cfgsave
cfgenable "FABRIC1"

---------------

c050760b04c80132 - HBA0
c050760b04c8012e - HBA2

==================================================================================


c050760b04c2017a - HBA0
c050760b04c20178 - HBA2

alicreate "DKDC2HITACHI001_HBA0","c0:50:76:0b:04:c8:01:32"
zonecreate "BAL_G600_CL1E_DKDC2HITACHI001_HBA0","BAL_G600_CL1E;DKDC2HITACHI001_HBA0"
cfgadd "FABRIC1","BAL_G600_CL1E_DKDC2HITACHI001_HBA0"

alicreate "DKDC2HITACHI001_HBA2","c0:50:76:0b:04:c2:01:78"
zonecreate "BAL_G600_CL1F_DKDC2HITACHI001_HBA2","BAL_G600_CL1F;DKDC2HITACHI001_HBA2"
cfgadd "FABRIC1","BAL_G600_CL1F_DKDC2HITACHI001_HBA2"



