<svg width="13" height="13" viewBox="0 0 13 13" fill="none" xmlns="http://www.w3.org/2000/svg">
<g clip-path="url(#clip0)">
<path d="M6.49944 13C6.18007 12.9986 5.86763 12.9067 5.5984 12.7349C5.32918 12.5631 5.1142 12.3184 4.97844 12.0293L3.21803 8.54317C2.96281 8.03497 2.82935 7.47435 2.82822 6.90566C2.8271 6.33698 2.95832 5.77583 3.21153 5.26663C3.49731 4.69461 3.92891 4.20808 4.46278 3.85613L4.08469 0.45121C4.07871 0.394455 4.08469 0.337078 4.10225 0.282777C4.1198 0.228475 4.14854 0.178456 4.18662 0.135944C4.22469 0.0934313 4.27125 0.0593697 4.32329 0.035955C4.37533 0.0125404 4.43171 0.000292551 4.48878 1.23333e-06H8.55127C8.60845 -0.000139836 8.66501 0.0118223 8.71723 0.0351012C8.76946 0.0583801 8.81616 0.0924487 8.85428 0.135067C8.89239 0.177686 8.92106 0.227889 8.93839 0.282377C8.95571 0.336865 8.96131 0.394403 8.95482 0.45121L8.57348 3.88104C9.09125 4.23117 9.51036 4.70848 9.79061 5.26717C10.0436 5.77642 10.1748 6.33755 10.1737 6.90621C10.1725 7.47486 10.0392 8.03546 9.78411 8.54371L8.01827 12.0407C7.88183 12.3279 7.66668 12.5706 7.39782 12.7404C7.12896 12.9102 6.81744 13.0002 6.49944 13C6.49998 13 6.49944 13 6.49944 13ZM5.00444 4.472C4.54644 4.74925 4.17658 5.15085 3.9379 5.63008C3.74116 6.02603 3.63923 6.46232 3.64017 6.90445C3.64111 7.34658 3.74489 7.78244 3.94332 8.17754L5.70915 11.6745C5.8554 11.9876 6.16523 12.1864 6.50053 12.1875C6.83636 12.1875 7.14511 11.9903 7.28757 11.6859L9.05882 8.17754C9.25712 7.7824 9.36083 7.34656 9.36177 6.90445C9.36271 6.46234 9.26085 6.02607 9.06423 5.63008C8.83069 5.1624 8.47223 4.76851 8.02857 4.49204L5.00444 4.472ZM7.77886 3.67846L8.09736 0.812501H4.94269L5.25902 3.66113L7.77886 3.67846Z" fill="#838B91"/>
<path d="M6.50001 10.9688C6.39226 10.9688 6.28893 10.9259 6.21275 10.8498C6.13656 10.7736 6.09376 10.6702 6.09376 10.5625V8.05513C5.85652 7.97058 5.65117 7.81486 5.50574 7.60923C5.36032 7.40361 5.28192 7.1581 5.28126 6.90625C5.28126 6.23404 5.8278 5.6875 6.50001 5.6875C7.17222 5.6875 7.71876 6.23404 7.71876 6.90625C7.71876 7.42625 7.38563 7.88558 6.90626 8.05513V10.5625C6.90626 10.6702 6.86346 10.7736 6.78727 10.8498C6.71108 10.9259 6.60775 10.9688 6.50001 10.9688ZM6.50001 6.5C6.39226 6.5 6.28893 6.5428 6.21275 6.61899C6.13656 6.69517 6.09376 6.79851 6.09376 6.90625C6.09376 7.01399 6.13656 7.11733 6.21275 7.19351C6.28893 7.2697 6.39226 7.3125 6.50001 7.3125C6.60775 7.3125 6.71108 7.2697 6.78727 7.19351C6.86346 7.11733 6.90626 7.01399 6.90626 6.90625C6.90626 6.79851 6.86346 6.69517 6.78727 6.61899C6.71108 6.5428 6.60775 6.5 6.50001 6.5Z" fill="#838B91"/>
</g>
<defs>
<clipPath id="clip0">
<rect width="13" height="13" fill="white"/>
</clipPath>
</defs>
</svg>
