<svg width="13" height="13" viewBox="0 0 13 13" fill="none" xmlns="http://www.w3.org/2000/svg">
<path d="M6.5 12C9.53757 12 12 9.53757 12 6.5C12 3.46243 9.53757 1 6.5 1C3.46243 1 1 3.46243 1 6.5C1 9.53757 3.46243 12 6.5 12Z" stroke="#838B91" stroke-width="0.8" stroke-linecap="round" stroke-linejoin="round"/>
<path d="M1.73511 3.75098H3.06244C3.42711 3.75098 3.77685 3.89584 4.03471 4.1537C4.29258 4.41157 4.43744 4.7613 4.43744 5.12598V5.76764C4.43746 5.994 4.49336 6.21685 4.60017 6.41642C4.70699 6.61598 4.86143 6.78609 5.04977 6.91164L5.92794 7.49739C6.10416 7.61451 6.2487 7.77337 6.34867 7.95985C6.44865 8.14633 6.50096 8.35464 6.50096 8.56623C6.50096 8.77781 6.44865 8.98612 6.34867 9.1726C6.2487 9.35908 6.10416 9.51795 5.92794 9.63506L3.61244 11.1787" stroke="#838B91" stroke-width="0.8" stroke-linecap="round" stroke-linejoin="round"/>
<path d="M11.2649 3.75098H10.6232C10.3888 3.75091 10.1582 3.81077 9.95346 3.92489C9.74868 4.03901 9.57648 4.20359 9.45322 4.403C9.32995 4.60241 9.25972 4.83002 9.24919 5.06421C9.23866 5.2984 9.28818 5.53139 9.39305 5.74106C9.78446 6.52389 9.8743 6.56148 10.1172 6.70723L11.8589 7.75039" stroke="#838B91" stroke-width="0.8" stroke-linecap="round" stroke-linejoin="round"/>
</svg>
