<svg width="16" height="16" viewBox="0 0 16 16" fill="none" xmlns="http://www.w3.org/2000/svg">
<path d="M1.5 16C1.10228 15.9996 0.720958 15.8415 0.43973 15.5603C0.158502 15.279 0.000353055 14.8977 0 14.5L0 3.5C0.000353055 3.10228 0.158502 2.72096 0.43973 2.43973C0.720958 2.1585 1.10228 2.00035 1.5 2H4V0.5C4 0.367392 4.05268 0.240215 4.14645 0.146447C4.24021 0.0526784 4.36739 0 4.5 0C4.63261 0 4.75979 0.0526784 4.85355 0.146447C4.94732 0.240215 5 0.367392 5 0.5V2H11V0.5C11 0.367392 11.0527 0.240215 11.1464 0.146447C11.2402 0.0526784 11.3674 0 11.5 0C11.6326 0 11.7598 0.0526784 11.8536 0.146447C11.9473 0.240215 12 0.367392 12 0.5V2H14.5C14.8977 2.00035 15.279 2.1585 15.5603 2.43973C15.8415 2.72096 15.9996 3.10228 16 3.5V14.5C15.9996 14.8977 15.8415 15.279 15.5603 15.5603C15.279 15.8415 14.8977 15.9996 14.5 16H1.5ZM1 14.5C1 14.776 1.224 15 1.5 15H14.5C14.6326 15 14.7598 14.9473 14.8536 14.8536C14.9473 14.7598 15 14.6326 15 14.5V7H1V14.5ZM15 6V3.5C15 3.36739 14.9473 3.24021 14.8536 3.14645C14.7598 3.05268 14.6326 3 14.5 3H12V4C12 4.13261 11.9473 4.25979 11.8536 4.35355C11.7598 4.44732 11.6326 4.5 11.5 4.5C11.3674 4.5 11.2402 4.44732 11.1464 4.35355C11.0527 4.25979 11 4.13261 11 4V3H5V4C5 4.13261 4.94732 4.25979 4.85355 4.35355C4.75979 4.44732 4.63261 4.5 4.5 4.5C4.36739 4.5 4.24021 4.44732 4.14645 4.35355C4.05268 4.25979 4 4.13261 4 4V3H1.5C1.36739 3 1.24021 3.05268 1.14645 3.14645C1.05268 3.24021 1 3.36739 1 3.5V6H15Z" fill="#383E66"/>
</svg>
