[
  {
    "value": "BD",
    "name": "Bangladesh"
  },
  {
    "value": "BE",
    "name": "Belgium",
    "region": "Europe"
  },
  {
    "value": "BF",
    "name": "Burkina Faso"
  },
  {
    "value": "BG",
    "name": "Bulgaria",
    "region": "Europe"
  },
  {
    "value": "BA",
    "name": "Bosnia and Herzegovina",
    "region": "Europe"
  },
  {
    "value": "BB",
    "name": "Barbados"
  },
  {
    "value": "WF",
    "name": "Wallis and Futuna"
  },
  {
    "value": "BL",
    "name": "Saint Barthelemy"
  },
  {
    "value": "BM",
    "name": "Bermuda"
  },
  {
    "value": "BN",
    "name": "Brunei"
  },
  {
    "value": "BO",
    "name": "Bolivia"
  },
  {
    "value": "BH",
    "name": "Bahrain"
  },
  {
    "value": "BI",
    "name": "Burundi"
  },
  {
    "value": "BJ",
    "name": "Benin"
  },
  {
    "value": "BT",
    "name": "Bhutan"
  },
  {
    "value": "JM",
    "name": "Jamaica"
  },
  {
    "value": "BV",
    "name": "Bouvet Island"
  },
  {
    "value": "BW",
    "name": "Botswana"
  },
  {
    "value": "WS",
    "name": "Samoa"
  },
  {
    "value": "BQ",
    "name": "Bonaire, Saint Eustatius and Saba "
  },
  {
    "value": "BR",
    "name": "Brazil"
  },
  {
    "value": "BS",
    "name": "Bahamas"
  },
  {
    "value": "JE",
    "name": "Jersey"
  },
  {
    "value": "BY",
    "name": "Belarus",
    "region": "Europe"
  },
  {
    "value": "BZ",
    "name": "Belize"
  },
  {
    "value": "RU",
    "name": "Russia",
    "region": "Europe"
  },
  {
    "value": "RW",
    "name": "Rwanda"
  },
  {
    "value": "RS",
    "name": "Serbia",
    "region": "Europe"
  },
  {
    "value": "TL",
    "name": "East Timor"
  },
  {
    "value": "RE",
    "name": "Reunion"
  },
  {
    "value": "TM",
    "name": "Turkmenistan"
  },
  {
    "value": "TJ",
    "name": "Tajikistan"
  },
  {
    "value": "RO",
    "name": "Romania",
    "region": "Europe"
  },
  {
    "value": "TK",
    "name": "Tokelau"
  },
  {
    "value": "GW",
    "name": "Guinea-Bissau"
  },
  {
    "value": "GU",
    "name": "Guam"
  },
  {
    "value": "GT",
    "name": "Guatemala"
  },
  {
    "value": "GS",
    "name": "South Georgia and the South Sandwich Islands"
  },
  {
    "value": "GR",
    "name": "Greece",
    "region": "Europe"
  },
  {
    "value": "GQ",
    "name": "Equatorial Guinea"
  },
  {
    "value": "GP",
    "name": "Guadeloupe"
  },
  {
    "value": "JP",
    "name": "Japan"
  },
  {
    "value": "GY",
    "name": "Guyana"
  },
  {
    "value": "GG",
    "name": "Guernsey"
  },
  {
    "value": "GF",
    "name": "French Guiana"
  },
  {
    "value": "GE",
    "name": "Georgia",
    "region": "Europe"
  },
  {
    "value": "GD",
    "name": "Grenada"
  },
  {
    "value": "GB",
    "name": "United Kingdom",
    "region": "Europe"
  },
  {
    "value": "GA",
    "name": "Gabon"
  },
  {
    "value": "SV",
    "name": "El Salvador"
  },
  {
    "value": "GN",
    "name": "Guinea"
  },
  {
    "value": "GM",
    "name": "Gambia"
  },
  {
    "value": "GL",
    "name": "Greenland"
  },
  {
    "value": "GI",
    "name": "Gibraltar"
  },
  {
    "value": "GH",
    "name": "Ghana"
  },
  {
    "value": "OM",
    "name": "Oman"
  },
  {
    "value": "TN",
    "name": "Tunisia"
  },
  {
    "value": "JO",
    "name": "Jordan"
  },
  {
    "value": "HR",
    "name": "Croatia",
    "region": "Europe"
  },
  {
    "value": "HT",
    "name": "Haiti"
  },
  {
    "value": "HU",
    "name": "Hungary",
    "region": "Europe"
  },
  {
    "value": "HK",
    "name": "Hong Kong"
  },
  {
    "value": "HN",
    "name": "Honduras"
  },
  {
    "value": "HM",
    "name": "Heard Island and McDonald Islands"
  },
  {
    "value": "VE",
    "name": "Venezuela"
  },
  {
    "value": "PR",
    "name": "Puerto Rico"
  },
  {
    "value": "PS",
    "name": "Palestinian Territory"
  },
  {
    "value": "PW",
    "name": "Palau"
  },
  {
    "value": "PT",
    "name": "Portugal",
    "region": "Europe"
  },
  {
    "value": "SJ",
    "name": "Svalbard and Jan Mayen"
  },
  {
    "value": "PY",
    "name": "Paraguay"
  },
  {
    "value": "IQ",
    "name": "Iraq"
  },
  {
    "value": "PA",
    "name": "Panama"
  },
  {
    "value": "PF",
    "name": "French Polynesia"
  },
  {
    "value": "PG",
    "name": "Papua New Guinea"
  },
  {
    "value": "PE",
    "name": "Peru"
  },
  {
    "value": "PK",
    "name": "Pakistan"
  },
  {
    "value": "PH",
    "name": "Philippines"
  },
  {
    "value": "PN",
    "name": "Pitcairn"
  },
  {
    "value": "PL",
    "name": "Poland",
    "region": "Europe"
  },
  {
    "value": "PM",
    "name": "Saint Pierre and Miquelon"
  },
  {
    "value": "ZM",
    "name": "Zambia"
  },
  {
    "value": "EH",
    "name": "Western Sahara"
  },
  {
    "value": "EE",
    "name": "Estonia",
    "region": "Europe"
  },
  {
    "value": "EG",
    "name": "Egypt"
  },
  {
    "value": "ZA",
    "name": "South Africa"
  },
  {
    "value": "EC",
    "name": "Ecuador"
  },
  {
    "value": "IT",
    "name": "Italy",
    "region": "Europe"
  },
  {
    "value": "VN",
    "name": "Vietnam"
  },
  {
    "value": "SB",
    "name": "Solomon Islands"
  },
  {
    "value": "ET",
    "name": "Ethiopia"
  },
  {
    "value": "SO",
    "name": "Somalia"
  },
  {
    "value": "ZW",
    "name": "Zimbabwe"
  },
  {
    "value": "SA",
    "name": "Saudi Arabia"
  },
  {
    "value": "ES",
    "name": "Spain",
    "region": "Europe"
  },
  {
    "value": "ER",
    "name": "Eritrea"
  },
  {
    "value": "ME",
    "name": "Montenegro",
    "region": "Europe"
  },
  {
    "value": "MD",
    "name": "Moldova",
    "region": "Europe"
  },
  {
    "value": "MG",
    "name": "Madagascar"
  },
  {
    "value": "MF",
    "name": "Saint Martin"
  },
  {
    "value": "MA",
    "name": "Morocco"
  },
  {
    "value": "MC",
    "name": "Monaco",
    "region": "Europe"
  },
  {
    "value": "UZ",
    "name": "Uzbekistan"
  },
  {
    "value": "MM",
    "name": "Myanmar"
  },
  {
    "value": "ML",
    "name": "Mali"
  },
  {
    "value": "MO",
    "name": "Macao"
  },
  {
    "value": "MN",
    "name": "Mongolia"
  },
  {
    "value": "MH",
    "name": "Marshall Islands"
  },
  {
    "value": "MK",
    "name": "Macedonia",
    "region": "Europe"
  },
  {
    "value": "MU",
    "name": "Mauritius"
  },
  {
    "value": "MT",
    "name": "Malta",
    "region": "Europe"
  },
  {
    "value": "MW",
    "name": "Malawi"
  },
  {
    "value": "MV",
    "name": "Maldives"
  },
  {
    "value": "MQ",
    "name": "Martinique"
  },
  {
    "value": "MP",
    "name": "Northern Mariana Islands"
  },
  {
    "value": "MS",
    "name": "Montserrat"
  },
  {
    "value": "MR",
    "name": "Mauritania"
  },
  {
    "value": "IM",
    "name": "Isle of Man"
  },
  {
    "value": "UG",
    "name": "Uganda"
  },
  {
    "value": "TZ",
    "name": "Tanzania"
  },
  {
    "value": "MY",
    "name": "Malaysia"
  },
  {
    "value": "MX",
    "name": "Mexico"
  },
  {
    "value": "IL",
    "name": "Israel",
    "region": "Europe"
  },
  {
    "value": "FR",
    "name": "France",
    "region": "Europe"
  },
  {
    "value": "IO",
    "name": "British Indian Ocean Territory"
  },
  {
    "value": "SH",
    "name": "Saint Helena"
  },
  {
    "value": "FJ",
    "name": "Fiji"
  },
  {
    "value": "FI",
    "name": "Finland",
    "region": "Europe"
  },
  {
    "value": "FK",
    "name": "Falkland Islands"
  },
  {
    "value": "FM",
    "name": "Micronesia"
  },
  {
    "value": "FO",
    "name": "Faroe Islands",
    "region": "Europe"
  },
  {
    "value": "NI",
    "name": "Nicaragua"
  },
  {
    "value": "NL",
    "name": "Netherlands",
    "region": "Europe"
  },
  {
    "value": "NO",
    "name": "Norway",
    "region": "Europe"
  },
  {
    "value": "NA",
    "name": "Namibia"
  },
  {
    "value": "VU",
    "name": "Vanuatu"
  },
  {
    "value": "NC",
    "name": "New Caledonia"
  },
  {
    "value": "NE",
    "name": "Niger"
  },
  {
    "value": "NF",
    "name": "Norfolk Island"
  },
  {
    "value": "NG",
    "name": "Nigeria"
  },
  {
    "value": "NZ",
    "name": "New Zealand"
  },
  {
    "value": "NP",
    "name": "Nepal"
  },
  {
    "value": "NR",
    "name": "Nauru"
  },
  {
    "value": "NU",
    "name": "Niue"
  },
  {
    "value": "CK",
    "name": "Cook Islands"
  },
  {
    "value": "XK",
    "name": "Kosovo",
    "region": "Europe"
  },
  {
    "value": "CI",
    "name": "Ivory Coast"
  },
  {
    "value": "CH",
    "name": "Switzerland",
    "region": "Europe"
  },
  {
    "value": "CO",
    "name": "Colombia"
  },
  {
    "value": "CN",
    "name": "China"
  },
  {
    "value": "CM",
    "name": "Cameroon"
  },
  {
    "value": "CL",
    "name": "Chile"
  },
  {
    "value": "CC",
    "name": "Cocos Islands"
  },
  {
    "value": "CA",
    "name": "Canada"
  },
  {
    "value": "CG",
    "name": "Republic of the Congo"
  },
  {
    "value": "CF",
    "name": "Central African Republic"
  },
  {
    "value": "CD",
    "name": "Democratic Republic of the Congo"
  },
  {
    "value": "CZ",
    "name": "Czech Republic",
    "region": "Europe"
  },
  {
    "value": "CY",
    "name": "Cyprus",
    "region": "Europe"
  },
  {
    "value": "CX",
    "name": "Christmas Island"
  },
  {
    "value": "CR",
    "name": "Costa Rica"
  },
  {
    "value": "CW",
    "name": "Curacao"
  },
  {
    "value": "CV",
    "name": "Cape Verde"
  },
  {
    "value": "CU",
    "name": "Cuba"
  },
  {
    "value": "SZ",
    "name": "Swaziland"
  },
  {
    "value": "SY",
    "name": "Syria"
  },
  {
    "value": "SX",
    "name": "Sint Maarten"
  },
  {
    "value": "KG",
    "name": "Kyrgyzstan"
  },
  {
    "value": "KE",
    "name": "Kenya"
  },
  {
    "value": "SS",
    "name": "South Sudan"
  },
  {
    "value": "SR",
    "name": "Suriname"
  },
  {
    "value": "KI",
    "name": "Kiribati"
  },
  {
    "value": "KH",
    "name": "Cambodia"
  },
  {
    "value": "KN",
    "name": "Saint Kitts and Nevis"
  },
  {
    "value": "KM",
    "name": "Comoros"
  },
  {
    "value": "ST",
    "name": "Sao Tome and Principe"
  },
  {
    "value": "SK",
    "name": "Slovakia",
    "region": "Europe"
  },
  {
    "value": "KR",
    "name": "South Korea"
  },
  {
    "value": "SI",
    "name": "Slovenia",
    "region": "Europe"
  },
  {
    "value": "KP",
    "name": "North Korea"
  },
  {
    "value": "KW",
    "name": "Kuwait"
  },
  {
    "value": "SN",
    "name": "Senegal"
  },
  {
    "value": "SM",
    "name": "San Marino",
    "region": "Europe"
  },
  {
    "value": "SL",
    "name": "Sierra Leone"
  },
  {
    "value": "SC",
    "name": "Seychelles"
  },
  {
    "value": "KZ",
    "name": "Kazakhstan",
    "region": "Europe"
  },
  {
    "value": "KY",
    "name": "Cayman Islands"
  },
  {
    "value": "SG",
    "name": "Singapore"
  },
  {
    "value": "SE",
    "name": "Sweden",
    "region": "Europe"
  },
  {
    "value": "SD",
    "name": "Sudan"
  },
  {
    "value": "DO",
    "name": "Dominican Republic"
  },
  {
    "value": "DM",
    "name": "Dominica"
  },
  {
    "value": "DJ",
    "name": "Djibouti"
  },
  {
    "value": "DK",
    "name": "Denmark",
    "region": "Europe"
  },
  {
    "value": "VG",
    "name": "British Virgin Islands"
  },
  {
    "value": "DE",
    "name": "Germany",
    "region": "Europe"
  },
  {
    "value": "YE",
    "name": "Yemen"
  },
  {
    "value": "DZ",
    "name": "Algeria"
  },
  {
    "value": "US",
    "name": "United States"
  },
  {
    "value": "UY",
    "name": "Uruguay"
  },
  {
    "value": "YT",
    "name": "Mayotte"
  },
  {
    "value": "UM",
    "name": "United States Minor Outlying Islands"
  },
  {
    "value": "LB",
    "name": "Lebanon"
  },
  {
    "value": "LC",
    "name": "Saint Lucia"
  },
  {
    "value": "LA",
    "name": "Laos"
  },
  {
    "value": "TV",
    "name": "Tuvalu"
  },
  {
    "value": "TW",
    "name": "Taiwan"
  },
  {
    "value": "TT",
    "name": "Trinidad and Tobago"
  },
  {
    "value": "TR",
    "name": "Turkey",
    "region": "Europe"
  },
  {
    "value": "LK",
    "name": "Sri Lanka"
  },
  {
    "value": "LI",
    "name": "Liechtenstein",
    "region": "Europe"
  },
  {
    "value": "LV",
    "name": "Latvia",
    "region": "Europe"
  },
  {
    "value": "TO",
    "name": "Tonga"
  },
  {
    "value": "LT",
    "name": "Lithuania",
    "region": "Europe"
  },
  {
    "value": "LU",
    "name": "Luxembourg",
    "region": "Europe"
  },
  {
    "value": "LR",
    "name": "Liberia"
  },
  {
    "value": "LS",
    "name": "Lesotho"
  },
  {
    "value": "TH",
    "name": "Thailand"
  },
  {
    "value": "TF",
    "name": "French Southern Territories"
  },
  {
    "value": "TG",
    "name": "Togo"
  },
  {
    "value": "TD",
    "name": "Chad"
  },
  {
    "value": "TC",
    "name": "Turks and Caicos Islands"
  },
  {
    "value": "LY",
    "name": "Libya"
  },
  {
    "value": "VA",
    "name": "Vatican",
    "region": "Europe"
  },
  {
    "value": "VC",
    "name": "Saint Vincent and the Grenadines"
  },
  {
    "value": "AE",
    "name": "United Arab Emirates"
  },
  {
    "value": "AD",
    "name": "Andorra",
    "region": "Europe"
  },
  {
    "value": "AG",
    "name": "Antigua and Barbuda"
  },
  {
    "value": "AF",
    "name": "Afghanistan"
  },
  {
    "value": "AI",
    "name": "Anguilla"
  },
  {
    "value": "VI",
    "name": "U.S. Virgin Islands"
  },
  {
    "value": "IS",
    "name": "Iceland",
    "region": "Europe"
  },
  {
    "value": "IR",
    "name": "Iran"
  },
  {
    "value": "AM",
    "name": "Armenia",
    "region": "Europe"
  },
  {
    "value": "AL",
    "name": "Albania",
    "region": "Europe"
  },
  {
    "value": "AO",
    "name": "Angola"
  },
  {
    "value": "AQ",
    "name": "Antarctica"
  },
  {
    "value": "AS",
    "name": "American Samoa"
  },
  {
    "value": "AR",
    "name": "Argentina"
  },
  {
    "value": "AU",
    "name": "Australia"
  },
  {
    "value": "AT",
    "name": "Austria",
    "region": "Europe"
  },
  {
    "value": "AW",
    "name": "Aruba"
  },
  {
    "value": "IN",
    "name": "India"
  },
  {
    "value": "AX",
    "name": "Aland Islands"
  },
  {
    "value": "AZ",
    "name": "Azerbaijan",
    "region": "Europe"
  },
  {
    "value": "IE",
    "name": "Ireland",
    "region": "Europe"
  },
  {
    "value": "ID",
    "name": "Indonesia"
  },
  {
    "value": "UA",
    "name": "Ukraine",
    "region": "Europe"
  },
  {
    "value": "QA",
    "name": "Qatar"
  },
  {
    "value": "MZ",
    "name": "Mozambique"
  }
]