<svg width="29" height="28" viewBox="0 0 29 28" fill="none" xmlns="http://www.w3.org/2000/svg">
<path d="M20.7656 20.125L27.0953 26.375" stroke="black" stroke-opacity="0.4" stroke-width="2" stroke-linecap="round" stroke-linejoin="round"/>
<path d="M1.77734 12.0893C1.77734 18.0066 6.63546 22.8036 12.6283 22.8036C15.6298 22.8036 18.3469 21.6002 20.3113 19.6554C22.2689 17.7173 23.4792 15.0429 23.4792 12.0893C23.4792 6.17195 18.621 1.375 12.6283 1.375C6.63546 1.375 1.77734 6.17195 1.77734 12.0893Z" stroke="black" stroke-opacity="0.4" stroke-width="2" stroke-linecap="round" stroke-linejoin="round"/>
</svg>
