Bio Auvergne
8
Rue Niel
63100
Clermont-Ferrand
Lundi
__
__
__
__
14
00
19
00
Mardi
09
00
__
__
__
__
19
00
Mercredi
09
00
__
__
__
__
19
00
Jeudi
09
00
__
__
__
__
19
00
Vendredi
09
00
__
__
__
__
19
00
Samedi
09
00
__
__
__
__
19
00
Dimanche
__
__
__
__
__
__
__
__
Depuis 1997, nous vous accueillons dans notre magasin d'alimentation biologique.
http://www.bio-auvergne.com/
0473141990
True
True
https://static4.pagesjaunes.fr/media/cviv/07963118_N_0002_photo.jpg
2
UnPseudo
9
Bio Auvergne est un super magasin de produit bio.
Un Autre Pseudo
4
Sympa, mais sans plus... Le personel est pas au top
Decathlon Clermont-Fd
0
Zone commerciale la Pardieu
63000
Clermont-Ferrand
Lundi
09
00
__
__
__
__
20
00
Mardi
09
00
__
__
__
__
20
00
Mercredi
09
00
__
__
__
__
20
00
Jeudi
09
00
__
__
__
__
20
00
Vendredi
09
00
__
__
__
__
20
00
Samedi
09
00
__
__
__
__
20
00
Dimanche
__
__
__
__
__
__
__
__
Découvrez les vêtements, chaussures et articles Décathlon au sein de votre boutique de sport de Clermont Ferrand. Vous y trouverez tout le matériel dont vous avez besoin afin de vous équiper dans votre pratique sportive. Toute la journée, des conseillers passionnés seront là pour vous accueillir et vous donner des services personnalisés. 
https://www.decathlon.fr/
0473273614
True
True
https://www.decathlon.fr/store/fr/0070006200062/photo-mag-1303905640.png
0
Auchan SUPERMARCHE CEBAZAT
0
Route de Châteaugay
63118
CEBAZAT
Lundi
08
30
__
__
__
__
19
30
Mardi
08
30
__
__
__
__
19
30
Mercredi
08
30
__
__
__
__
19
30
Jeudi
08
30
__
__
__
__
19
30
Vendredi
08
30
__
__
__
__
19
30
Samedi
08
30
__
__
__
__
19
30
Dimanche
09
00
12
45
__
__
__
__
Auchan Supermarché vous accompagne avec une offre qui évolue régulièrement pour mieux répondre à vos attentes. Nous vous offrons le meilleur d'Auchan tout près de chez vous.
https://www.auchan.fr/magasins/supermarche-cebazat/sl-1062
0473872120
True
True
http://www.archidistec.com/wp-content/uploads/2017/01/LM_OK_2.jpg
1
Moi même
6
Vraiment pratique par sa situation géographique, mais pas très grand donc peu de choix
