9.998893962704742933e+01,9.337665248926396089e+01,8.726350534016468430e+01,8.170906155973244722e+01,7.630098938809449294e+01,7.123035216292127814e+01,6.655047582917988791e+01,6.214850736088036598e+01,5.807236525115969528e+01,5.414951124474232103e+01,5.061947570569257238e+01,4.729148715403617587e+01,4.417099346336881638e+01,4.127400085544484654e+01,3.858819935027737813e+01,3.605768246910788122e+01,3.369924539172981781e+01,3.149003265037739396e+01,2.941125625499088514e+01,2.746059157093204561e+01,2.562378725055618744e+01,2.391086233667627070e+01,2.232121636313848967e+01,2.080535163528933040e+01,1.940256111799779859e+01,1.809292588682041014e+01,1.687824157352674703e+01,1.574461677203423093e+01,1.467558811285384657e+01,1.367789590076112205e+01
9.999034560421515039e+01,9.358746075783379581e+01,8.761268853824432767e+01,8.200383698581767078e+01,7.674737822937029819e+01,7.183885859112760386e+01,6.714772832195359342e+01,6.276500710391054838e+01,5.867750393463088443e+01,5.486139328671837490e+01,5.124845716837667453e+01,4.778213855963970502e+01,4.455790340191567367e+01,4.157833236903688601e+01,3.879268152820118587e+01,3.618652414258732364e+01,3.376338935423370202e+01,3.151202661071775779e+01,2.939462873185481584e+01,2.742453118336141671e+01,2.556639760953537888e+01,2.382183929460509475e+01,2.218867301846071172e+01,2.067106037364479931e+01,1.926165662364598674e+01,1.797788945515856440e+01,1.678407587818614033e+01,1.566034813003222936e+01,1.460932819251285331e+01,1.361518607139704251e+01
9.972199964867982658e+01,9.342200919417008720e+01,8.753562025376554345e+01,8.199598751902402682e+01,7.658112547656618574e+01,7.151328967012207727e+01,6.673999153611062241e+01,6.229775697453085570e+01,5.809860295103379002e+01,5.421179175286092544e+01,5.053861478334138013e+01,4.714432589382467853e+01,4.400263886028747606e+01,4.105987545948362083e+01,3.831623709341032935e+01,3.577041717476244997e+01,3.339100526896663013e+01,3.115900418123510107e+01,2.906298264968027212e+01,2.711086690195148208e+01,2.529444683108889791e+01,2.359300884293983458e+01,2.200642558515927760e+01,2.050713977976255009e+01,1.911725240977960993e+01,1.780946652086059956e+01,1.661215254566562649e+01,1.547677614817055414e+01,1.442185418065137448e+01,1.344117331980183394e+01
9.601909665320340537e+01,8.946325149425244661e+01,8.335361982160674188e+01,7.766116632834510369e+01,7.236162543622653232e+01,6.741534131190310575e+01,6.280502819138413173e+01,5.851161931405179928e+01,5.451123488432769193e+01,5.078391131994877128e+01,4.731970315473600408e+01,4.409086323724420708e+01,4.108316936802591357e+01,3.828626106674640539e+01,3.568034427639539530e+01,3.324492846958555958e+01,3.097210483146579207e+01,2.885209598765608519e+01,2.687508795901990410e+01,2.503656977618750190e+01,2.332665189402147021e+01,2.173330706095582698e+01,2.025051881386768571e+01,1.886886764503571001e+01,1.758239746010816873e+01,1.638556310873008925e+01,1.526885705667207915e+01,1.422864184951232858e+01,1.325878430107547423e+01,1.235415802683065500e+01
9.999957833959796005e+01,9.321198165598666208e+01,8.692700499046316054e+01,8.107453286545424476e+01,7.562116964546123654e+01,7.053702247403995784e+01,6.579427208669673632e+01,6.137198358833452971e+01,5.724320516428048933e+01,5.339254479643674500e+01,4.980144586682136776e+01,4.645392551543637438e+01,4.333063404335100444e+01,4.042345822591730098e+01,3.771108997266033214e+01,3.518853674447245083e+01,3.284034949511163859e+01,3.064165685643583714e+01,2.857704687989683734e+01,2.666169367196764384e+01,2.486577815941408787e+01,2.319326948690671131e+01,2.163135621030163236e+01,2.017353178340279030e+01,1.880590937076715363e+01,1.752827283195544794e+01,1.633894077051570548e+01,1.522745110991383655e+01,1.419341317556954074e+01,1.322705460891300078e+01
9.999999567558401736e+01,9.337428853515052651e+01,8.722528100769703485e+01,8.143346369037971044e+01,7.606703605513368416e+01,7.104773341252993646e+01,6.633918312807401207e+01,6.196459283057610890e+01,5.790626170616391022e+01,5.409841092029904530e+01,5.053190046583811323e+01,4.709739087616190290e+01,4.388771995119774516e+01,4.088566953031362772e+01,3.811159349579251199e+01,3.549735629758805544e+01,3.306746602053097206e+01,3.076722179685089031e+01,2.862676219797598876e+01,2.663314076363652916e+01,2.479720508272522750e+01,2.309936688606233446e+01,2.152995572143305480e+01,2.007072824910503783e+01,1.871033359179931921e+01,1.744386068295375480e+01,1.626288440510604261e+01,1.515660393400119332e+01,1.413514648913937855e+01,1.317618571325732368e+01
9.991940431484604801e+01,9.319183128447264153e+01,8.693708213588128331e+01,8.112585278969048375e+01,7.567570789612105386e+01,7.056092008542769634e+01,6.579692953747792217e+01,6.135141778659285450e+01,5.716610793304861460e+01,5.324973324538611763e+01,4.960268969402755346e+01,4.620294807749777988e+01,4.304215702731363535e+01,4.010180829743857345e+01,3.737059070285365436e+01,3.483523358201401265e+01,3.247139524981757575e+01,3.027057796996775707e+01,2.822335093025714770e+01,2.631563521360108737e+01,2.454076888000316004e+01,2.287535559324207313e+01,2.131955715731719181e+01,1.986785631434388222e+01,1.851561544689172933e+01,1.725337038794806688e+01,1.607523533195255538e+01,1.498037154056782683e+01,1.395864336059778132e+01,1.300458203327117701e+01
-9.993326009790196451e+01,9.384594288033504483e+01,8.832036699276247305e+01,8.286344683670715483e+01,7.762940252983399603e+01,7.269739874642958455e+01,6.812120841891648126e+01,6.375516295011502166e+01,5.966586989230748372e+01,5.576235981258039942e+01,5.208499107323781629e+01,4.866684407578976135e+01,4.535783984813166825e+01,4.227744171930665829e+01,3.942737947926130460e+01,3.682209890090786075e+01,3.433424616514579952e+01,3.208802864415929434e+01,2.996498786983340423e+01,2.798080305306000071e+01,2.611050617040207200e+01,2.438315104081031848e+01,2.279211204533116231e+01,2.126936008056355476e+01,1.986232654900773298e+01,1.851160714818266584e+01,1.725796120365085429e+01,1.606285787004084398e+01,1.495086520394084850e+01,1.392991305347438846e+01
9.939527400444964655e+01,9.260630778218208548e+01,8.628496127728536180e+01,8.039364138856846864e+01,7.492817995004969589e+01,6.983878679270070222e+01,6.505898704537943900e+01,6.061285272911691635e+01,5.647310888884690883e+01,5.261669718245541816e+01,4.902644395946696676e+01,4.568687272917961906e+01,4.257898680398605507e+01,3.968325414908889570e+01,3.698140180382938524e+01,3.446814916135805618e+01,3.212463788799365005e+01,2.993890113185566193e+01,2.790882982276168178e+01,2.601596293466508314e+01,2.425086680491531510e+01,2.260433686295826305e+01,2.106836296009834797e+01,1.963507553470225986e+01,1.829195682781960741e+01,1.704098481849857549e+01,1.587390669649693109e+01,1.478815593825641628e+01,1.377602069208982272e+01,1.283404612192370919e+01
-9.936584676064913424e+01,9.262026850948767276e+01,8.635036678545357347e+01,8.049555349905607216e+01,7.503241022971573670e+01,6.991998624535031581e+01,6.516055836216833086e+01,6.070376896281818802e+01,5.654805312052665300e+01,5.267861289098582489e+01,4.905322975342352976e+01,4.566985103959574843e+01,4.252310259010614857e+01,3.960220022542540619e+01,3.687694479689723437e+01,3.433939018063666282e+01,3.197567675388401653e+01,2.977461615882407386e+01,2.772294564641894254e+01,2.580967845897880508e+01,2.402889699845854565e+01,2.238104614921334701e+01,2.084474433288715645e+01,1.941469991384054694e+01,1.808610225548795469e+01,1.684668511851647210e+01,1.569525635748661685e+01,1.462350537527063743e+01,1.362536391888895437e+01,1.269416207747852710e+01
9.986459503466895171e+01,9.306900879240892266e+01,8.679212399591052929e+01,8.091393906346547737e+01,7.542484836758809763e+01,7.028688796001281958e+01,6.550181501703768561e+01,6.103091033207057592e+01,5.687211905199403361e+01,5.300008321394238919e+01,4.938948075671665094e+01,4.603602375702400451e+01,4.289890519213030728e+01,3.996632753594973764e+01,3.724061423745482813e+01,3.470094040608728392e+01,3.232382168833088087e+01,3.010568091627940390e+01,2.804514606767715890e+01,2.613093237528512702e+01,2.434457015402568913e+01,2.267898119104199495e+01,2.113162366721912377e+01,1.969252431428898475e+01,1.834863608874981722e+01,1.709576534974518225e+01,1.592981102128857529e+01,1.484816327668069391e+01,1.383750880967160235e+01,1.289144965291749578e+01
-9.977212196865700378e+01,9.292173002085010580e+01,8.652371322516512464e+01,8.055857641382455370e+01,7.506404335049123233e+01,6.993340675555901953e+01,6.521920832762634745e+01,6.083054729240831193e+01,5.663314563761670684e+01,5.270232889776478657e+01,4.904781237973421071e+01,4.564652716524046383e+01,4.248955335809336731e+01,3.957897737896950474e+01,3.684329001831954997e+01,3.432961389468871261e+01,3.199749915170929171e+01,2.984325896970916858e+01,2.782748318707213286e+01,2.594081098979751943e+01,2.418406969564684417e+01,2.253267245905234617e+01,2.098759046466829759e+01,1.954697731920919423e+01,1.822264348446934434e+01,1.698074915972222243e+01,1.582290354622132611e+01,1.474271713385302540e+01,1.373691777808171288e+01,1.279805117537974724e+01
9.999990322321950487e+01,9.329232355998858850e+01,8.704517715123056121e+01,8.121203549837187552e+01,7.566843930813929830e+01,7.050648152488905396e+01,6.568288006356833364e+01,6.121167136609152948e+01,5.705039702298908111e+01,5.316323335910572467e+01,4.954592235958274671e+01,4.617154963370949616e+01,4.302324884738562361e+01,4.009645830602013916e+01,3.735722866038621248e+01,3.481139647648783608e+01,3.243245319245258429e+01,3.021428850240284092e+01,2.814664204312368767e+01,2.621046395549602437e+01,2.441046967972982529e+01,2.273359323548064737e+01,2.117130222839851683e+01,1.972140208697378938e+01,1.836321806652098587e+01,1.710159498235699616e+01,1.592571268952083585e+01,1.483831201743223716e+01,1.382519013157111232e+01,1.288342087914954348e+01
-9.312344394356993860e+01,8.672688742727750366e+01,8.099936814713443312e+01,7.613744821176472044e+01,7.181696791306379168e+01,6.787180441042964674e+01,6.424853427199172984e+01,6.105232812914069029e+01,5.763853293001375988e+01,5.453251583940767944e+01,5.168858703262573329e+01,4.857703847774533301e+01,4.569285826387303473e+01,4.297207842019680868e+01,4.030961985688752947e+01,3.778802903074285524e+01,3.547143120078239775e+01,3.325297074982582757e+01,3.106341124803055465e+01,2.901216987873316810e+01,2.704697184848990332e+01,2.538986558207072974e+01,2.376527568674313784e+01,2.223076076759698338e+01,2.078865025399824162e+01,1.943957546544229587e+01,1.809843745398291759e+01,1.689102877442319439e+01,1.571024180615131094e+01,1.463312167550214582e+01
-9.238415693114249905e+01,8.610048217309208951e+01,8.051719964314966660e+01,7.525868736678440030e+01,7.036962707072181900e+01,6.582408338002753112e+01,6.155033197220087970e+01,5.752016191145526847e+01,5.382969603949124604e+01,5.038439942512174952e+01,4.712834653290153852e+01,4.412710714908259035e+01,4.125698957919176735e+01,3.859186374843306311e+01,3.610531741546100193e+01,3.377343903257531110e+01,3.159342695791415778e+01,2.955719580801049418e+01,2.766467443945206739e+01,2.585916827851506383e+01,2.418019728342591890e+01,2.262030943445844144e+01,2.115483369643726874e+01,1.977414277299829237e+01,1.848866542131490931e+01,1.727390575936128059e+01,1.613449287172852920e+01,1.506724925244633972e+01,1.405047367849738649e+01,1.310648459923782916e+01
-9.982898617248284268e+01,9.302570114032050697e+01,8.668084556024710707e+01,8.077263016704884535e+01,7.525036684746584115e+01,7.008082265813006018e+01,6.529815870078151363e+01,6.085234214149212306e+01,5.670252272227203605e+01,5.283809726266804319e+01,4.924183202842404938e+01,4.589277752828315471e+01,4.279001733430901311e+01,3.989120259548362668e+01,3.721821190905805565e+01,3.473244783675320946e+01,3.240116271728606279e+01,3.022452404423190941e+01,2.819117336531595441e+01,2.627806918765409350e+01,2.448982800042107044e+01,2.283588576081082167e+01,2.129333592194199198e+01,1.985298179653263517e+01,1.850524962369475901e+01,1.724487069736862921e+01,1.606371772726948066e+01,1.495990431417671296e+01,1.393524499213167722e+01,1.298091128232063696e+01
9.999683856100097046e+01,9.612970718965947015e+01,9.272627916906269263e+01,8.855297821392500168e+01,8.431621653712831232e+01,7.978247084834157477e+01,7.483601134871864247e+01,7.031000069694913179e+01,6.580257604088639312e+01,6.156734288789421328e+01,5.750559185651268734e+01,5.363664028514391902e+01,5.003601153725664830e+01,4.655253846175195775e+01,4.332826496233858649e+01,4.046493651547601900e+01,3.764385537887277167e+01,3.515670388233280619e+01,3.275093353727641698e+01,3.059045349289099747e+01,2.852014776515078154e+01,2.665280468256038660e+01,2.483202673384696979e+01,2.309197743211901965e+01,2.149489514845774352e+01,2.007103240001583799e+01,1.867476242939039111e+01,1.738523760078035707e+01,1.623223778182823551e+01,1.512012209698027299e+01
9.933242430758579644e+01,9.253835361115774560e+01,8.620148366627877579e+01,8.026960629412029391e+01,7.474768868658682663e+01,6.961276212652818174e+01,6.484252290879916814e+01,6.040280562001060360e+01,5.626739219972909467e+01,5.241113516325705035e+01,4.880741962887861263e+01,4.544984040804316550e+01,4.231746279514592146e+01,3.940275531905693640e+01,3.668740289615920602e+01,3.415363043243059593e+01,3.179232208570264007e+01,2.958671688055657967e+01,2.753685682784103861e+01,2.565012467493060200e+01,2.389498472009094954e+01,2.225888408463967849e+01,2.074457450282595161e+01,1.933345488312816940e+01,1.801841110376277655e+01,1.679212672432936770e+01,1.564994571731630479e+01,1.458394458973550556e+01,1.359155756394638814e+01,1.266393426980958559e+01
9.999962912842589446e+01,9.344720291136336243e+01,8.730226913352105100e+01,8.153568770078656769e+01,7.609631390266831374e+01,7.101404862253205863e+01,6.620090298035842125e+01,6.171097860354541353e+01,5.754811941850039858e+01,5.368004266767307087e+01,5.007478598657659319e+01,4.668525894263076736e+01,4.352652038437415882e+01,4.057147622375163110e+01,3.783853908563456514e+01,3.527151657561556419e+01,3.290176660436230094e+01,3.069490357687644178e+01,2.859499191634933268e+01,2.664443941361858492e+01,2.482222326608092899e+01,2.312741984737356304e+01,2.153171892377026708e+01,2.004685824048988252e+01,1.867027369759332345e+01,1.738978616604165950e+01,1.619590191812752877e+01,1.509065839502188666e+01,1.405582285653305874e+01,1.309186773541506454e+01
9.290897520258570808e+01,8.656931681957217961e+01,8.074409995441062904e+01,7.529107679511757567e+01,7.020985104958009515e+01,6.546123411600643749e+01,6.103910539467160135e+01,5.690800058309663001e+01,5.305132522471350853e+01,4.946249624655313681e+01,4.611407770772244419e+01,4.299642278673572804e+01,4.009802682858745726e+01,3.738592201293307227e+01,3.485966125789668268e+01,3.250631403818038478e+01,3.031116216127330887e+01,2.826898835625354067e+01,2.635625865908858501e+01,2.457576583873279574e+01,2.291167431486272577e+01,2.136553306209700054e+01,1.992045993801941961e+01,1.857207567973233964e+01,1.731603918046086221e+01,1.614291594334522628e+01,1.505066276281952575e+01,1.403048440057181878e+01,1.307368761945047098e+01,1.218175492149858918e+01
9.996429934770681314e+01,9.376094523798377622e+01,8.794874251309980195e+01,8.240392090526638924e+01,7.719789512517372998e+01,7.222653993978873643e+01,6.754027494976266155e+01,6.308960143706941182e+01,5.896745400714816299e+01,5.495169235056366119e+01,5.118398711892587727e+01,4.772781215604478433e+01,4.444344787865055224e+01,4.141663652625666003e+01,3.862575816608772783e+01,3.600381124802014909e+01,3.355296190591694483e+01,3.126952654725051772e+01,2.910084176631765374e+01,2.707442287317713436e+01,2.519287146575156555e+01,2.344547560594825697e+01,2.182163394702131498e+01,2.031150259336188668e+01,1.891027876956744791e+01,1.760286580322329542e+01,1.638088072045973931e+01,1.525926912221817133e+01,1.421391814724394997e+01,1.324290458753514699e+01
-9.991398529841256959e+01,9.316463230062457512e+01,8.687706026477397359e+01,8.100098723057209327e+01,7.551266141341662319e+01,7.040161918652007955e+01,6.565016748047106887e+01,6.121024372599193697e+01,5.702577356473589276e+01,5.312671801630613544e+01,4.947215975231070217e+01,4.608005690785974906e+01,4.292956918228465213e+01,3.999132279495207598e+01,3.725514835636460020e+01,3.471032877996002242e+01,3.235536993260869565e+01,3.015571090652067099e+01,2.811261362846997258e+01,2.619855675501609582e+01,2.441047703983445061e+01,2.273682457073871532e+01,2.117976895818032546e+01,1.972900848959315923e+01,1.837872476178386449e+01,1.712103802284302745e+01,1.594946183546128715e+01,1.485830536519172895e+01,1.384083635450696903e+01,1.289374845810795200e+01
-9.686633433106413804e+01,9.027721465190406036e+01,8.415522802145261494e+01,7.843239089560691468e+01,7.309172567835966561e+01,6.812420249606549305e+01,6.351531519271330239e+01,5.921967310885566604e+01,5.520861687384654459e+01,5.148334486146457323e+01,4.800820871849145277e+01,4.477036370473216920e+01,4.174632156008978967e+01,3.892532297463419155e+01,3.627922752499441827e+01,3.381197972708059041e+01,3.150696754560056334e+01,2.935648817345837713e+01,2.736438637674186580e+01,2.550539808199962977e+01,2.377213787359653097e+01,2.215735452044128806e+01,2.065287585563319084e+01,1.925098124459489313e+01,1.794899299309632212e+01,1.673011481778253895e+01,1.559300471258218934e+01,1.453202331297315375e+01,1.353858946437086708e+01,1.261344875953676592e+01
-9.999470208270896876e+01,9.452622850327172443e+01,8.896175516873753963e+01,8.360337133747687233e+01,7.837396294695172116e+01,7.354202825240456320e+01,6.894506074959605257e+01,6.449231453113920054e+01,6.034121063069078872e+01,5.635423983784699686e+01,5.266801584337867581e+01,4.918046979261742280e+01,4.584914527920543748e+01,4.279999305371477902e+01,3.996708348405874744e+01,3.733568474923871605e+01,3.489816484397608320e+01,3.261288612251576779e+01,3.045873238907303104e+01,2.843806053996143035e+01,2.653986707898805619e+01,2.475525627378335969e+01,2.309230228866491075e+01,2.148918671463998464e+01,2.002633058889716011e+01,1.865316128076873881e+01,1.737667355444908779e+01,1.617919921724047327e+01,1.506826636008484677e+01,1.403623574984720612e+01
-9.978846773011697735e+01,9.316848701465764293e+01,8.698581601898197846e+01,8.124443856786301410e+01,7.588299739618234696e+01,7.084725520507173258e+01,6.617463526066978829e+01,6.182073021811906699e+01,5.772421225615335061e+01,5.389175677749384619e+01,5.030440268131550141e+01,4.694802434445026762e+01,4.378943058841631597e+01,4.083667220118736907e+01,3.806412739568818182e+01,3.548986569738061547e+01,3.307871626167289492e+01,3.082532989842566096e+01,2.873738676050703233e+01,2.677697372573048540e+01,2.494980275787833790e+01,2.323272537603239840e+01,2.163083836705080643e+01,2.014060880012765509e+01,1.874436560358564208e+01,1.745380606821912650e+01,1.624616084352864931e+01,1.512458560565691634e+01,1.408768067231034848e+01,1.312486629383280068e+01
-9.996838247785292708e+01,9.317198136560327271e+01,8.685306787992223576e+01,8.097297559930491673e+01,7.547300160254202694e+01,7.034763990209899021e+01,6.557042961249777591e+01,6.112225465028676297e+01,5.698072515181434738e+01,5.312022051491621255e+01,4.951818173881476071e+01,4.616263715796901579e+01,4.303813279554042026e+01,4.012591974036168097e+01,3.741101786260771433e+01,3.487757358159390009e+01,3.251379669771709047e+01,3.030449766692871449e+01,2.824679536531842672e+01,2.632200917026585074e+01,2.452080906092592016e+01,2.284383402328477786e+01,2.128076370382515492e+01,1.982293810974570292e+01,1.846471185533716408e+01,1.719913755484104101e+01,1.601978396024558293e+01,1.491985533372332284e+01,1.389798527632297009e+01,1.294847679484088587e+01
-9.990751817372920129e+01,9.355723950969027669e+01,8.764541583556489002e+01,8.208802952841044487e+01,7.690121352446429626e+01,7.194681211382052766e+01,6.728236190068506062e+01,6.293208008429410683e+01,5.879635638430345779e+01,5.487336259503408797e+01,5.119714229473449763e+01,4.772151259638786058e+01,4.447194585640016840e+01,4.148716733228607723e+01,3.871814991632411562e+01,3.612630770471483999e+01,3.370250143230532558e+01,3.145024301134823475e+01,2.932324008603344367e+01,2.730655719947467475e+01,2.543236282959483674e+01,2.368081567973464630e+01,2.205396842196823215e+01,2.052827547649619433e+01,1.911614618244556496e+01,1.782441236445959731e+01,1.660120424449231535e+01,1.546499507205908053e+01,1.441141181359741985e+01,1.341762498234397150e+01
9.993987264307614282e+01,9.321273739605794617e+01,8.711782196909896925e+01,8.142833612482574779e+01,7.609306296155780558e+01,7.102009450671997115e+01,6.629069615679802041e+01,6.178294763840384718e+01,5.757650456912754322e+01,5.365254498809734685e+01,4.996053624765883683e+01,4.649688423408095872e+01,4.328649713816337652e+01,4.032206033325783778e+01,3.754292287019020335e+01,3.495834572386369388e+01,3.258339569117313772e+01,3.036983607241444005e+01,2.832128893056561481e+01,2.640376447394888260e+01,2.461548360892847853e+01,2.294857009479792964e+01,2.138857795408440410e+01,1.993937034416934750e+01,1.858415354576273515e+01,1.730960842391402110e+01,1.612382332441996624e+01,1.502400957750498733e+01,1.399760202822157495e+01,1.303901049794078837e+01
9.996352327683734984e+01,9.344516899969612211e+01,8.724225560026110315e+01,8.144444583843569774e+01,7.602370990775528981e+01,7.098274661939970542e+01,6.623065332794199378e+01,6.185276573571359648e+01,5.776237639650155131e+01,5.391212320998489105e+01,5.029359600145217968e+01,4.692717860570294164e+01,4.378070513363657312e+01,4.081393385460595624e+01,3.814448407446967337e+01,3.562979984106682707e+01,3.328921087629726117e+01,3.112440240686537862e+01,2.910286948145861885e+01,2.720963146776841057e+01,2.543090909349286122e+01,2.378402524689171571e+01,2.221865748862896339e+01,2.074319544828213324e+01,1.936852371671490047e+01,1.807902326645413638e+01,1.686962285209210677e+01,1.574016536634896646e+01,1.468524805881955331e+01,1.369484749247976119e+01
9.987551528585524352e+01,9.325853280264648504e+01,8.713562374579922221e+01,8.143110886358168443e+01,7.610401176283367874e+01,7.115953786260466529e+01,6.652891442152711932e+01,6.219414924472471995e+01,5.807555648663831960e+01,5.421689773524132505e+01,5.058794130802902345e+01,4.712931612382207192e+01,4.390751899005785219e+01,4.081972325254510991e+01,3.792443727695923172e+01,3.525046026957898704e+01,3.274536583731910611e+01,3.044401242533291096e+01,2.827991498839460860e+01,2.629120276541464207e+01,2.443564166077926458e+01,2.272574687190142839e+01,2.113035059298089990e+01,1.964365283547044072e+01,1.826147475208519566e+01,1.697729854125169524e+01,1.579764299448258136e+01,1.472007570064868887e+01,1.371497772301990459e+01,1.277886648769246847e+01
