2.569512356671949498e-07,-9.399743210024190665e-01,-9.429662331321969626e-01,-9.429777202666345115e-01,-9.429777464609638837e-01,-9.429777840037627534e-01,-9.429777511213475183e-01,-9.429778339686667454e-01,-9.430054832247799501e-01,-9.502270828138268399e-01
1.091080269329386069e-07,-9.399744304454102917e-01,-9.429662516816241791e-01,-9.429777217175797643e-01,-9.429777450812661943e-01,-9.429777604985271067e-01,-9.429777890579017496e-01,-9.429778908104581303e-01,-9.430054651115852282e-01,-9.502270830562479231e-01
4.944939176763335276e+00,7.175248878961903998e+00,-6.687711497390631088e+00,5.287317015910895535e+00,5.125619068988051197e+00,-8.826328913266410225e-01,-1.045125626273852859e+00,-2.597631717352831160e+00,-5.449607218570918787e-01,7.729433778978894054e+00
1.425643462255694747e-06,-9.399744338762449081e-01,-9.429662416908889400e-01,-9.429777468637454696e-01,-9.429778748855112136e-01,-9.429777657421801740e-01,-9.429777048124523553e-01,-9.429778409976513620e-01,-9.430055068241390837e-01,-9.502271104391323275e-01
6.903457121979364786e+00,5.359681453662069828e+00,-9.542684794018372330e-01,-6.775917060452754104e-01,-1.378569062543199664e+00,1.377969056857384267e+01,5.532469908010448023e+00,-2.583027246459650428e-01,-6.651120862988340932e+00,-1.264811013237078452e+00
6.238236778995713117e-08,-9.399743890252422185e-01,-9.429662726567592523e-01,-9.429777421757289391e-01,-9.429777660731799571e-01,-9.429777599950972533e-01,-9.429777732981693417e-01,-9.429778560658782505e-01,-9.430054752286899378e-01,-9.502270888448507424e-01
-3.161957390526938916e+00,-1.003200459754540752e+00,-2.839114641082494117e+00,1.154892127635344679e+01,-8.113360055709369911e-01,-9.570774516123178310e-01,-9.294795207642279067e-01,5.363774389722877345e+00,-4.452772595518977861e-01,-9.047842991211336727e-01
-5.055859788077513026e-08,-9.399744461853979383e-01,-9.429662624360536372e-01,-9.429777236297552934e-01,-9.429777646300309124e-01,-9.429777679941884205e-01,-9.429777797276125417e-01,-9.429778639823587216e-01,-9.430054790238807660e-01,-9.502270740125801085e-01
1.157747129872617434e-07,-9.399744371285224664e-01,-9.429662444685910083e-01,-9.429777231146332372e-01,-9.429777841297055652e-01,-9.429777580756093514e-01,-9.429777635276365144e-01,-9.429778702492676024e-01,-9.430054636438064408e-01,-9.502270798362694171e-01
5.149950296964209728e-07,-9.399744024893905703e-01,-9.429662665979784419e-01,-9.429781115637699829e-01,-9.429777579814396793e-01,-9.429777691390595074e-01,-9.429777647903592186e-01,-9.429777876167514394e-01,-9.430054854201571635e-01,-9.502270307467158839e-01
-1.646150455284604939e-07,-9.399744491703668769e-01,-9.429662648921922630e-01,-9.429777225301516630e-01,-9.429777919245184714e-01,-9.429777916292553241e-01,-9.429776143873865868e-01,-9.429778659230444449e-01,-9.430054420490197042e-01,-9.502270622550668122e-01
1.176379275697960833e-07,-9.399744433123118359e-01,-9.429662458603700337e-01,-9.429777182599557994e-01,-9.429777684252933501e-01,-9.429777432089446743e-01,-9.429777622715809215e-01,-9.429778739461652792e-01,-9.430054590581946616e-01,-9.502270635351640626e-01
-7.424758896319971768e-02,5.376213333578309772e+00,-1.148828562506786222e+00,-8.833192575213548725e-01,-1.089157911650657340e+00,-8.897550713514520426e-01,-8.370956798740660787e-01,-1.146524989884288415e+00,-9.498948029429434836e-01,7.407355861350126247e+00
-6.654106097238620611e-08,-9.399744227640465244e-01,-9.429662444354355300e-01,-9.429777105041401430e-01,-9.429777524079916429e-01,-9.429777733042503662e-01,-9.429777823717044871e-01,-9.429778979669467542e-01,-9.430054690133479189e-01,-9.502270786187793083e-01
3.041211086272139167e-07,-9.399744426304373901e-01,-9.429662180376363612e-01,-9.429777259839576820e-01,-9.429777435032838939e-01,-9.429777441534958893e-01,-9.429777601846319746e-01,-9.429778656367233669e-01,-9.430054571581467648e-01,-9.502270659421485632e-01
1.537977050128734202e+00,-8.655330407402858084e-01,-9.396160647240261454e-01,-6.854513943139566301e-01,-1.022116023035980259e+00,-5.109454036695650458e+00,-1.178399089657667487e+00,-6.765620470316178192e+00,-1.102704662734686369e+00,5.715214602184978787e+00
-4.760334527191901688e-08,-9.399744446368848427e-01,-9.429662075986473546e-01,-9.429777080021827240e-01,-9.429777617829456782e-01,-9.429777688967054816e-01,-9.429777610565883705e-01,-9.429778675684445943e-01,-9.430054624101725791e-01,-9.502270575829396826e-01
9.396463388399983426e-08,-9.399744264492952972e-01,-9.429662477762683626e-01,-9.429777127059891795e-01,-9.429777693273277972e-01,-9.429777565676007445e-01,-9.429777704571853381e-01,-9.429778647362699884e-01,-9.430054922548225527e-01,-9.502270726577625171e-01
3.122813452895815356e+00,-1.768169920823064567e+00,-9.295154398305409682e-01,-8.493089065519414671e-01,-1.049350906135833927e+00,-6.442991742981678538e-01,-1.077046473527322412e+00,-9.549122944667784996e-01,5.216053786408545889e+00,-1.002695482300044461e+00
1.353208462251520992e-07,-9.399744217287356873e-01,-9.429662765152230230e-01,-9.429777160676404701e-01,-9.429777978293222285e-01,-9.429777556792903193e-01,-9.429777418195133265e-01,-9.429778718482536570e-01,-9.430054715312956581e-01,-9.502270439756637099e-01
2.561467158885158324e-08,-9.399744407069310359e-01,-9.429662576524494577e-01,-9.429777175496288910e-01,-9.429777725699951541e-01,-9.429777789622658668e-01,-9.429777663179467195e-01,-9.429778679770242089e-01,-9.430054643196145170e-01,-9.502270650482482761e-01
-1.880187869630747599e+01,-6.851443630650668748e-01,5.368751739190638084e+00,-8.141173109205463998e-01,-8.900485447251007542e-01,-9.612625496324147534e-01,-7.016956307924708813e-01,-9.868267514202917479e-01,-6.565567273734207454e+00,-2.245440745718555320e+01
2.577417455303806392e-09,-9.399744382061255843e-01,-9.429662481362873772e-01,-9.429777249061001010e-01,-9.429777463527987402e-01,-9.429777627097695181e-01,-9.429777714652249898e-01,-9.429778522170341182e-01,-9.430054656568980231e-01,-9.502270407228642357e-01
5.016123032776605328e-09,-9.399744556398349493e-01,-9.429662509511129720e-01,-9.429777287120604257e-01,-9.429777728185598784e-01,-9.429777571708940487e-01,-9.429777587578755949e-01,-9.429778784521627433e-01,-9.430054708920018181e-01,-9.502270716060633449e-01
5.413248537715204201e+00,-1.119459163590399209e+00,-5.232025976100729281e-01,-6.620543197916100908e+00,7.320206971521241002e+00,-1.101497289654091993e+00,-4.429661126785827685e-01,-1.141351784852719264e+00,6.875651844648790423e+00,5.352742816464172826e+00
2.778277633240937367e-07,-9.399743936468009098e-01,-9.429662379715290088e-01,-9.429777338283422683e-01,-9.429778250064470013e-01,-9.429777690887142239e-01,-9.429777073596073977e-01,-9.429778345212753710e-01,-9.430054443455204716e-01,-9.502270565847351635e-01
5.036322702043019841e-08,-9.399744368900259106e-01,-9.429662474118116755e-01,-9.429777115168223034e-01,-9.429777731597612789e-01,-9.429777727161435807e-01,-9.429777775794574435e-01,-9.429778716643678615e-01,-9.430054986376432691e-01,-9.502270721661930653e-01
-3.094034833031265030e+00,-1.031835546914575019e+00,-1.822123666552119658e+00,-9.234053290402055580e-01,-6.674188350963971006e-01,-6.859168730120615010e-01,5.440489681958846191e+00,-6.740502614071016696e-01,-6.544263599025486045e-01,4.983117281188349956e+00
1.357754306550631020e-07,-9.399744375469337720e-01,-9.429662605887192406e-01,-9.429777186041086168e-01,-9.429777556818327300e-01,-9.429777739226736788e-01,-9.429777495112360297e-01,-9.429778706519694742e-01,-9.430054702076285933e-01,-9.502270731400188630e-01
2.506393333155151296e-08,-9.399744272593669736e-01,-9.429662747591014416e-01,-9.429777123322881094e-01,-9.429777772114058543e-01,-9.429777696658163677e-01,-9.429777865073813992e-01,-9.429778719350874194e-01,-9.430054651325552317e-01,-9.502270808878100494e-01
