1.696399482187078370e-04,-1.163398923675426176e-08,1.744359004516075705e-05,2.662873090196097399e-06,-1.086657027186467930e-06,-4.557227735165556427e-04,5.209790870762587739e-09,-8.078333140980988644e-04,-4.840472782398780258e-10,-9.629834834421624024e+00
-2.068799936767569162e-07,-8.055498022470675054e-06,6.850005497996146258e-08,1.166248930611761698e-06,-8.963562529877458322e-06,1.969207420410558511e-06,4.230330747951771972e-07,-3.197354772652474786e-04,-2.817731766681753181e-12,-8.360518767245852700e+01
-4.493547050096347926e-07,-1.137426442304242057e-06,-3.430894837147228999e-06,9.460440317574686140e-07,-5.224792600854677615e-07,-9.850129724747319141e-06,-1.307580246157784773e-06,1.048176863133870314e-04,-6.310642949157101865e-10,3.436684281622768822e+01
-3.493708035763948110e-03,-8.214161148598236127e-08,-6.410753761367429110e-04,-2.711035399652099373e-08,-3.808903828513056310e-06,1.802716112620017652e-06,4.758383447577739311e-05,-1.379513598971547969e-05,7.872621295651013034e-08,-6.727809057649013269e+00
-2.167158471783494462e-06,3.115243150198320865e-04,5.317711226530130595e-07,3.530253370591851167e-05,7.065703073157399193e-04,-5.540563828016828870e-07,4.849701569040456781e-04,4.975242477355047260e-07,2.386254458103403607e-09,-4.457027339926104226e+00
-1.469170554091203390e-05,2.808668320220589571e-09,-1.234050670186854050e-07,-3.725389817107237840e-05,-2.396159095236382500e-09,4.484408877346434479e-06,-1.267686730534401735e-05,6.135995305837511829e-08,-9.915692386025203811e-10,9.828042505454538613e+00
-6.557810824141712194e-04,2.914558477691610397e-08,-2.553576192614133561e-05,9.550315820761886722e-06,4.910831084984768188e-04,-1.600565589425370766e-08,4.534260502286307850e-07,4.937154765593466249e-03,1.370445458589434542e-09,2.325978019901618232e+00
1.350494261822402696e-05,8.657815198410255964e-09,-5.834032306140997409e-05,-1.335863121825788579e-05,-2.133721813031773725e-07,-1.233965194703532811e-05,-3.830029521082474124e-07,-1.090575248959671983e-03,4.455812840236845516e-11,-7.049810404452414048e+01
-8.950851065079095065e-06,6.192325936477085428e-06,-3.069270740364776160e-07,1.277904598094644782e-05,-8.528568075749571101e-07,-3.066836343435354675e-04,4.654130463899256034e-07,-1.167494805026486095e-02,-2.003629848151172016e-11,2.047411891697077380e+00
-1.337157401620659315e-04,-2.319468171767692218e-08,8.490833251275449719e-06,-2.312799595674867039e-08,-1.082486552423129779e-05,-5.550176647195954633e-09,-9.203708185530728940e-09,-1.693264743654456905e-03,2.319294835570230314e-12,9.033610833943370721e+00
-2.233883262394908323e-06,1.900181480833706212e-04,-3.000351371219001580e-09,4.727661687915419107e-06,4.928990152326143692e-06,3.252844106588150837e-05,-1.443415254444775816e-07,-1.189177395982984713e-03,-3.797488590262581258e-10,-7.969079366144993060e+01
6.743374214768844044e-05,8.653399951841584359e-10,-8.958522142777775225e-07,-1.747188488064635618e-05,2.447529833107598995e-06,1.468709856960212327e-05,-1.169184348915314537e-08,-2.051297274213583583e-04,-8.173728070671322358e-09,-3.954592894107632617e+01
1.754654955672657113e-06,1.304484067095504104e-06,6.743968124626586404e-08,1.834862301699692244e-07,-2.305606088200222132e-06,4.518808671521614376e-07,-4.193127981957148496e-07,1.379413294080308067e-06,-1.360251053349130281e-10,4.868733215219868127e-01
9.190364544482459221e-06,1.680580011774589467e-07,-3.176121178625079420e-04,5.156533931167718576e-10,6.611387524169778843e-07,4.172728488097945856e-05,-1.938496840477729996e-08,-2.007288082674841233e-03,8.819114852509911087e-13,-8.626471741959996109e+01
-1.561680876575258095e-04,2.028262877054523981e-10,-1.155950987370261823e-06,-1.999217747398680949e-07,1.728425939699529795e-07,8.923227942171091653e-07,1.140148965592428561e-06,-4.556347001757682439e-07,1.739044935789826633e-11,3.456383915607806046e+01
5.206751833530022753e-09,8.665857176446944548e-06,-5.013798484765766406e-09,2.639114042814150887e-05,-1.020502140422402222e-09,1.114082870345940924e-05,-1.081700483418643873e-07,7.541826121741840088e-04,-5.956646152071210845e-11,2.550099100839365818e+01
2.400159808652087691e-06,-2.570130936532016477e-06,1.832400089900488725e-04,-1.120035038332018111e-08,6.523400795596395587e-06,5.670005801096188831e-05,9.331965724526704718e-07,4.612554817570149106e-04,-2.774083695674041376e-08,-8.265090118496149785e+01
8.435804408593181920e-06,1.006285327156585214e-05,3.455104155728729249e-04,-8.636624135902361793e-08,-4.265074726708617482e-05,-1.892137588962110290e-05,-6.919754433203579704e-06,9.015095039020861725e-04,-7.866567809805039758e-09,-1.018272852647402971e+01
2.277102305558534345e-05,1.580149255812644967e-07,2.545517997597896397e-04,3.793257166895122353e-09,-5.924600453545363863e-05,-1.514285954697006607e-06,-1.169580272425285292e-05,-2.900428118736601639e-04,9.814294045192005739e-09,-1.063065318450004781e+01
-6.416642691998208070e-07,-5.993764298194955223e-04,-1.649359307476439007e-08,-6.637715569513379251e-05,-7.971226997918561924e-07,4.017897731273304101e-05,-1.093215108618397718e-05,3.457236725352202055e-04,-2.295734999463841786e-08,1.442049875252672564e+01
3.153548782264944603e-04,-3.175064904108582165e-07,1.930810228444302626e-05,4.511611067622806965e-06,9.106987836690975314e-06,-3.552330478727905761e-04,1.603633610504248812e-08,-9.256923310584947047e-05,-4.272301252403428574e-08,-5.981000027162443899e+01
9.498901763245651790e-07,-4.381582887069292691e-05,-1.384675039151496593e-07,-1.479448492654463089e-06,3.681787122916575929e-05,4.101468429477531094e-06,-9.080622370718576563e-06,-1.545699895614270166e-07,1.176147813584803618e-08,-4.574982078565179577e-01
7.161200503576731142e-07,-5.408517914082136305e-06,-9.896155271274188125e-08,2.514240058316371721e-06,-7.648286374390113061e-08,-2.066070927410111350e-05,1.129693486710052476e-05,-3.569622799850221815e-08,-1.008451200894144127e-09,1.373678255656101577e+01
1.126629263377531158e-06,3.287538640969293191e-05,-1.045288145798547305e-08,6.829038566824367719e-06,4.412862291167319748e-07,2.440413420392797915e-06,-1.288106202164411688e-06,-1.783892635776352818e-03,-3.972727382624992362e-12,-2.331303809769034530e+01
-8.444101485358790999e-04,2.398227735925827609e-08,4.457929031670491887e-06,-2.885554127530826326e-06,-1.252389866026765999e-04,-4.477706730088076585e-07,1.118708782437346687e-06,3.093206168105640773e-04,-4.459110145785235985e-09,4.860554112376944857e+01
-5.800891082219154467e-05,-6.655250704042505649e-08,-7.144057921883929969e-04,1.666122500931219256e-11,4.506517975549911209e-06,1.207675791055779929e-07,3.632127838212885531e-06,8.416944193002112446e-07,-1.473042651854174529e-08,-8.140310877512278998e-01
3.225002817877010278e-06,8.272093587447333022e-05,1.545211418682574419e-07,6.227201729646702549e-07,-1.343451888822186271e-03,2.533455709670858910e-07,-1.413355888755780669e-07,1.204337290811134057e-03,6.526052392531472854e-10,6.631769986574630593e+01
3.896389996567290164e-04,-1.096312273473450113e-07,-1.560487395494416184e-05,-1.671790339771972728e-06,-2.822234134644067549e-06,4.913309479679844112e-06,-1.129768543055357514e-06,5.931440335779518402e-03,2.755474017138499280e-11,2.695334456655957389e+00
-1.731806517957460369e-05,1.267066608996777474e-06,-4.398040071069906747e-06,-1.123866749113686781e-06,-2.353885757558716663e-04,-8.011316013482117095e-09,-8.642243971038828810e-07,-9.155339337360094147e-05,9.560408341185782973e-10,-5.235195648634826426e+01
2.536371889210334643e-04,5.284725036113269653e-07,-6.360204046961412893e-05,1.774087825344073288e-05,1.599076312778832513e-06,-7.232835754303119273e-04,-2.624036829122414441e-07,-4.485950982080391778e-04,-1.063591997596833465e-08,-9.546903946718013856e+01
