-9.276675343951118550e-06,3.494069944619499948e-06,1.305695759860438958e-06,-4.863103635491976203e-05,1.139881667792441223e-05,-1.153906042473806808e-08,-1.294173110313768644e-06,-7.300924602173726394e-06,-1.139226412126730914e-05,9.853590264036127044e-06,1.459251014887157362e-05,2.829113375285289240e-06,-2.817557867331886227e-06,1.375851177645353279e-05,1.564918962008029371e-05,-1.543661388791907460e-05,7.880136955076835694e-06,-5.879139652456306406e-06,-7.305582322101073074e-07,-6.022128812002396493e-06,-5.736670462563483863e-07,2.227954867895303093e-07,-3.118393285456966913e-05,8.038745121060836756e-06,3.477946084801940375e-06,6.772330063731732114e-06,-5.443096243943155576e-06,1.820288457314964581e-05,-8.304888665374442517e-06,-2.535983329693444795e-05
-1.989319271747497131e-05,2.841051068021268100e-07,5.881843026361601083e-06,-6.668656867603968919e-06,-1.141606654829424490e-05,-3.105396022292541931e-05,1.744619367180207577e-06,-3.321122691925704200e-06,-7.479936779106892869e-06,-1.361823690795814637e-05,4.821485816951514170e-06,4.376344383892600450e-06,3.246105741138985087e-06,1.629091243167799148e-05,-1.035552858638066501e-06,-2.094576480394940595e-06,1.341498982205376205e-05,-2.946742918609197245e-06,4.305838728412306641e-07,-1.134199356079180845e-05,-1.302759031264709761e-05,1.760360233298888290e-05,-2.193678914182541759e-06,1.129308977214409818e-05,-1.866248151412790166e-06,-7.223185533207385507e-06,-6.888877693814362560e-06,1.767974630907841118e-05,-1.862757403479303015e-05,-1.117761309124497260e-05
-2.700633015207382675e-05,-1.936942748307976452e-05,-2.012290098601709148e-05,-5.316609716141600339e-06,7.603825028948013772e-07,-3.616357082692838148e-05,-2.682765107052268580e-05,-7.308080217961324887e-06,2.158321753074730090e-05,-1.939237224291461001e-06,6.378406006697623504e-08,2.288562474563013256e-05,-1.402216178237655002e-05,-1.430436765709465476e-05,3.027538415289287348e-05,-1.836991639720279425e-05,1.886374000307041286e-05,-1.870679744169387893e-05,3.905822548771818958e-06,-3.547142272205286396e-05,-2.173973301622421767e-07,2.849408463244719762e-06,3.126353693265390552e-05,2.833962778614220190e-06,-3.047683296632300299e-05,-4.265042962392637489e-06,1.441758370145492011e-05,-1.364006245602301244e-05,1.036821997639614433e-05,-3.912484983097901414e-07
-1.378626311065169090e-05,-7.856247675032235684e-08,3.019047609687235218e-05,-2.536974204421070877e-05,5.938409231882531144e-06,-1.462020721113433118e-05,-1.896030540853029059e-06,-2.849329396022190454e-06,-2.326931013964655270e-05,8.848247028945853915e-07,4.605106157203699946e-06,3.405166666562030945e-06,-1.994726232141263932e-06,2.000975395391907096e-06,1.431269513449465339e-06,4.928451959107546896e-08,-6.059135463017615295e-05,4.258025131497908346e-06,1.788928385708283958e-06,-2.369350245742705976e-06,-1.069164144444852961e-05,-1.754891570860281645e-07,-3.608240245441169286e-05,1.069458452323316184e-05,1.028393154916466480e-06,2.351450015262693784e-05,1.268952958102205913e-05,8.806001972627750946e-07,-7.624220473108139824e-10,2.963728624752584085e-04
-1.932049151679549529e-06,-2.202388584415675028e-06,2.963172309783059608e-06,9.406206241749582569e-07,6.844486302382633514e-07,5.165949091436301004e-06,5.879947126844304737e-07,2.530887988646472943e-07,2.171599315234129482e-06,-1.278184355619451920e-06,2.261716357569690881e-06,-1.776342523855945246e-06,1.661849655437509494e-09,-5.647450297959992568e-07,-4.454175594423107718e-07,8.299494719007142094e-06,7.660544692600226696e-07,-3.014060210104249796e-06,-6.178768545790480754e-07,-1.456261546875869113e-06,-2.320800053042899211e-06,-2.463605625542096832e-06,6.657201042825621063e-09,-7.049669978105977131e-06,4.286063395709575454e-08,6.371671038165662378e-07,6.463241231512769417e-08,2.430409008037717230e-06,-1.008705018916998469e-06,2.891440748326434609e-06
1.165908344710577884e-05,4.191911546405438888e-06,1.362619459748241307e-05,7.788281349086503702e-06,-1.276548504683701442e-05,-2.833216513543085668e-06,3.169815387501715294e-05,3.148961745539450593e-06,7.916163264729886016e-06,-7.139724985700383501e-06,8.508777032831325008e-06,3.033776710242276492e-06,-1.016670092451831552e-05,2.641553321102772429e-07,-2.835371497796186236e-06,-5.637159875669440027e-06,1.779723844603651978e-06,-1.016482911806303241e-05,8.673588645973221006e-06,-1.291422495700710381e-05,-9.778488903707774522e-06,4.640859968521257673e-06,-6.258177242337033027e-07,2.935915342517687486e-05,-1.307091209245745613e-05,9.380452950430047117e-06,9.230938868096190717e-06,-4.088932185308154763e-05,-2.183210351711864782e-07,-1.906148632984647803e-04
5.764364225503802024e-06,2.342232628719478237e-06,1.777783978139377001e-06,-1.544954080686328884e-06,-5.444960275206444335e-06,2.631927831138655274e-07,6.866749923359157832e-06,6.314452789202678691e-07,5.333997186954860077e-06,-1.188060118618371391e-05,3.562698469241205924e-08,1.286238793263588768e-05,3.843269356592387020e-07,-9.280442201582875765e-06,-4.344694376981369641e-07,2.967537908109990448e-06,5.646742006450218965e-06,5.892657956020144015e-07,-7.610203687113194022e-06,4.317349086933439324e-06,-5.258857366077215831e-06,6.046324213312573035e-07,-4.861842675280333693e-06,1.056165445841359369e-06,4.448192443530206035e-06,6.559068253895849942e-07,-7.953794064621227985e-06,-8.677416380442289099e-07,-1.606839854818791281e-09,6.513696254416100192e-05
-5.764019718763111732e-08,1.378674173048643327e-05,1.130591181795592371e-05,8.664920005046233045e-06,6.965996075362126216e-06,5.619998990771089158e-06,-6.750623905483557562e-06,-7.464324653976889249e-06,9.630138002348832650e-06,-2.944655021883975597e-06,1.330445520331416502e-05,4.509107389556363606e-06,1.149097636167164872e-05,2.002676150411432272e-06,-7.660086067168440235e-09,1.056484767756137457e-05,-1.263279369222215766e-06,5.753448755335094475e-06,-1.176419275849032296e-05,-7.930499922282224665e-06,1.781929763624008652e-06,-1.483286125201932881e-05,8.952617651910572516e-06,2.118032240866148728e-06,8.642851889909046077e-06,-5.215610719943060341e-06,3.006702382530274715e-06,1.461405247150633813e-05,3.324491787510187469e-09,-2.520806445049450311e-04
-1.734021695898834887e-05,1.683634680514248144e-05,-4.560562356182601919e-06,8.320604968550642384e-06,1.411812832461941341e-05,1.672428263194770313e-05,-6.855441763061168086e-06,-9.660803246324381458e-06,-3.132592868518039682e-06,8.721241163068078537e-06,-1.246084356919916133e-05,-6.621255009177076247e-07,-5.405513662894930084e-05,3.928524694309493386e-05,4.797480715445697223e-05,8.043644857329353446e-06,-6.564673585441969312e-06,-1.093796420649131902e-05,-1.423149476246839088e-05,-5.926894703635484678e-06,-1.473291006582359638e-06,-2.765663759288278158e-05,-4.364422894161002670e-06,1.315910857583982704e-06,-4.445434304822100619e-05,1.568612286623758658e-06,-1.228059066778195786e-05,-2.232879770884436070e-05,1.568581264012379665e-07,-9.006511841773775931e-05
-8.190853728586506442e-07,7.320731076948624094e-06,-1.302817253926469236e-06,-9.793746384968652954e-06,1.453961159413086745e-08,5.593484200453783340e-05,4.666944846390296261e-06,6.718945359359337696e-07,3.955117576944623488e-07,2.686743900668818534e-06,-6.075251606709430841e-06,-4.938290757242655289e-07,-1.459659107432603881e-05,-2.027141689159134162e-06,2.336318789418257511e-06,8.767544216039326686e-06,-3.613389115151930187e-06,-8.470711452913292622e-06,-5.242741724461189913e-06,-4.954366915204446542e-06,-4.622389447691427423e-06,1.033802652626717350e-05,3.438356889005245440e-06,4.463650431943002209e-06,3.117673092716347659e-06,-3.663950858406766634e-06,-5.836422691121782984e-06,4.330020639030861704e-06,-1.527636094413727107e-07,-1.509038396928627155e-04
-2.799363009828977216e-05,4.864227804012550920e-06,-4.599960994543567561e-05,-3.769734318723289929e-05,-2.882548733827513917e-06,-7.088317864908574941e-06,1.651264894723911982e-05,-5.148062974973820694e-06,-3.361604886503251782e-06,1.146962556449568817e-05,6.471634533272818957e-07,3.114152343330828833e-07,1.409532316303685930e-05,2.560440915503697668e-05,-1.385066716135361847e-06,3.541207265640964214e-05,3.406122283353003872e-07,2.419674053282666265e-05,-6.964994357184835278e-06,3.205281437081314592e-05,7.616551698195415972e-07,-3.176781597464243710e-05,3.730638412636834432e-06,-3.626148264878972669e-05,-5.543314780716178824e-06,1.943551307722262100e-05,1.363140597577802927e-08,8.886021010356626184e-06,-1.652869221073178071e-06,-6.533703120422177085e-05
1.219897128841423092e-05,8.178192753032575377e-06,4.564753136075702878e-06,-5.709990007096289254e-06,2.411000003692464669e-06,5.246195950633698150e-06,-9.301700106154042668e-06,1.703678518705756842e-06,6.803039703360589176e-06,3.024237178867993374e-06,-5.601841058157846237e-07,-2.189953530945633921e-06,-1.097085250519239151e-06,-9.474037554571148294e-06,4.148880864460098803e-07,-4.507523197274601956e-07,-5.073224979893540202e-06,-1.476893399931094065e-06,-7.523926024545679414e-06,5.771565176116978455e-06,1.221051379803486419e-07,-6.684838560074310247e-06,4.693065372839836737e-06,8.846482914146615035e-07,1.532089521004561137e-05,2.723431646033290795e-06,4.879665800083924531e-06,-1.081638471590233577e-06,8.052850751506364534e-07,-1.665842671089399091e-05
1.211394638604727851e-05,-7.236927797866338993e-07,-3.337719067119136263e-05,-1.577317145136455950e-05,-5.586639793643658477e-06,2.147168968858616421e-05,1.726261651616990453e-06,-1.532285708437162473e-05,-1.046412314633023380e-05,-2.396188113270755524e-05,1.247172933348163856e-06,1.901899552366916990e-05,-2.798360205558423545e-06,2.372625992467531232e-05,1.805954269423195121e-05,6.979995296903046564e-07,2.118181284117553201e-05,1.732200409505828143e-05,2.292737767797357404e-05,3.410487633973296051e-06,1.587613526968767837e-05,1.010599955240255194e-05,-9.211530527607143169e-06,3.425529045756736561e-06,7.960275985041584515e-06,-1.899449036216194124e-06,4.871100344688938206e-05,-1.207904257464952387e-05,-1.112208445209601600e-10,5.248644047337896633e-04
-3.413524852064887761e-06,-1.619702916415698444e-05,-1.934627454593847444e-05,-5.945763905000521490e-06,-7.818068306919028805e-06,6.695419555489112594e-06,2.684679127262544306e-06,-7.060942652942365395e-06,8.068701861318022976e-06,1.048665249728852807e-05,-1.185231731715802250e-05,4.917338562944619861e-07,-1.067120711282114589e-05,3.239709957362197317e-06,1.249510458920973768e-05,-8.117852534615809472e-07,7.121399293498207831e-06,2.386174649422295353e-05,-2.334122585504621550e-05,-2.380670066819965048e-05,-2.027726815142793121e-05,9.283579941183137327e-06,7.813452801067074016e-06,1.723788156052224386e-06,3.818058930990384605e-06,1.137674182665231252e-05,-1.753058505045295860e-06,2.112781781535037550e-05,1.019021302917213320e-06,4.308779950851837284e-05
1.686286864046308530e-05,4.598995822225365629e-06,-1.666900302387791031e-05,1.732327931228545872e-05,-1.306785178908597320e-05,-2.698728976479713474e-06,-2.624061548762768775e-05,-9.655169605168544385e-06,2.886958734974820227e-06,3.727970604840349239e-05,-1.514461899511684078e-05,-1.331196512202090826e-05,2.363740230315462040e-05,-1.354105493449667221e-05,-1.927582834951019122e-05,-3.991711516100108722e-05,-1.067360833397899329e-05,-1.640700686270142810e-07,8.904850815364570663e-07,3.477535673862139560e-05,2.367530313398752561e-06,-3.403030642143579125e-06,2.083773901896664360e-06,-4.386528279520361689e-05,-2.595028621711985330e-05,2.032014132648620437e-05,-3.462121884132860969e-06,1.997862992073379707e-05,4.194972529855932985e-06,9.177267261022467983e-05
-6.698959734816972668e-05,-3.383363627646214522e-06,-7.272050398082330828e-06,2.002295881289395144e-05,1.221520802216462090e-05,-2.317681288793126997e-05,6.907971058554024362e-06,2.294525201003631116e-05,1.078702121474035793e-05,6.983328167222499375e-06,2.093517979555640195e-05,3.174093173148405779e-05,-1.635313610828648378e-05,-1.338365106377167360e-05,-3.654142916976005274e-06,2.555749326847640206e-06,-1.177392338962869843e-05,6.201851823868368132e-06,8.981096145008266371e-06,2.142116902324341520e-06,-2.059564916679647742e-06,-2.721350005461773094e-05,-1.273232758827407759e-05,-1.576887326286933333e-05,-2.155292723703919089e-05,-2.167031909088963221e-06,1.114435428180147024e-05,8.049578472750993621e-06,-8.727805754889736764e-07,-2.383021619672239376e-05
-9.303675339663446152e-06,-1.289414549763942867e-06,-1.033552362859944620e-05,-4.521344237034423925e-06,-1.058478866393295293e-07,-8.006058387688480473e-06,1.286156483322664615e-05,4.731303157034706578e-06,3.553206233869024485e-05,3.605290579153482206e-05,-1.854357063050741697e-06,3.095930533262975762e-05,2.438221533494598506e-06,2.496084114484728040e-06,1.111314182768901192e-06,-1.532646141247236647e-05,-3.783646161839487710e-06,7.579090969385389563e-06,-5.316544958296942089e-07,1.648985853598807443e-05,-3.168893128461748060e-06,1.019669955361782805e-05,-4.239077776796335118e-06,2.620935937528202117e-06,2.940117395148838637e-06,-2.097600396534566428e-05,-1.896474321227028433e-05,-1.806421501081868425e-05,1.335746928744455729e-06,-3.606146857189446663e-05
1.315768182465451333e-06,-7.157668319254507195e-06,2.487888600187947968e-05,3.278272930773815287e-06,9.483395514198440493e-07,7.853958987275915990e-06,-2.623071096310292416e-06,9.471540410385486091e-06,-4.678681034234836718e-06,-1.274841630336091158e-05,1.194175957296650022e-05,2.926268353309065845e-05,-1.083251524017763325e-06,1.018016338762409284e-06,-1.033468939127501770e-05,6.477945084078596944e-06,1.485245858406235708e-05,8.944591320098859487e-06,1.418938863469401909e-05,-1.121533797230955931e-05,-2.683130142000686260e-08,-9.106766950649397674e-06,1.081548999154291577e-05,9.255080390897486392e-06,1.651572559931473745e-06,-1.693930631712616059e-06,-2.423339310437807941e-05,7.809913386071311313e-07,-1.782244033286088533e-05,-5.781269847861357565e-06
-5.556949475175790790e-06,1.451806672699503561e-05,1.137430970954909806e-06,1.717525440046008657e-05,-2.507188457535988745e-06,1.845623830641124746e-06,1.796743396083321664e-05,5.374738656208648792e-07,-1.225746617401362142e-05,-2.412636463461695019e-06,2.069573046492652475e-06,5.850121106907195387e-06,1.184530656052442646e-06,-5.123106646684733060e-07,-1.436604002928009645e-05,1.251236470339444568e-05,-1.583342125174356406e-07,-6.720636514488142308e-06,-7.547287110017857756e-06,-2.357237180152405412e-07,-3.629663618360765421e-06,4.383371966268702634e-10,-3.534435359838861233e-05,-1.772721757316191710e-06,2.409995378125232732e-06,2.173542604403517592e-06,1.399657984959857449e-05,1.066584468918317111e-05,7.153494438464859081e-10,-3.790648557279882808e-04
-1.335842552212443826e-07,8.640914069762487535e-05,5.163178083003801672e-06,-1.439848048207887953e-05,-2.005285387466152942e-05,-8.969090587616182242e-07,1.276062655927376841e-05,-2.245749748163506824e-05,2.554707983956108477e-06,1.001579616510941236e-05,-6.861717383640451715e-06,-3.336780342443891703e-05,1.799968475361794259e-06,3.512136394205072921e-06,5.233669010761887073e-06,5.685857312812793550e-06,8.208365376828867120e-05,-1.486010505494473073e-05,5.567247875164819860e-06,7.705613618633718313e-06,3.027911741329788781e-05,-1.222001028558402311e-05,-8.552610167429166397e-07,-1.458236714693926845e-05,-2.609197823801121668e-05,-9.982944956099487177e-07,-2.465950302830147887e-06,1.457337874245692627e-05,2.142500249858055153e-06,-4.264223705926439926e-05
9.593622138628443794e-06,-2.197637493344238731e-06,-7.530306169666017141e-05,-1.421064998741284736e-05,-4.359183304272136561e-06,2.636077148328476241e-05,5.578104004425458429e-06,9.592063303308023958e-06,4.970197320324074689e-06,-1.113897388157358616e-05,1.382158549817912170e-05,-1.122447869703586589e-05,-9.060147828097391999e-06,6.367029737633142692e-06,-1.392300512371457858e-05,5.470271874964342136e-06,7.474807060157090497e-06,-2.054320071836283201e-05,5.476706269829861249e-05,-2.980701944906076440e-05,-3.646535666316665618e-05,-5.462111130899254506e-05,7.331992688106074791e-06,1.136442574923259790e-05,6.480208858659372761e-06,2.991606547687866230e-05,1.954124376479403254e-06,-1.783111452397098532e-06,-4.410515980487733075e-05,-2.192138738369382031e-05
-1.719783994883629847e-06,-7.167541393387729439e-06,4.826292095877712987e-06,-1.199331075699665672e-05,-4.886280626434017079e-06,-7.510206339343837695e-06,-6.753089082304115084e-06,-1.123223977445501368e-06,7.234049004689172260e-06,4.005132821186100273e-06,1.396361885337720930e-07,3.117738427579351453e-07,6.883888637997572335e-06,4.343376696356426334e-06,5.466363646838327491e-06,-2.029471286517335740e-05,4.380139706176155362e-06,-1.228471347257339477e-05,-6.036908546280447570e-08,-2.649512620917183198e-06,7.442706986391599053e-06,-8.235753277728284660e-06,-2.083909517568648977e-06,2.622003800808183642e-05,1.176590536197966702e-06,-1.603163633052154214e-05,-3.728203413420982719e-06,4.079271834195732540e-06,-2.354974345192137469e-07,1.775274268027226022e-05
-9.681545102949899059e-06,2.780318050294809206e-07,-8.230525693292813170e-05,7.442642794866132399e-06,-5.479219719806901424e-06,5.626400753975712195e-06,-3.159053893621986770e-06,-2.008371929632382132e-07,-7.019398054949246118e-07,-4.339117153809128602e-06,-7.332990285572475842e-06,1.508388152356249564e-05,-4.345664084117845479e-06,4.380416927417393817e-06,1.481896337314032449e-05,-2.577890774317502372e-07,-4.244183110711429633e-06,-3.613736528035068187e-05,2.014862191156500492e-06,5.304360554667612989e-06,-8.994021779613271448e-06,4.213047791791163055e-06,-1.123904088898438482e-06,8.577378242732678295e-06,-5.748147792576553101e-06,-3.705893624022629878e-06,1.034258791036448443e-07,-2.463356568028059825e-05,7.365089201892621753e-08,-1.249648905219846360e-04
-3.867581111199576018e-06,5.433414407321177401e-05,1.052414065855678235e-05,9.212276214000817161e-07,3.887837223127025101e-05,4.277602013953789511e-06,-1.818785732747852138e-06,-9.968480038027643922e-06,1.611977457466881013e-06,-3.728297056711773669e-05,5.057042629970378288e-06,-2.116130243490856511e-06,1.182515535136620052e-05,-5.054628825262990725e-06,7.044697460241827240e-07,-2.483140828635264328e-05,6.012175264022441145e-06,8.667727600438642995e-06,2.688955875383115341e-05,-1.373348392169401253e-05,1.251662122241122672e-05,2.948240758684879751e-08,-3.106317505997506326e-06,8.359414894318258218e-06,2.611509250943531976e-05,8.801985281873679796e-06,4.275366985491742181e-06,7.064136981904523666e-06,-1.120605076648122697e-07,1.720795398116307560e-04
-1.014693163993685348e-05,-1.042463213735050573e-06,5.527067423741982097e-07,-2.092584021890432332e-05,-1.505319482259833454e-06,2.612456526205199524e-05,-9.205691598073526934e-07,1.242915122776605971e-06,4.783750487367865890e-07,1.594516749571859021e-07,2.178577317083659807e-05,8.797274688404496467e-06,-2.461210280379420531e-07,1.472363279122806022e-05,1.334896072049910594e-05,-1.425562861150439717e-05,6.136403326233885085e-06,-6.339318339023876535e-07,1.606183681555514066e-05,-2.295006910329497427e-06,-5.153456577612602400e-06,2.446348056427069550e-05,-4.567875826090145591e-06,-1.014317686946050342e-05,8.123999434489750975e-06,-4.776635392778050362e-06,3.161333353143457107e-05,2.678242809517217063e-07,-1.725494938538029710e-06,-3.398672987241811510e-06
8.765508396613244803e-06,-2.783641302726281815e-05,-1.088669175555590978e-07,-7.787642459921860255e-05,-5.184000176970471530e-06,3.219968020923916557e-06,1.672244890546906993e-06,4.037490134606702138e-05,-2.307108616580846729e-06,1.477176317437043990e-05,8.664393234611206504e-06,1.196842862813083200e-06,-2.342298242419846386e-05,9.153798504092940693e-06,-6.235251946112826698e-06,-5.783707493433078805e-07,2.016514917508596414e-05,-8.256190124370088178e-06,1.760299411726764675e-05,-3.489637181516046456e-06,-1.702174844495604904e-06,1.357520152455020728e-05,-2.541400355375870497e-06,9.904971440968153347e-07,3.939873888033289901e-05,-5.260802227583117198e-06,-1.108061399650616254e-06,-1.630635756409096887e-05,2.733122925900717404e-05,-1.005668042510084375e-06
3.403335784115563550e-06,-3.060383089332026242e-06,-5.449907273665130640e-08,-5.362672293584245736e-06,2.253365609720716162e-06,1.606744875342991732e-05,-1.074922232276372960e-05,-1.378564008904424629e-06,2.653807675198192561e-05,-8.544819216300616388e-07,2.435258193092119225e-05,-8.478474997244264872e-06,3.442437427544983741e-06,2.301075939942089468e-06,4.115577950659958825e-06,1.250198575130699014e-06,1.850525674236061801e-06,1.327305978488493496e-05,3.488535771584355313e-06,-2.167613342357739408e-06,-5.209225671945537459e-06,8.808396507405275993e-07,2.447886523519262434e-05,4.942594352733121164e-06,-1.827453542017579222e-06,3.129304989611727660e-06,-2.149213565111349761e-06,-1.105131617565430192e-05,8.245215644234998973e-06,-1.734230286807479067e-06
-1.348164347324402623e-06,4.655220385648778597e-06,6.184293581878422007e-06,-1.218340219326895362e-06,-5.274045712689666551e-06,-1.288385297617473707e-05,-1.028851982526114795e-05,1.996058408689407888e-06,-3.648522120456752429e-06,1.354544117683349251e-05,-3.705434441122055354e-06,8.929511551884106613e-06,-4.157117001909072312e-07,6.051772782350009227e-06,-1.281816405651983555e-05,6.683953865458907328e-08,1.011795352242002512e-05,3.766159256678618284e-06,6.509796512493588087e-06,-1.916944906291742996e-06,2.840261145142404471e-07,-2.159466178065792941e-05,-2.792153203341580750e-06,2.951818418973447906e-06,5.649605848427100604e-07,-3.654529854076760662e-06,-1.458656890775232047e-05,3.250134117791825463e-06,-2.518861140155065591e-09,5.103387161988801957e-04
1.634800877905798257e-05,4.088804852435142878e-09,1.802023161337300543e-05,3.148147551762094171e-07,-1.186146182088276488e-05,5.694023693217354059e-06,-1.091059579376165041e-06,8.384232033406678229e-05,-3.900310819122497186e-06,1.431293511723230219e-06,3.197244074626891694e-06,-1.026460398082208527e-07,-1.606804005684272639e-05,-1.178844761843379036e-05,2.061586621842267061e-06,8.076669849186274722e-06,8.453315363291232541e-07,-1.670281074898226219e-06,1.117711628643407314e-05,-3.774626175999185065e-06,1.513431437385550755e-06,1.970422653255325085e-05,1.260106643039657397e-05,-1.522916494914236214e-05,-2.042791037370701263e-07,5.642165190775453680e-07,-4.813870306529717727e-06,-7.853558080951393388e-06,6.854444513189750599e-06,9.256608970200967625e-06
-2.160273164860892722e-05,-2.898952772624167884e-06,9.459442075759178547e-06,1.880615373970087841e-07,-1.615340096879699515e-04,1.188031346271208399e-05,-4.768542613494130026e-05,5.557873737405608180e-06,4.096169206835720137e-06,-9.578625739167243643e-06,-2.669984097069646512e-06,1.774196769824199187e-06,2.152684836584000626e-06,1.763100785624340758e-05,1.127334355385752434e-05,-8.532667845032938350e-06,-3.114082216345389796e-05,8.609039984131970549e-07,4.131682298459029734e-07,-2.082677040844115385e-05,-1.000392820526606722e-05,-2.585093283946070410e-05,1.973147876336474661e-08,1.307166986004256602e-05,5.053303394685845750e-06,-1.076062134171437166e-06,-1.864064979585269556e-05,-1.138769775355465162e-05,-2.557150338281494784e-06,-9.023314129824008448e-06
