9.988334273302251631e+01,-5.301693045210199529e+01,-9.586355358347960021e+01,-8.882636842005574351e+01,-1.124591424571944054e-01,9.912973248567796247e+01,-9.698080621657406653e+01,9.913736484884040578e+01,9.994129017890364253e+01,-9.997872337263727616e+01,-4.531699169550154949e+01,-9.933434895402220377e+01,9.972498608218599259e+01,-6.681035662055367652e+01,-9.637410085771689694e+01,-9.457972633747431246e+01,9.992558784159815843e+01,-5.119630206994145993e+01,-7.297113388001932321e+01,-9.890816407719921699e+01,-9.695141806489165504e+01,2.482699294269184875e+01,4.674741731214390406e+00,-9.794628759939261897e+01,8.481858150423833820e+01,-8.057224158380526546e+01,9.779311797813905116e+01,6.080237373849855231e+01,-9.979777694553091294e+01,-9.820360599575388960e+01
-5.875126758055369436e+01,-6.662149321208082142e+01,-1.253623165864177480e+01,-3.738882874628789210e+01,-8.512643353055258899e+01,-2.435842118062733874e+01,-6.040143771068808576e+01,-6.515287588739482771e+01,-4.635862187334572582e+01,-7.387776933809790592e+01,-8.384968462033427272e+01,-5.319794562026047657e+01,7.110275366529697294e+01,-8.048442548828968768e+01,-3.908911718864982277e+01,5.302224148749445476e+00,-7.073127089267251222e+01,-6.132686899120121637e+01,-6.477604035941973848e+01,2.109588668206506412e+01,-7.355616547018803431e+01,4.982358700937737694e+01,-8.705881275151560317e+01,-6.577671716875239838e+01,-5.825303737019393679e+01,-8.708564364584196937e+01,-7.930103216638713093e+01,-4.003216460211137928e+01,-8.395591529936908159e+01,9.739579495425273592e+01
-8.849471556423824836e+01,8.669540488017428714e+00,-5.046034812240183953e+01,-8.555871582579726464e+01,-2.466391791797358479e+01,-8.620961594519772575e+01,-2.123682741343832703e+01,-2.026905036576409813e+01,-3.400472958274920643e+01,8.172431991564549492e+01,-1.654732251876090032e+01,3.584315583042715758e+01,-4.908519827314101036e+01,-7.612365325809656724e+01,-2.171779211348336958e+01,-3.281831902557159708e+01,-1.741984285762781681e+01,-3.543541017092900347e+01,-1.739896141673417418e+01,-3.242612809587340195e+01,-9.147412377623176383e+01,-3.403448072972592797e+01,8.018872300889282201e+01,-4.953802964119695673e+01,-7.376733521212632638e+01,-4.817908446199831474e+01,-4.345916576002548481e+01,-7.727473854438454737e+01,-4.080747202599714996e+01,7.701801420733781356e+01
-3.866752871264268521e+01,1.280736615073891471e+01,2.321004989388229234e+01,-6.878507000366639090e+01,-5.286246728808293938e+01,-7.424377858239033401e+01,-4.877242020365831365e+01,-7.599296014951384848e+01,-1.070829412875379916e+01,-1.781430903124146425e+00,-4.801980119855297602e+01,-2.548654765930524491e+01,-6.710421470295587199e+01,2.452009940688711254e+00,-4.124546577808222025e+01,-7.848836769213193065e+01,4.839847837606815517e+01,-9.253983227740002349e+01,-8.880941062495663729e+00,-2.340364392042448571e+01,-8.566861102884702461e+01,2.360480432690829034e+01,-6.056142331974456283e+01,-6.498039812963830286e+01,-1.722170240590092760e+01,-8.917868858706516733e+01,5.103051907963426004e+00,7.191545126160508516e+01,-9.282952019725824755e+01,2.062431599263447879e+00
-7.187620574880057234e+01,-6.135191642618545416e+01,-8.749233381947922794e+01,1.629972793528871478e+01,-3.931178195193943026e+01,5.699515435363100124e+00,-7.571692657093632306e+01,-2.428034423821856080e+00,-8.879325010705117904e+01,2.442451521204617393e+00,-4.724535530847411735e+01,9.199733113239144444e+00,-6.395449680759509192e+01,-6.155545647552735744e+01,-5.362942048830661435e+01,-2.331947807890111690e+01,-3.513259934424493736e+01,-1.908113521435953785e+01,-3.730068282661434864e+01,-1.394534877092088010e+01,-3.692657152514532015e+01,-1.541722943855443617e+01,-8.566188648911904124e+01,-3.420139232205036706e+01,1.262455391228826329e+01,-4.772823716825753593e+01,-7.203317535484542589e+01,-5.207872206574190699e+01,-2.826563019309879365e+01,7.505566236178702866e+01
-6.144506979222721554e+01,-8.294134348061575679e+01,3.156713129152250730e+01,-4.054634630896831027e+01,-7.327518070758674185e+01,-8.862412161866599547e+01,-2.883921512479222926e+01,-8.577211850793908354e+01,2.309288571719912397e+01,-5.215874933658991353e+00,3.935579988830113507e+01,-3.914248645341143629e+01,-7.389560642426461712e+00,-6.225183849633644684e+00,-8.516052725666317258e+01,2.514388462787844247e+01,-8.701080622737541148e+01,-2.532775199466138005e+01,-2.422039944479638507e+01,-3.125768982221638481e+01,-3.953533137517223395e+01,-8.594991756910661707e+01,2.242016361839140615e+01,-2.284925758663899131e+01,-8.977923272416354905e+01,-2.277225892143790276e+01,-8.511695009302655990e+01,2.679186665120007405e+01,-9.899171981186606217e+01,5.430699154774435300e+01
-3.849707360067948514e+01,1.072930521403108628e+01,-6.099628566047017131e+01,5.129443986621086538e+01,-8.212170716790042491e+01,-2.743830585571195968e+01,-7.548637575950294831e+01,-4.678963553418249433e+01,-7.463309202222197314e+01,-3.825396715075283538e+01,-8.016712301716115974e+01,-6.734409454422194585e+01,6.913872153208655114e+00,-5.354031915059947977e+01,-6.768581158681979559e+01,-5.708208636292660287e+01,-6.814398154796704432e+01,-3.238355123202768482e+01,-7.878562024360559235e+01,-4.388202436833474707e+01,-8.258248296443413494e+01,3.264674449475253937e+01,-9.814133936455621665e+01,-5.559854920390318966e+01,-6.787869975100514353e+01,-5.673949386515795368e+01,-8.629337445795333394e+01,-3.796440884944628635e+01,-8.020591695095245655e+01,4.526368839510588771e+01
-9.438310550008296218e+01,-1.053185995356890814e+01,-3.825252842031905942e+01,-9.513078124377273070e+00,2.628774291229756699e+00,-7.829413933653069080e+01,-4.030387140256043921e+01,1.206109839650489235e+01,-5.423411437604588770e+01,-7.044653580173886098e+01,-7.962683272038937332e+01,-3.864764051209418483e+01,8.281632488712443063e+00,-2.955226896719745611e+01,-8.848366085726779318e+01,7.576419516959845168e+00,-5.695797292359772257e+01,6.816506089996116202e+01,-7.691950989567301633e+01,-7.298283328539029924e+01,-5.098438898884417370e+01,-8.064296637574636861e+01,-2.804521181447150724e+01,-9.776244655228875047e+01,2.937847307946270803e-01,-2.188315407062236062e+01,-3.285561608610038320e+00,-8.905802255954500879e+01,-1.203381666160790076e+01,7.688785486609864961e+01
-7.802789866668109653e+01,-4.286553380193974760e+01,-7.938368807429718288e+01,-4.038518500093234564e+01,-7.898536907451497768e+01,7.458585500755060593e+01,-2.556634312762506411e+01,-2.994176942608130432e+01,-2.066811597727916805e+01,-8.360553120297346652e+01,-3.000417946216971643e+01,-2.045801375115336640e+01,-8.641154625298675285e+01,2.068581789681896055e+01,-7.246110025378558817e+01,5.018459444775506029e+01,3.880618731366058682e+01,-3.941856551727574498e+01,-2.346153642523095328e+00,-2.673774558707153659e+01,-8.370961955742868099e+01,-3.268795233377156251e+01,-8.262742519930803553e+01,-3.258630615678575282e+01,-8.421035556278533818e+01,-5.725021319466424785e+01,-9.011691614431092034e+01,-1.311101521912817702e+01,-8.739750791655973217e+01,4.084791478497076866e+01
-8.095112540944538182e+01,2.954091504353370823e+01,-6.681100385312669232e+01,-5.853562020501176733e+01,-7.906894613518159076e+01,-4.851497522452643096e+01,7.442833436701494065e+01,-8.969500094705936988e+01,-1.922715449104881458e+01,-9.163342588774526121e+01,-7.610186068080452060e+01,-4.462843559558881879e+01,-8.721991210214147827e+01,-1.680440463830179354e+01,-4.381429312580014823e+01,-7.707260718630413976e+01,-4.409956538727425368e+01,-4.562721459993769102e+00,-9.970505155262735286e+00,-9.234713011364722490e+01,-9.814502251576645619e+01,-1.405652200043896727e+01,-3.559362316277408667e+01,-1.712476474173661956e+01,-1.163313718536545593e+01,-8.561098061422846683e+00,-8.724664523991404508e+01,-7.827038049482283100e+00,-3.869196095794292489e+01,1.433866525753275312e+01
-5.807063854959487514e+00,-3.962534880602672160e+01,7.949824661276198867e+01,-7.329265755289125650e+01,-5.420546333501531677e+01,-2.948141226445774521e+01,-6.530532948968426865e+01,-6.041957130070845494e+01,-2.418559001074844161e+01,-8.419060073388266119e+01,-3.771068744652487936e+01,-8.026652123949808981e+01,-4.824232288388504486e+01,-5.016141205285474314e+01,-7.277474112153522867e+01,-5.662142216743409051e+01,-6.946162683474379662e+01,-8.179360580152338400e+01,-3.944675429865561256e+01,1.899265050691463230e+00,-8.711729023124058813e+01,1.479999358909189588e+01,-1.854013390207758860e+01,-8.920910229418205972e+01,5.822285510255013286e+00,-3.364134711859642124e+01,-2.463336448437171811e+01,-3.861238302782562926e+01,-8.067003356877395959e+01,7.104457113093255316e+01
-8.488623479485628565e+00,-8.826662490565792041e+01,9.956676724155872904e+00,-5.494597359380985324e+01,-6.981392063191847797e+01,-5.488301675422685122e+01,-6.909554092208678355e+01,-2.979112591158627410e+01,-8.425993256168418100e+01,-4.287990324410624510e+01,-8.053602738264051197e+01,-3.744025480455994170e+01,-1.387385959291116322e+01,-6.297406152949696434e+01,-6.259570281828219862e+01,-4.030622544448014111e+01,-7.925014702246502907e+01,-4.017519543856007402e+01,-7.524978403805469895e+01,-4.257830659652857719e+01,-7.444250816631766554e+01,-3.896955250078652710e+01,1.170787539909772246e+00,-2.920511050815294141e+01,-8.401993023282230411e+01,-2.906718591627233650e+01,-1.948058975233739076e+01,-3.473233287316938345e+01,-2.530829693922457579e+01,-8.517454125974882118e+01
-7.970200758523361628e+01,-3.921385925582475807e+01,-6.806687944526991885e+00,-5.334283193585810601e+00,-2.311023122046463030e+01,-7.167651562922078767e+01,-8.786359943419171259e+01,1.304278347898593893e+01,-4.219759573772516603e+01,-9.483915883111183120e+01,-8.634122967638478485e+01,-2.086158707816161950e+01,9.219077084902806973e+00,-1.083191119519183410e+01,-1.192520748071395076e+01,7.394341810623983235e+01,-6.909647142063136016e+01,-5.929214935060577574e+01,-6.200745476789625599e+01,-6.767373276684018890e+01,-2.072109731741169725e+01,-8.637523618219722721e+01,-6.743972999154784986e+01,-5.656326762666781605e+01,-8.721713778296842179e+01,-1.800145820757659010e+01,-8.752314471084193315e+01,-1.516034245112776091e+01,-4.812374974230002067e+01,1.651015843470442235e+01
-3.546400284955171145e+01,-8.150655131630973926e+01,-3.545281106503664859e+01,-8.683781873627194159e+01,1.941187890603074351e+01,-7.609837147705754035e+01,-6.762889733145752302e+01,-5.972767052506332419e+01,-3.655531709796407824e+01,-1.490820236509337349e+01,-3.318371420752683321e+00,-8.876463071556707973e+01,3.425139129359884294e+00,-2.240415826697926249e+01,-8.489028815816425322e+01,-2.522427536155282723e+01,-8.516940932092512639e+01,-8.466767351800963581e+01,-2.688338293836908477e+01,-6.306518777915908913e+01,-6.295917735647869762e+01,-5.790306261240309027e+01,-7.112312181328383076e+01,-8.112284886699578124e+01,3.241948759134735525e+01,-9.033299318190572080e+01,-1.445809947172648613e+01,-3.730811485180846176e+01,-1.320184626237268510e+01,-7.206709748010389660e+01
-1.078235159502515472e+01,-9.410869608814250853e+01,2.625028256295715678e+01,-3.809948532159766899e+01,-8.032325874930606346e+01,-3.792511386259555195e+01,-3.751456607337190263e+01,-1.389436928512297165e+01,3.729680973623155893e+01,2.621408960202484906e+01,-4.312082787039517484e+01,8.570126830878433566e+01,-5.782760071554820058e+01,-6.743853944499477393e+01,4.966893597903095525e+01,-4.972319768713681754e+01,-4.743755669596728097e+01,-6.799257140984505554e+01,2.288446400341628362e+01,-7.083888581218427305e+01,-8.863005671419583109e+01,-8.270227272125914908e+00,-8.842992091447368352e+01,-8.751275533538365181e+00,-4.399940809714446033e+01,-8.984467528461735242e+00,-3.849412650080588350e+01,-2.837111603203354804e+01,-8.578336687212396328e+01,-6.212122520052332675e+01
-1.120360575100369260e+01,3.672848693574135837e+01,-3.833097053517310826e+01,-7.027318605339615942e+00,-8.117807034064735205e+01,-3.083246622117648528e+01,2.465573576395281563e+01,-4.811528464859753029e+01,-5.406563584861316940e-01,3.948136142429321183e+01,-3.500458639616367407e+01,-1.434111460271748228e+01,-6.857532730002796484e+01,-8.530183547761983220e+01,-2.957690014893275077e+01,-3.834286470018713544e+01,-7.445958829744792240e+01,-1.911135631531268331e+01,-3.728604010321016915e+01,-7.656419893827184353e+01,-4.499278054157760209e+01,-8.881375801572167461e+01,-3.870749914520064294e+01,7.587397891444911835e+00,-5.005298738397486602e+01,-4.133237358667855688e+01,8.628053038834735844e+01,-6.739357736131768206e+01,-8.891890227099855792e+01,-7.770982169270872930e+00
-2.453967852765833157e+01,-8.517936950029282173e+01,-2.509926234309022419e+01,-4.136222537000322497e+00,-8.865141548843433839e+01,5.866131625470779376e+00,-7.573154565319714493e+01,-5.127659167275525220e+01,-8.568728343986687435e+01,-2.662064004042451870e+01,-3.391013420216562224e+01,-1.923538838993908229e+01,-8.870701183048130645e+01,-4.338274701573713088e+00,-8.892959889706727949e+01,-1.219730530826618597e+01,-8.800902249595748117e+01,-1.196407836859883389e+01,-3.656977634808202282e+01,-6.968389878140588678e+01,-5.638535895837945588e+01,-6.134224413456355762e+01,6.424378453135625477e+01,-3.313409221577840924e+01,-7.641003660586409296e+01,-4.505445027042504336e+01,-7.658857557113671533e+01,-4.596932260748637589e+01,-7.573167501958421610e+01,4.763961862820397641e+01
-1.081413906039604633e+01,-8.801145332207916283e+01,1.201582432795400024e+01,-5.177719762916728286e+01,-7.212500089495055988e+01,-5.110219956324969814e+01,1.490138726033060479e+01,-2.833510730846236569e+01,-2.928830071076196262e+01,-2.525369802189492674e+01,-3.792370328967162862e+01,7.003499506966825550e+00,-5.070713301594769007e+01,-8.373095594665085173e+01,2.965238594560128860e+01,-9.271085101906140835e+01,-2.983426586222392274e+01,-1.954287141106501835e+01,-8.660181205958490125e+01,-1.751117036950962813e+01,-3.070808241540941097e+01,-8.441885110390609270e+01,1.219785517471351888e+00,-1.524021827398706641e+01,3.752878594973931570e+01,-6.163611860025632438e+01,-1.114071368653334559e+01,-9.696820095093984548e+01,-2.195746881155159258e+01,8.594961506875651480e+01
-5.021011516116010398e+01,-6.242098875114959533e+00,9.066830224976212094e+01,-6.049857159863714173e+01,-6.350358788876703642e+01,-8.459897660354857862e+01,-2.919161785482343419e+01,-8.390502349686099137e+01,-8.282351167537355252e+01,-3.278431257409206268e+01,-6.249599771364692202e+01,-7.116676640844960389e+01,-6.737932072401252981e+01,-5.315434893981036168e+01,-5.013532720192582559e+01,-9.034122959343292791e+00,-3.974129915803938928e+00,-6.887609581164670658e+01,-5.321594199693199556e+01,-8.225728941953983053e+01,-1.841572394097399723e+01,3.497848779916094486e+01,-7.532180002408992436e+01,-4.723935971702138659e+01,-8.367859822514853363e+01,2.989601697466942554e+01,-3.885756566988813177e+01,5.846843538798576212e+00,-3.142914927830278060e+01,-6.502113188546252331e+01
-3.562105104041516057e+01,-8.643447807312504949e+01,-2.475484433240587023e+01,-8.752454020037939131e+01,-3.615575913298119559e+01,-8.180871083101111196e+01,-3.259707790295238539e+01,1.591148588307605394e+01,-2.437025542227672759e+01,3.105880648961813506e+01,-7.504708722613288785e+01,-7.679960935081579976e+01,-7.723119656549549461e+01,-1.889308171774657907e+01,-8.337672695220331320e+01,-8.303821343353541806e+01,-7.567323932872409387e+01,-4.651563231746188620e+01,-7.800758035196382423e+01,-8.525596593757165920e+01,5.635137746034111217e+01,-4.615082882202040082e+01,-6.423775692501754975e+01,-7.042726061969489137e+01,-6.513177726646810584e+01,-8.874526389786416303e+01,-3.796347604045706703e+00,-7.755943658448649103e+01,-4.329735557036871541e+01,1.305916306489026368e+01
-7.307780736879580274e+01,5.049525334854235581e+01,-2.903360429374801654e+01,-8.337452133219409234e+01,-3.003704297125125322e+01,-7.922724225618118510e+01,-3.905192165191922271e+01,-4.159360629112978813e+01,-7.908955587564270218e+01,-5.534424556661763717e+01,-6.948748178507676698e+01,-4.835338152836902736e+01,-4.451323029275242504e+01,-5.194531108230965799e+01,-8.359866594335952072e+01,-3.597600724428865249e+01,-1.826564320612483527e+01,-5.668306291186015500e+01,-8.272686094903457388e+01,-3.222878297686017390e+01,8.280791567663337105e+01,-8.806032931153168875e+01,1.324963889239288051e+01,-8.573578153637434696e+01,-2.303574521397689523e+01,3.351643816312629554e+01,-4.503048384862719900e+01,-5.185785376844029315e+01,-8.897455933654428861e+01,-1.310997564435565588e+00
-9.407124427966907376e+01,-5.524264544619720141e+01,-3.512577321301245092e+01,-8.157363741556277148e+01,-8.203790879730235019e+01,-3.445631161488010719e+01,-8.189280629971602821e+01,-2.703806472427066154e+01,-2.888524747864930475e+01,-8.556495198715168726e+01,-8.274493357833380003e+01,3.553219957036717602e+01,-4.004906398888645924e+01,-2.292953980551756388e+01,-8.577740886960714306e+01,-2.304097234280536455e+01,-4.213389688164127733e+01,-9.348296078315496516e+01,-8.082341973393637602e+01,-4.315073087305553656e+01,-7.587605088949231913e+00,-8.850177165142277147e+01,2.022792641691194859e+01,-2.593755453299975855e+01,-8.478705553202379974e+01,-6.946973755425534591e+01,2.438622815361426888e+00,-4.369552277960352171e+01,-8.488327478175457941e+01,2.467994010282568951e+01
-8.489283111216330724e+01,-6.361185181098743868e+01,-7.282805924203736936e+01,-4.590465404517166093e+01,-3.069079392435881459e+01,2.305190225323593012e+01,-8.325651762537262357e+01,-3.076998818777664013e+01,-6.314114581192095699e+01,-6.361995579499689768e+01,-8.204406156369978476e+01,-3.331622933530471897e+01,-8.412520245445612943e+01,-5.507876926095121206e+01,-6.881998555156442876e+01,5.611897927771453709e+01,-4.829968137409073137e+01,-1.981170802844624390e+01,-7.584933058379576210e+01,-2.223100939861573977e+01,-8.599880926007472226e+01,-1.647492796723394903e+01,-8.677857017124030392e+01,-1.002001800102281948e+01,-4.942835043003874773e+01,6.655903473044172358e+01,-7.013821347096930481e+01,-2.512436410560790989e+01,-8.519918643584145457e+01,-1.219156871067648495e+01
-5.148264663531749363e+01,-8.093868621403143493e+01,3.660583472134480587e+01,-6.098425315887558895e+01,-2.802573806638979903e+01,7.282188140598289294e+01,-1.286150046123199786e+01,8.789037960560710872e+01,-2.131181381734823788e+01,3.317375402037954046e+01,-5.637481231098630019e+01,-7.591471820783101521e+01,-4.619440099880435469e+00,-3.110958120664646387e+01,2.481889534075630976e+01,1.790976626431721286e+01,-4.563801435807833684e+01,-8.468904146446638492e+01,-2.291818261044068450e+01,-2.569837472337411555e+01,-1.985371922952287349e+01,-4.952326893680558584e+01,-8.302053556503102527e+01,1.056162348883458613e+01,-1.522092705282897285e+01,-8.753341741872981174e+01,-2.848167034775904938e+01,-8.576610591700254815e+01,-8.677228220068613496e+01,-1.892070073617155401e+01
-3.001181547085425549e+01,-6.043714480206425321e+01,-8.512272674375728343e+01,-6.203033591821469628e+00,-8.091485392024272016e+01,-3.488468821537158249e+01,-9.997089248185339727e+00,8.826522525967924082e+01,-6.423407463606484669e+01,6.015913702953758957e+01,8.881525457366095111e+00,-1.959862190535187665e+01,-3.704560898138980463e+01,1.364432702473736470e+01,-2.696241597427208703e+01,-8.525809898254875918e+01,-2.939603036461429042e+01,-3.320215395433002215e+01,2.135813351729069254e+01,-6.346442613726352278e+01,-6.488772280211222210e+01,-7.469275339101767486e+01,-4.657312848261215521e+01,-5.498530229443078099e+01,-4.935217817049959876e+00,-6.266424930061758403e+01,-6.514198628702868632e+01,-6.117367839147141240e+01,-2.926925994688858168e+01,-2.649532080025399949e+01
-8.436137916984002061e+01,2.783360663710262628e+01,-1.270324343685963697e+01,-7.711459463715058860e+01,-6.236244597250073696e+01,-6.651716738937486184e+01,-5.202106181061739676e+01,-3.506264000545952086e+01,-5.642222369925630687e+01,-3.610548986145533945e+01,-8.143870395573851795e+01,-3.548566669915030758e+01,-1.740908008936693463e+01,-7.868990517996081735e-01,-9.838185551049093647e+00,-3.596550051071723431e+01,-7.557980024164422161e+01,-7.887968716874222252e+01,-4.366103295621621783e+01,-8.622315751751787616e+01,-4.814057708539995417e+01,7.409726298571263214e+01,-6.079491070423852506e+01,-9.820251446814577889e+01,-8.218724202024020542e+01,-2.725913183689574737e+01,-3.402665440461581170e+01,-8.198822766470537715e+01,-7.631213377564641576e+01,-5.907280137158078048e+01
-2.786253296794036416e+01,-8.875772710996210435e+01,-8.304123296580324620e+01,-3.163674846154479781e+01,-2.645319054910956069e+01,5.027182648447202951e+01,-6.395038200079108037e+01,-6.420739616834684682e+01,5.954086916618395975e+01,-8.311137658562884667e+01,3.103264698031491520e+01,-2.113865530316054020e+01,-3.264356265335184304e+01,-4.716300529360323424e+01,-7.526839239812986193e+01,-8.140792068167056073e+01,-3.634930482607300917e+01,-1.955364563053480254e+01,-8.449689850322889129e+01,2.734466154512993796e+01,-6.277515286954771767e+01,-2.913044048383981632e+01,-8.797751950699517920e+01,-1.225119851174866881e+01,-8.846643389642625266e+01,5.235480621864368800e+00,-6.726976729880084349e+01,-6.099142172813876783e+01,-9.284115844125042827e+01,3.593247020280646353e+00
-3.930377841611772993e+01,3.351903343567226301e+00,-7.849733595600190483e+01,4.157332788652459499e+01,-2.160801923582344131e+01,-8.621616700847994252e+01,6.297066818149232859e-02,-2.380168484051728939e+01,8.561838297785055829e+01,-7.122728651641673991e+01,-6.506569803590625156e+01,-6.008433673088343596e+01,3.243399271964293717e+01,-8.869173211188703476e+01,4.764990892582225968e+00,4.604030561727528692e+01,-3.602591919409780985e+01,-9.500978338908510068e+00,-3.362346842632587141e+01,-8.278273064342103282e+01,-4.410791047213043470e+01,7.710140640308424054e+01,-2.653342182863499943e+01,-2.962276395865226064e+01,-2.609677782627614562e+01,-5.320775899934743336e+01,-9.326586758790705289e+01,-2.542211543379618632e+01,-6.339383730131972783e+01,-4.602199677536692946e+01
-8.876197226120440575e+01,-2.156521318409086341e+00,-8.481476033884999310e+01,-2.759144520080696594e+01,-1.724956757822275577e+01,-7.864037071665163126e+01,4.119212549895441811e+01,5.600484779236428778e+01,-9.220197319901068056e+01,-8.830564008858135594e+01,9.604879764814242549e+00,-2.835130183551633820e+01,-8.418050249232413762e+01,-3.154243364703167884e+01,-8.882000230573493127e+01,-9.146664695212578522e-01,-8.880230339626184843e+01,2.117014840101427708e+00,-8.282060226481121390e+01,-4.111420701369738140e+01,-4.073451163397042052e+01,7.552303632063139816e+00,-4.477746819364594444e+01,-7.877853405083013172e+01,-8.334615151039730563e+01,-2.685311095491933742e+01,8.534961913402315759e+01,-6.632690222194153762e+01,-5.577611920812413615e+01,7.376315736239543241e+01
-5.073818475574067577e+01,-7.479170112630094991e+01,-4.797748777880981663e+01,-4.887188803450813168e+01,-5.205159054657291762e+01,-7.189144701577441765e+01,-8.652401321770743436e+01,2.015374116678684757e+01,-4.550552181287258691e+01,-6.389797519770543488e+01,-8.080752870055155768e+01,-3.710761057839906130e+01,-2.853646987674874325e+01,-8.528504840097573947e+01,-2.419333633916194515e+01,-6.238615005633322141e+01,-6.291982259244255005e+01,-6.259090776617902208e+01,-8.881464866252750312e+01,-1.667124237605801085e+00,-8.565010394639635649e+01,2.353949611621115423e+01,-1.727979354821862046e+01,-8.736904053373861245e+01,-3.337827099220739768e+01,-3.933873827316808303e+01,-3.317935393984869474e+00,-2.126593209250351890e+01,-8.487218940856828908e+01,2.749236360653240396e+01
