1.000000000000000000e+02,-1.000000000000000000e+02,-1.000000000000000000e+02,7.226610700529639075e+01,1.000000000000000000e+02,-1.000000000000000000e+02,-1.000000000000000000e+02,-5.028543974777530678e+01,1.000000000000000000e+02,-1.000000000000000000e+02,-8.793364135729638065e+01,-1.000000000000000000e+02,9.735520244145961044e+01,-1.000000000000000000e+02,-1.000000000000000000e+02,-1.000000000000000000e+02,5.336730087571095993e+01,-1.000000000000000000e+02,8.796934991500943113e+01,-1.000000000000000000e+02,-1.000000000000000000e+02,1.000000000000000000e+02,7.227885466237232492e+01,1.000000000000000000e+02,1.000000000000000000e+02,-9.733323678388350686e+01,-1.000000000000000000e+02,1.000000000000000000e+02,-1.000000000000000000e+02,-1.000000000000000000e+02
1.000000000000000000e+02,-1.000000000000000000e+02,-1.000000000000000000e+02,-5.341443597948465793e+01,-1.000000000000000000e+02,-1.000000000000000000e+02,-1.000000000000000000e+02,-1.000000000000000000e+02,-7.848185043482574486e+01,-1.000000000000000000e+02,-1.000000000000000000e+02,-4.401099858540420229e+01,1.000000000000000000e+02,-1.000000000000000000e+02,-1.000000000000000000e+02,-9.425000584316710217e+01,1.566291537505346376e+01,-9.740750583496053139e+01,-3.145754066586055231e+01,7.216059709078511730e+01,-1.000000000000000000e+02,-1.000000000000000000e+02,-8.803517280636933151e+01,-5.976320594661657992e+01,-1.000000000000000000e+02,-1.000000000000000000e+02,-1.000000000000000000e+02,-1.000000000000000000e+02,-1.000000000000000000e+02,-1.000000000000000000e+02
5.292952941736498218e+01,1.000000000000000000e+02,-1.000000000000000000e+02,-4.683422601654471151e+01,1.000000000000000000e+02,1.000000000000000000e+02,-9.724591898733676487e+01,-1.000000000000000000e+02,-5.313343848061961694e+01,-8.444753373801464136e+01,-1.000000000000000000e+02,-9.992760660407304840e+01,-6.312229747119590684e+01,-6.000000000000000000e+01,-4.667493353043714421e+01,-1.000000000000000000e+02,-1.000000000000000000e+02,-6.292806466291335710e+01,9.754563682059908558e+01,-4.097590802812503341e+01,-1.000000000000000000e+02,-1.000000000000000000e+02,1.000000000000000000e+02,9.782662942066673750e+00,-6.358854977427029098e+00,-8.164038261057410750e+01,-1.000000000000000000e+02,-6.281950027944406401e+01,-9.800500635133222715e+01,9.824039724906101867e+01
1.000000000000000000e+02,-1.000000000000000000e+02,1.562328726739553275e+01,8.762933786607128184e+01,-1.000000000000000000e+02,1.000000000000000000e+02,-1.000000000000000000e+02,-1.000000000000000000e+02,-1.000000000000000000e+02,-1.000000000000000000e+02,-7.867717587645218202e+01,-5.031073735465224672e+01,-1.000000000000000000e+02,-6.566537464573413274e+01,-1.000000000000000000e+02,-1.000000000000000000e+02,-2.186498542206007656e+01,-9.729106894410497475e+00,-1.000000000000000000e+02,-1.000000000000000000e+02,-6.300766481123699414e+00,-1.000000000000000000e+02,-1.000000000000000000e+02,-1.000000000000000000e+02,9.721226021398641137e+01,-1.000000000000000000e+02,-1.000000000000000000e+02,-7.850426701169087096e+01,-1.000000000000000000e+02,4.250364770109004553e+01
9.080661624115610664e+01,-2.482667166768874267e+01,6.436861888692634537e+00,-1.000000000000000000e+02,-1.000000000000000000e+02,-1.000000000000000000e+02,-4.383618587831229263e+01,-1.000000000000000000e+02,-9.781494927838495812e+01,8.163813318843003231e+01,7.858063576512965653e+01,-1.000000000000000000e+02,-1.000000000000000000e+02,-1.000000000000000000e+02,-1.000000000000000000e+02,-1.000000000000000000e+02,-6.310722918538613868e+01,-1.000000000000000000e+02,-1.000000000000000000e+02,-1.000000000000000000e+02,-4.116850886140145604e+01,-1.000000000000000000e+02,-1.000000000000000000e+02,-1.000000000000000000e+02,-1.000000000000000000e+02,-1.000000000000000000e+02,-7.879954461733365179e+01,-1.000000000000000000e+02,-7.841783995763741189e+01,-1.000000000000000000e+02
2.819462894593010915e+01,1.000000000000000000e+02,-1.000000000000000000e+02,-3.295734566983753666e+00,-1.000000000000000000e+02,-3.123314106809307589e+01,-1.000000000000000000e+02,-9.112310899848158385e+01,-1.000000000000000000e+02,-1.000000000000000000e+02,1.000000000000000000e+02,-1.000000000000000000e+02,-1.000000000000000000e+02,-6.610796051994574896e+01,-1.000000000000000000e+02,-5.036926867509057359e+01,-1.000000000000000000e+02,-1.000000000000000000e+02,-1.000000000000000000e+02,-7.845083268343375948e+01,-1.000000000000000000e+02,-1.000000000000000000e+02,-3.784554619609946968e+01,-1.000000000000000000e+02,-1.000000000000000000e+02,-5.347539424589906076e+01,1.558444872550561122e+01,-1.000000000000000000e+02,-1.000000000000000000e+02,-1.000000000000000000e+02
-8.482359229637820874e+01,-1.000000000000000000e+02,-1.000000000000000000e+02,-1.000000000000000000e+02,-1.000000000000000000e+02,-2.513318279916223830e+01,-5.340620142404424087e+01,-1.000000000000000000e+02,1.000000000000000000e+02,8.482329732518803667e+01,-1.000000000000000000e+02,-1.000000000000000000e+02,-7.854033735692772211e+01,-1.000000000000000000e+02,6.911509456483692304e+01,-1.000000000000000000e+02,-9.738936018856662713e+01,-6.911489777433864390e+01,-9.738956783769259573e+01,-1.000000000000000000e+02,-2.827431059786366774e+01,1.000000000000000000e+02,-9.738876566214868546e+01,-1.000000000000000000e+02,-1.000000000000000000e+02,-1.000000000000000000e+02,-1.000000000000000000e+02,-1.000000000000000000e+02,-1.000000000000000000e+02,-1.000000000000000000e+02
-1.000000000000000000e+02,-7.833014766392125239e+01,-1.000000000000000000e+02,-1.000000000000000000e+02,-1.000000000000000000e+02,-1.000000000000000000e+02,-1.000000000000000000e+02,-5.978082586013174193e+01,5.658644270880675009e+01,6.613350128334425904e+01,-1.000000000000000000e+02,-9.731793474240346598e+01,-1.000000000000000000e+02,-7.206847377147144584e+01,-1.000000000000000000e+02,-1.601213777687966555e+01,-1.000000000000000000e+02,-1.000000000000000000e+02,-1.000000000000000000e+02,-3.133444549376418564e+01,-1.000000000000000000e+02,-1.000000000000000000e+02,-3.183287991216403157e+00,9.568668332830618795e+00,-1.000000000000000000e+02,-1.000000000000000000e+02,-1.000000000000000000e+02,-1.000000000000000000e+02,-1.000000000000000000e+02,-9.333119016994814388e+01
-8.798736351164581038e+01,-1.000000000000000000e+02,-9.999999468394825897e+01,-1.000000000000000000e+02,-1.000000000000000000e+02,-1.000000000000000000e+02,-1.000000000000000000e+02,-1.000000000000000000e+02,-1.000000000000000000e+02,-1.000000000000000000e+02,-1.000000000000000000e+02,1.000000000000000000e+02,-1.000000000000000000e+02,-1.000000000000000000e+02,-2.189665594121190040e+01,1.000000000000000000e+02,-7.224289692312750333e+01,5.353060426363825997e+01,7.855701400680055713e+01,4.393447177973231277e+01,-1.000000000000000000e+02,1.895403888879280885e+01,-1.000000000000000000e+02,-3.156407437160804719e+01,-1.000000000000000000e+02,7.839219330849500977e+01,-9.727713093921923360e+01,-7.234565977554603933e+01,-1.000000000000000000e+02,-3.808072102157652949e+01
-1.000000000000000000e+02,-1.000000000000000000e+02,9.424885608229049083e+00,-1.000000000000000000e+02,-1.000000000000000000e+02,-1.000000000000000000e+02,9.738948648945591913e+01,-1.000000000000000000e+02,-9.738951537415395876e+01,-1.000000000000000000e+02,-1.000000000000000000e+02,-4.084075370259611759e+01,6.283128104076833864e+00,-1.000000000000000000e+02,-1.000000000000000000e+02,-5.969028928471547601e+01,-1.000000000000000000e+02,-1.000000000000000000e+02,-1.000000000000000000e+02,-1.000000000000000000e+02,-1.000000000000000000e+02,1.000000000000000000e+02,-1.000000000000000000e+02,-1.000000000000000000e+02,-1.000000000000000000e+02,-1.000000000000000000e+02,1.000000000000000000e+02,-1.000000000000000000e+02,-1.000000000000000000e+02,-4.043679346942178654e+01
-1.000000000000000000e+02,1.270077372730996679e+01,-1.000000000000000000e+02,-5.978531822119190764e+01,-4.390853810331829266e+01,1.559221051334739627e+01,-1.000000000000000000e+02,-1.000000000000000000e+02,-1.000000000000000000e+02,-1.000000000000000000e+02,-1.880330709127825628e+01,-9.717403539403899515e+01,-1.000000000000000000e+02,-1.000000000000000000e+02,-2.197499832582186130e+01,1.000000000000000000e+02,-1.000000000000000000e+02,-5.021705557512539286e+01,-1.000000000000000000e+02,-1.000000000000000000e+02,-1.000000000000000000e+02,-1.000000000000000000e+02,-1.000000000000000000e+02,5.342954282001888089e+01,-1.000000000000000000e+02,-7.557567536027467270e+01,-1.000000000000000000e+02,-1.000000000000000000e+02,6.616368359075865158e+01,-1.000000000000000000e+02
-1.000000000000000000e+02,-1.000000000000000000e+02,-1.000000000000000000e+02,-1.000000000000000000e+02,-9.738928467241804299e+01,1.000000000000000000e+02,-1.000000000000000000e+02,-5.340711956818248751e+01,-6.283179445639678562e+01,-1.000000000000000000e+02,-1.000000000000000000e+02,-6.283175823668801740e+01,-9.738946263506117873e+01,-1.000000000000000000e+02,-1.000000000000000000e+02,-1.000000000000000000e+02,-1.000000000000000000e+02,-1.000000000000000000e+02,-1.000000000000000000e+02,-1.000000000000000000e+02,-1.000000000000000000e+02,-1.000000000000000000e+02,3.141488118948979835e+00,-1.000000000000000000e+02,-6.597334291419450381e+01,-1.000000000000000000e+02,-1.000000000000000000e+02,-1.000000000000000000e+02,-1.000000000000000000e+02,-1.000000000000000000e+02
1.000000000000000000e+02,-1.000000000000000000e+02,-1.000000000000000000e+02,-1.000000000000000000e+02,-1.000000000000000000e+02,1.000000000000000000e+02,-1.000000000000000000e+02,-1.000000000000000000e+02,-1.000000000000000000e+02,-1.000000000000000000e+02,-1.000000000000000000e+02,1.000000000000000000e+02,-1.000000000000000000e+02,-5.340708746210617619e+01,-1.000000000000000000e+02,-1.000000000000000000e+02,-1.000000000000000000e+02,-4.084063805056881336e+01,-1.000000000000000000e+02,1.000000000000000000e+02,-6.597333484653876212e+01,-1.000000000000000000e+02,-1.000000000000000000e+02,-1.000000000000000000e+02,-1.000000000000000000e+02,-1.000000000000000000e+02,-9.424793139591650970e+01,-9.738928756507056050e+01,-1.000000000000000000e+02,-2.728380588956877162e+01
5.644452028271236799e+01,-5.342391824094332975e+01,-1.000000000000000000e+02,-6.897253057621166761e+01,-4.404048986930156673e+01,-1.000000000000000000e+02,-1.000000000000000000e+02,-1.000000000000000000e+02,-5.337669690892001739e+01,6.392848448933341921e+00,-6.913821286137429922e+01,1.000000000000000000e+02,5.373159107983889982e+01,-1.000000000000000000e+02,-2.521289462974622353e+01,-1.000000000000000000e+02,-1.000000000000000000e+02,-1.000000000000000000e+02,-1.000000000000000000e+02,-1.000000000000000000e+02,-1.000000000000000000e+02,-1.000000000000000000e+02,-3.142515172989556049e+01,-1.000000000000000000e+02,-1.000000000000000000e+02,-1.000000000000000000e+02,3.791229971770623308e+01,-1.000000000000000000e+02,-7.214060818992443558e+01,2.663278988595456642e+00
-3.762193111456849692e+01,-1.000000000000000000e+02,-9.739236301061605161e+01,1.000000000000000000e+02,-1.000000000000000000e+02,-1.000000000000000000e+02,1.000000000000000000e+02,-1.565538632899381710e+01,3.129679199493877562e+01,-1.000000000000000000e+02,1.000000000000000000e+02,-1.000000000000000000e+02,-1.000000000000000000e+02,-1.000000000000000000e+02,-1.000000000000000000e+02,-1.000000000000000000e+02,1.000000000000000000e+02,4.096350908227161369e+01,-1.000000000000000000e+02,-6.295695188976112355e+00,-1.000000000000000000e+02,-1.000000000000000000e+02,-1.000000000000000000e+02,-1.000000000000000000e+02,8.454792931883480378e+01,-5.341366476900727633e+01,-6.131663133959326828e+00,-1.000000000000000000e+02,-9.726416892521258717e+01,-1.000000000000000000e+02
-1.000000000000000000e+02,-1.000000000000000000e+02,-1.568624678977108644e+01,6.902800370405792307e+01,-1.000000000000000000e+02,-2.484147038388635664e+01,7.509011719156592335e+01,3.188731773825291782e+01,-7.877151573040228527e+01,-1.000000000000000000e+02,1.000000000000000000e+02,-1.000000000000000000e+02,-2.772321396554005890e+00,-2.559547103938709611e+01,-1.000000000000000000e+02,-7.832760667717714398e+01,-1.000000000000000000e+02,5.690101734559615210e+01,-1.000000000000000000e+02,-1.272983656103345851e+01,-4.387877037596260976e+01,-4.397024442229879782e+01,9.762504197560326702e+01,-1.000000000000000000e+02,-9.760190246137899805e+01,-1.000000000000000000e+02,-5.380848024609166202e+01,-1.000000000000000000e+02,-4.996748365910349321e+01,-1.000000000000000000e+02
-4.735490513516496236e+01,1.000000000000000000e+02,-1.000000000000000000e+02,-1.000000000000000000e+02,-2.805997170427350085e+01,-1.000000000000000000e+02,-1.000000000000000000e+02,6.229188111958429808e+00,-1.000000000000000000e+02,-8.818646409503291750e+01,-4.704250756842552761e+01,-1.000000000000000000e+02,-1.000000000000000000e+02,-1.000000000000000000e+02,-8.458624738616317984e+01,-1.000000000000000000e+02,-1.000000000000000000e+02,-1.000000000000000000e+02,-1.000000000000000000e+02,-1.586040549453305459e+01,-1.000000000000000000e+02,-4.750226264297052836e+01,-7.570458312169161275e+01,-1.000000000000000000e+02,-1.000000000000000000e+02,-1.000000000000000000e+02,5.792771953049907552e+00,-1.000000000000000000e+02,2.488786791352922734e+01,-1.000000000000000000e+02
-1.000000000000000000e+02,-1.000000000000000000e+02,-1.000000000000000000e+02,-1.000000000000000000e+02,-7.539821797711041995e+01,-1.000000000000000000e+02,-1.000000000000000000e+02,-1.000000000000000000e+02,-1.000000000000000000e+02,6.283199660551380106e+01,-5.654871034645026384e+01,-1.000000000000000000e+02,-9.738950681320710601e+01,-1.000000000000000000e+02,-1.000000000000000000e+02,-5.340702350301091883e+01,-7.853978999396352378e+01,1.000000000000000000e+02,-1.000000000000000000e+02,-9.738952982271133862e+01,-1.000000000000000000e+02,3.141581158850395639e+01,-1.000000000000000000e+02,-1.000000000000000000e+02,-1.000000000000000000e+02,-1.000000000000000000e+02,-1.000000000000000000e+02,-1.000000000000000000e+02,-7.539820345227073517e+01,-1.000000000000000000e+02
2.513269631441138685e+01,1.000000000000000000e+02,1.000000000000000000e+02,1.000000000000000000e+02,-1.000000000000000000e+02,-1.000000000000000000e+02,-1.000000000000000000e+02,-6.282998464764687263e+00,-1.000000000000000000e+02,-1.000000000000000000e+02,-9.738928677371460196e+01,-6.283188295283449065e+01,-9.110627096902507560e+01,-2.827448244440425995e+01,-1.000000000000000000e+02,1.000000000000000000e+02,-1.000000000000000000e+02,-1.000000000000000000e+02,1.000000000000000000e+02,-1.000000000000000000e+02,-1.000000000000000000e+02,1.000000000000000000e+02,-9.738920100306924610e+01,-1.000000000000000000e+02,1.000000000000000000e+02,-1.000000000000000000e+02,-1.000000000000000000e+02,-1.000000000000000000e+02,-1.000000000000000000e+02,-1.000000000000000000e+02
-5.969031020943937449e+01,-1.000000000000000000e+02,-1.000000000000000000e+02,-1.000000000000000000e+02,-1.000000000000000000e+02,-1.000000000000000000e+02,-1.000000000000000000e+02,-1.000000000000000000e+02,-1.000000000000000000e+02,-1.000000000000000000e+02,-1.000000000000000000e+02,-1.000000000000000000e+02,-1.000000000000000000e+02,2.827440651839914665e+01,-1.000000000000000000e+02,-4.398213284768926457e+01,-5.026547501000800366e+01,-1.000000000000000000e+02,-1.000000000000000000e+02,-1.000000000000000000e+02,-1.000000000000000000e+02,-1.000000000000000000e+02,-1.000000000000000000e+02,-1.000000000000000000e+02,-6.283182056451694564e+01,2.827421034098152930e+01,-1.000000000000000000e+02,1.000000000000000000e+02,-1.000000000000000000e+02,-5.871318602767242822e+01
-9.738922450173708967e+01,-1.000000000000000000e+02,-1.000000000000000000e+02,1.000000000000000000e+02,-1.000000000000000000e+02,-8.796447514905604237e+01,-9.738946516551781940e+01,-1.000000000000000000e+02,-3.455751289125898040e+01,-1.000000000000000000e+02,-1.000000000000000000e+02,8.943520006050447195e-05,5.654875898299451364e+01,-1.000000000000000000e+02,-1.000000000000000000e+02,-1.000000000000000000e+02,-7.225674735789358749e+01,-2.513281600778991987e+01,-1.000000000000000000e+02,1.000000000000000000e+02,-1.000000000000000000e+02,-1.000000000000000000e+02,-1.000000000000000000e+02,-1.000000000000000000e+02,-1.000000000000000000e+02,9.738950944541291221e+01,1.000000000000000000e+02,-1.000000000000000000e+02,-1.000000000000000000e+02,8.531667531973678820e+01
-1.000000000000000000e+02,-1.000000000000000000e+02,-1.000000000000000000e+02,-1.000000000000000000e+02,-1.000000000000000000e+02,-4.398235373994480568e+01,1.884962729527790515e+01,-1.000000000000000000e+02,-1.000000000000000000e+02,-9.110623976610941099e+01,3.455745993285703577e+01,-1.000000000000000000e+02,9.424898204159388726e+00,-1.000000000000000000e+02,-1.000000000000000000e+02,-1.000000000000000000e+02,-9.110607108740062188e+01,-1.000000000000000000e+02,6.911492507731988155e+01,-1.000000000000000000e+02,-1.000000000000000000e+02,-1.000000000000000000e+02,-1.000000000000000000e+02,-6.911508609420441474e+01,-1.000000000000000000e+02,-1.000000000000000000e+02,-1.884963355979784794e+01,5.654872995410445924e+01,-1.256619831854091096e+01,-9.769988791474503387e+01
-5.340724887833066248e+01,-1.000000000000000000e+02,-1.000000000000000000e+02,-1.000000000000000000e+02,-1.000000000000000000e+02,1.000000000000000000e+02,-1.000000000000000000e+02,-1.000000000000000000e+02,1.000000000000000000e+02,-7.225642885257194337e+01,-1.000000000000000000e+02,-4.712375144085116574e+01,-4.084070273315366961e+01,-4.712385689509884656e+01,-1.000000000000000000e+02,-1.000000000000000000e+02,8.168152657158191232e+01,-1.000000000000000000e+02,-1.000000000000000000e+02,-7.539832067195919763e+01,-1.000000000000000000e+02,-1.000000000000000000e+02,-1.000000000000000000e+02,-1.000000000000000000e+02,5.654853705728718438e+01,-1.000000000000000000e+02,-1.000000000000000000e+02,1.000000000000000000e+02,3.769924282323518128e+01,1.000000000000000000e+02
-9.424787103273020250e+01,-1.000000000000000000e+02,-1.000000000000000000e+02,-6.911515832057780528e+01,-1.000000000000000000e+02,1.000000000000000000e+02,-1.000000000000000000e+02,-1.000000000000000000e+02,-1.000000000000000000e+02,-9.738939770067044321e+01,-1.000000000000000000e+02,-1.000000000000000000e+02,-1.000000000000000000e+02,-1.000000000000000000e+02,-1.000000000000000000e+02,-3.141725757880332370e+00,-2.827417590964804006e+01,-1.000000000000000000e+02,-1.000000000000000000e+02,-1.000000000000000000e+02,-1.000000000000000000e+02,-1.000000000000000000e+02,-1.000000000000000000e+02,-1.000000000000000000e+02,-1.000000000000000000e+02,-1.000000000000000000e+02,-7.539836288799914144e+01,-6.283180327261140263e+01,-1.000000000000000000e+02,-1.000000000000000000e+02
-4.081877147529975502e+01,-1.000000000000000000e+02,-1.000000000000000000e+02,3.462773201042572424e+01,-1.000000000000000000e+02,-1.000000000000000000e+02,-1.000000000000000000e+02,-1.000000000000000000e+02,-6.589526318089130541e+01,-1.000000000000000000e+02,-9.438120882398962408e+00,-1.000000000000000000e+02,-1.000000000000000000e+02,-5.335540558427229030e+01,-1.000000000000000000e+02,-1.000000000000000000e+02,-3.135593848185072119e+01,3.103671507569377930e+00,-1.000000000000000000e+02,-9.413042286641351453e+00,-1.249977369179144304e+01,2.820629883820267025e+01,-1.000000000000000000e+02,-1.000000000000000000e+02,8.169340288644347936e+01,-1.000000000000000000e+02,2.827390068606323226e+01,-1.000000000000000000e+02,-5.344747847605361102e+01,-5.609160482177709639e+01
-1.000000000000000000e+02,5.310934213032864903e+01,-1.000000000000000000e+02,4.070990004143419583e+01,-1.000000000000000000e+02,-9.763605560355044588e+01,7.567774045468146937e+01,-1.000000000000000000e+02,1.000000000000000000e+02,-1.000000000000000000e+02,1.000000000000000000e+02,-1.000000000000000000e+02,1.877233338412357355e+01,-3.479670068239051517e+01,1.000000000000000000e+02,1.000000000000000000e+02,-5.951022098379810643e+01,-1.000000000000000000e+02,1.000000000000000000e+02,-1.000000000000000000e+02,1.000000000000000000e+02,-3.119194763616950894e+01,-1.000000000000000000e+02,-4.392579446498140783e+01,-4.756138880161189775e+01,8.494674033972590621e+01,-1.000000000000000000e+02,-6.427751460074058620e+00,-1.000000000000000000e+02,-1.000000000000000000e+02
9.738931626956052412e+01,-5.969044615884602933e+01,1.000000000000000000e+02,-4.398240800088617419e+01,-1.570799330071747768e+01,-1.000000000000000000e+02,1.000000000000000000e+02,-1.000000000000000000e+02,-1.000000000000000000e+02,-1.000000000000000000e+02,-1.000000000000000000e+02,-1.000000000000000000e+02,-5.654587979314783437e-05,-9.738926168920708903e+01,-1.000000000000000000e+02,-1.000000000000000000e+02,-1.000000000000000000e+02,-1.000000000000000000e+02,-1.000000000000000000e+02,-1.000000000000000000e+02,-3.141730081086383741e+00,-1.000000000000000000e+02,-1.000000000000000000e+02,-1.000000000000000000e+02,-1.000000000000000000e+02,-1.000000000000000000e+02,1.000000000000000000e+02,-3.141577978897276324e+01,-9.738940796601373506e+01,-1.000000000000000000e+02
-8.796474492842891379e+01,-1.000000000000000000e+02,1.191132975647752929e-04,-1.000000000000000000e+02,-1.000000000000000000e+02,-1.000000000000000000e+02,-1.000000000000000000e+02,-1.000000000000000000e+02,-1.000000000000000000e+02,1.000000000000000000e+02,-7.225677134376017818e+01,-1.000000000000000000e+02,-3.455751947265044066e+01,-1.000000000000000000e+02,-5.969029733031846519e+01,7.225682138111795894e+01,-1.000000000000000000e+02,5.969034670308361967e+01,-1.000000000000000000e+02,-1.000000000000000000e+02,-1.000000000000000000e+02,-1.000000000000000000e+02,-1.000000000000000000e+02,-1.000000000000000000e+02,-1.000000000000000000e+02,-9.738943667356481626e+01,-1.000000000000000000e+02,-1.000000000000000000e+02,-1.000000000000000000e+02,-9.999930054920537259e+01
-1.000000000000000000e+02,-1.000000000000000000e+02,-1.000000000000000000e+02,-8.794670908012950861e+01,-1.000000000000000000e+02,3.795005787756554838e+01,-3.766966148065135656e+01,-6.021644741081855656e+00,-7.861659014494394171e+01,-1.000000000000000000e+02,-1.000000000000000000e+02,9.463563779517194519e+00,-1.000000000000000000e+02,-8.793362775670917131e+01,-9.760723503424500791e+01,-9.732958603069367598e+01,-9.728094150599888223e+01,-1.000000000000000000e+02,-1.000000000000000000e+02,-1.000000000000000000e+02,-1.000000000000000000e+02,-8.792242978047079305e+01,-9.720390354436626978e+01,-1.000000000000000000e+02,-1.000000000000000000e+02,-9.750388758883883611e+01,-1.000000000000000000e+02,-1.000000000000000000e+02,-1.000000000000000000e+02,-1.000000000000000000e+02
-1.000000000000000000e+02,-1.000000000000000000e+02,-1.000000000000000000e+02,-9.738924612739108966e+01,-1.000000000000000000e+02,-1.000000000000000000e+02,-1.000000000000000000e+02,-1.000000000000000000e+02,2.513286238352773694e+01,-1.884970474840735832e+01,1.000000000000000000e+02,-1.000000000000000000e+02,-1.000000000000000000e+02,-9.424792227337184158e+01,-1.000000000000000000e+02,-1.000000000000000000e+02,-1.256642397712008652e+01,-1.000000000000000000e+02,-1.000000000000000000e+02,-1.000000000000000000e+02,1.000000000000000000e+02,-1.000000000000000000e+02,-1.000000000000000000e+02,-1.000000000000000000e+02,-1.000000000000000000e+02,-1.000000000000000000e+02,-1.000000000000000000e+02,-1.000000000000000000e+02,-1.000000000000000000e+02,-9.565771969878376524e+01
