9.755503721330215683e+01,9.891641244653776255e+01,9.728095081899188301e+01,8.247241614968599777e+01,7.337341954292459434e+01,6.631506821814659247e+01,6.207701617711244779e+01,4.493769648770616243e+01,3.204739839646323674e+01,1.758434468951432095e+01,8.723300401290735806e+00,5.102767627587393662e+00,2.988173606340756017e+00,1.579720130964976876e+00,8.748675402055051675e-01,5.006375461749250633e-01,2.910320969931250445e-01,1.648303413970930442e-01,8.514038609160545779e-02,4.429791843795177764e-02,2.358394467199770653e-02,9.972732753522780408e-03,4.443263200446113080e-03,1.953214735401459339e-03,7.721710007645395720e-04,1.595235499155012756e-04,3.150213867765321393e-05,5.775715217571613474e-06,1.047999891911472133e-06,-1.515487868897909725e-08
9.996442344199141417e+01,8.218467273628544945e+01,8.175169711806826456e+01,7.991190468124436563e+01,9.172764572808998196e+01,8.260932455196088142e+01,7.686868581198545769e+01,7.473688586248617582e+01,7.449935213059846717e+01,7.360237007255797437e+01,5.036692564540805250e+01,3.508303070575566096e+01,2.319947847003453489e+01,9.711764072612792731e+00,4.207051174319468068e+00,1.522921049681765560e+00,5.479843919879942016e-01,2.000506037568497986e-01,5.760084503589192606e-02,1.666070668191240584e-02,5.161737744401748151e-03,1.457260563052882249e-03,4.153461585127981876e-04,1.105195715725597121e-04,3.207891497213674598e-05,9.472272167283183730e-06,8.825258800942223426e-07,9.260678366643817455e-08,5.795765178803000345e-09,-7.096981774813393357e-11
9.761560318071543918e+01,9.581887608995691608e+01,9.194087936605062339e+01,8.882014471103654785e+01,9.880287326803015446e+01,9.566207324219787722e+01,9.449221564122343864e+01,9.027217158421605347e+01,8.228867878211858056e+01,4.890834229056041238e+01,2.450187160073800641e+01,1.112095620043498911e+01,5.144181744888757457e+00,2.479126904209920657e+00,1.079820672303321016e+00,5.151561323815293525e-01,2.481336301427929381e-01,1.107304918033069352e-01,3.657791960075312127e-02,1.316253754922445084e-02,5.468075151137858497e-03,1.820470595966182902e-03,5.653764269012176392e-04,1.277962935888078948e-04,2.774669866060028170e-05,5.594902204873425170e-06,1.184796034493764815e-06,1.139673271729117035e-07,3.762550608990312767e-09,4.658685085145389962e-11
9.944616125397809014e+01,9.552982357502334310e+01,8.690419661204509794e+01,8.519889561310324666e+01,8.009352104212781853e+01,7.006470937787786113e+01,7.647065105724151124e+01,8.810390395226829696e+01,6.232854302385256773e+01,4.595996851697012175e+01,3.337031494325010073e+01,2.395470646937817349e+01,1.735152656009108796e+01,9.766777644869462094e+00,5.495785336165012858e+00,2.976211104582060951e+00,1.524205708574470908e+00,7.683312533203306982e-01,2.889814330333437820e-01,8.893057728246332727e-02,1.318528146132604863e-02,2.312729777310775121e-03,3.093691994384262082e-04,3.700729461456838440e-05,3.473958998368948313e-06,1.825976457186584479e-07,1.034253488389487885e-08,5.277900822575694922e-10,2.046699057842364577e-11,7.247326170420265052e-13
9.992912602013346657e+01,9.939176470033130784e+01,9.685484112937530199e+01,8.987448995644783167e+01,7.424503698828091558e+01,7.184269522658389917e+01,6.954131260840155448e+01,8.521958615730616771e+01,7.382987756992791617e+01,6.901529426127932254e+01,6.478913299268390347e+01,4.061563881171977641e+01,2.472795122816627611e+01,1.411854737423714568e+01,5.184292923946033582e+00,1.906202805539824352e+00,7.736570382631733356e-01,2.264448485561509072e-01,5.695331176227489550e-02,1.537882439097507797e-02,4.384751584102915441e-03,1.097130703572872686e-03,2.463335745317115407e-04,4.041544275702287683e-05,7.661026234879159301e-06,1.004104226504327574e-06,1.251635129578362370e-07,1.652006380919576904e-08,7.025815141262197485e-10,4.314217351688468545e-11
9.998880307901637821e+01,8.826291282099155922e+01,8.678038474507238220e+01,8.554833475928816711e+01,8.102251119950979330e+01,7.738282249784057854e+01,8.062297996451836468e+01,7.372976265190879985e+01,5.769099020954816837e+01,4.544398289831610782e+01,3.671609111142866766e+01,1.784024246049848017e+01,9.222323339850067470e+00,4.476316128727010124e+00,2.191086875750584806e+00,1.056750573496056500e+00,5.028694305042584745e-01,2.392050742733452806e-01,1.206854788222314623e-01,5.097844828840248504e-02,1.750423728908460930e-02,6.184476634482736698e-03,2.069689495498835095e-03,6.336917790965181227e-04,1.921563245388444691e-04,5.553573283511380296e-05,1.013373206016605139e-05,1.677698913112774836e-06,5.255404821666247556e-08,1.177426203767676753e-10
9.966506706339646371e+01,9.998646257538088378e+01,9.891596195953124493e+01,9.212187707575922957e+01,8.602838363140668321e+01,8.854480432867713091e+01,9.477022710269112338e+01,9.741423663664716059e+01,9.748103880624869078e+01,9.982949072404657898e+01,9.934331131733613063e+01,9.759836733706026735e+01,9.515451652936509674e+01,3.130994576575401567e+01,1.004920713369889462e+01,3.374293211914000779e+00,1.109235976298811321e+00,3.408065152618594551e-01,8.957224684097384038e-02,2.308351955339889988e-02,6.035980137079449172e-03,1.326484036043279859e-03,2.601772976763298741e-04,5.541394624887190085e-05,7.905019692960227448e-06,9.674335483794209780e-07,1.178774585302679940e-07,1.687330492875584330e-08,1.013362080204006588e-09,5.103567220645581675e-11
9.756841160061826201e+01,8.940333284465310726e+01,8.564294049285688004e+01,7.478978264444599233e+01,9.858719667613624438e+01,9.998774829172587886e+01,8.708732102271304143e+01,7.781605495763542990e+01,6.754297198902855826e+01,5.512594220463311956e+01,3.803464086450218673e+01,2.195602805584781692e+01,1.106202931155814717e+01,5.305233810582739018e+00,2.143529201515416815e+00,8.646931348172851584e-01,3.564602739982449808e-01,1.550291827891891183e-01,6.113840665840727245e-02,2.087344847030734793e-02,6.349883337996899309e-03,1.912049989282164951e-03,5.077328824149287753e-04,1.048347895391811243e-04,1.956345263739014338e-05,3.812385374512135822e-06,7.487883990828974067e-07,6.148602454314896511e-08,3.323233025213946174e-09,-1.026577864965067607e-11
9.993131865076600207e+01,9.224100993439277829e+01,8.234365284934830242e+01,7.442889450277070296e+01,7.752610636176569869e+01,8.747180955753823639e+01,9.999252108908453351e+01,9.188492715235092589e+01,9.178308679591276587e+01,7.824642888624437376e+01,7.159251375507207626e+01,6.237403006738853861e+01,3.686302294667481050e+01,1.706239239279540953e+01,6.854476622319171319e+00,2.740408809350793451e+00,9.652249368098936300e-01,3.301505240389366880e-01,8.937302379004113950e-02,2.400472592786095580e-02,4.521399846934293261e-03,8.772277292593555487e-04,1.849994452072522850e-04,2.715853333550557406e-05,4.214302237807971175e-06,2.967246854615856024e-07,2.481981592574937389e-08,1.007222288582194054e-09,4.368947800222986790e-11,1.334757619247389698e-12
9.722550495274705895e+01,8.585307525092370895e+01,8.928216492974847540e+01,8.630265808294441854e+01,7.632450577204596698e+01,6.446860208027140970e+01,5.951427416174797003e+01,5.441634598302113091e+01,5.242109548949389364e+01,5.048355399038138813e+01,5.918515456071704506e+01,7.008357513575479913e+01,8.453256777855310133e+01,2.523319210432538995e+01,8.059490431718913328e+00,2.447877456665140894e+00,7.175939682429779420e-01,2.203283951763090331e-01,6.043346502783818186e-02,1.518755230294641448e-02,3.456079659427396724e-03,8.013397805807656940e-04,1.922855659640097814e-04,3.318585385599280921e-05,5.239609525948070765e-06,8.434044936102891853e-07,1.170504916978547225e-07,1.739542408090617705e-09,8.095042341153413967e-12,-7.142437659058583594e-14
9.942613417900072648e+01,9.786821873550498196e+01,9.948925360972215515e+01,8.651061241437732008e+01,9.605337617714852172e+01,9.947669399763904607e+01,8.432376483560686609e+01,7.571858267583606050e+01,7.168282211390157954e+01,5.222887368527573670e+01,3.040759821625425730e+01,1.845127868852281239e+01,7.824351177988210004e+00,3.571023457903485632e+00,1.823030692358218463e+00,1.006975189656536873e+00,5.263736532954977898e-01,1.880148420091180272e-01,7.716917167077219641e-02,3.237507915011505338e-02,1.250504016041124357e-02,4.851311609851854424e-03,1.273989998665390078e-03,3.289528319846865795e-04,1.056246970691388648e-04,3.389125494434095900e-05,7.641732833243870126e-06,3.369938827285860854e-07,2.012455606527498667e-09,-6.177008089075050697e-13
9.975926632019934459e+01,8.852437152312747060e+01,8.447035029690054841e+01,8.304763186990335555e+01,7.330009666221404530e+01,8.097142971289846969e+01,8.279479557851544769e+01,8.595470689411556009e+01,8.908671076710305670e+01,6.820816403787843285e+01,5.102928197883294104e+01,2.632233156615742331e+01,1.398680981868084494e+01,7.079627750342306847e+00,3.643761839280584169e+00,1.859358595380429247e+00,7.893309490572621989e-01,2.976532902492972088e-01,1.118724637572171138e-01,3.753308156924111544e-02,1.195727521940573475e-02,4.044129951036902482e-03,1.176014057139462398e-03,3.376271870116073835e-04,1.009012438248541483e-04,2.948788359210711914e-05,1.068537788707786620e-05,1.530955863537368627e-06,2.364773572785645246e-07,3.685310596504068700e-08
9.984470947508981453e+01,5.896138786378615748e+01,4.138084805148211132e+01,2.381921858392179558e+01,1.242462745004554314e+01,5.384181193062922866e+00,2.445753789318276805e+00,1.133621134302183142e+00,5.286145059714917327e-01,1.772982479243342679e-01,5.595570370599782517e-02,1.261629538723198218e-02,6.538096898640506378e-04,4.661266336452080561e-05,-8.801677206129660469e-07,9.999268115255439682e+01,6.164223026251946180e+01,2.505033650389047750e+01,9.352856033869874963e+00,3.396263038235124654e+00,1.191057018398729683e+00,2.974213031961702169e-01,8.249844138476056243e-02,1.999654650099879846e-02,3.589672577092509979e-03,5.078657091308566053e-04,6.114997685090055052e-05,7.604605546095497462e-06,3.800299539344562076e-07,5.289881808911665166e-09
9.999982333272603796e+01,9.737874963459873356e+01,8.790924633598103810e+01,7.463679048230099511e+01,7.015632760363642717e+01,6.717300216046641026e+01,6.746484322979716808e+01,8.348720278616414703e+01,9.877000459013679290e+01,9.081554010412406797e+01,9.548145788443507342e+01,9.061237641301850942e+01,8.042916557999100746e+01,4.516450705141085109e+01,2.067151719875167615e+01,9.927509461256414980e+00,4.763857454771514455e+00,2.386845842487502090e+00,7.051104637339626890e-01,2.004386219201378661e-01,4.128781842624219822e-02,8.276437932951793280e-03,8.687071059434770025e-04,9.631441894782695066e-05,8.846917464909015202e-06,9.335399106103556079e-07,8.231481241953257247e-08,4.204901846685335495e-09,1.401352549998464816e-10,-3.480003412137131522e-12
9.954093640541432819e+01,9.936377795746629715e+01,9.425691781501964783e+01,9.980375036634762864e+01,8.437308928665643748e+01,7.380780181659933703e+01,6.602846154403604828e+01,7.263463120120694327e+01,6.767789977821993830e+01,4.974018419729151930e+01,4.246888951047073135e+01,2.410467497945828441e+01,1.267816608095183817e+01,5.566136241001563789e+00,2.652328602399463886e+00,1.404560055036495836e+00,6.811919193356786861e-01,2.630933248902430632e-01,1.116707221942988409e-01,4.785025717567342046e-02,1.995410358333467651e-02,8.109858338801593722e-03,2.078253468905836426e-03,4.774037922906319690e-04,8.897762821424489170e-05,1.020606427104458706e-05,2.633310072198320122e-07,2.107443281346839260e-08,2.451650299931398603e-10,1.824100100520768286e-12
9.994728275058267286e+01,4.169916771342697359e+01,1.806123193651859538e+01,6.223824157921311162e+00,1.619281416197405843e+00,5.196766087787859645e-01,1.297468533738824203e-01,3.347201722396736523e-02,5.418845837619108881e-03,7.154287687767931425e-04,7.915507287069985470e-05,3.593271566196782645e-06,-2.618707638571078384e-07,9.999985571937058637e+01,7.657485135789929132e+01,5.995257358687734239e+01,4.170716486807024381e+01,1.771984859968219439e+01,7.770530925316242232e+00,3.685418925229957399e+00,1.529502686113582088e+00,7.957856394609532646e-01,2.340943491381088648e-01,6.714751070093274987e-02,1.742473405673201914e-02,3.713279238194177809e-03,1.706918732453110998e-04,1.191986274311411573e-05,4.921936067666265648e-07,-3.576723843806829702e-09
9.777567393552928365e+01,9.085569069534261644e+01,8.208509347977876303e+01,7.658148666803610638e+01,8.002859347188230288e+01,8.078426052671461832e+01,8.281147024789885336e+01,8.033089307534680756e+01,7.995550481608691484e+01,8.825823517411494379e+01,7.999937765819130675e+01,7.262719351841717241e+01,5.850623975961214995e+01,3.775925567354514811e+01,1.833145143610028427e+01,9.325787138517785735e+00,3.909814514605128188e+00,1.318980678156449482e+00,4.088194072600876972e-01,1.384578228669147704e-01,2.019227546406011584e-02,3.594172373806859243e-03,5.797083709220952983e-04,6.769992146624672052e-05,8.735350730288507932e-06,9.893410761546793624e-07,4.905201309230833598e-08,2.690591320639096283e-09,5.383359024484348649e-12,9.153987227078929615e-14
9.946915632139457841e+01,9.585672196625196761e+01,9.956590317705882853e+01,9.697514777917294282e+01,9.249353629961443346e+01,9.565314339853894410e+01,9.981278682675124969e+01,8.335464306075954255e+01,8.592856786730081353e+01,8.536796692009075116e+01,8.816172429411955136e+01,8.083208386393597777e+01,5.638362801075329855e+01,2.879092627783260383e+01,1.634408688588126779e+01,7.189723489919167321e+00,2.934828893534196848e+00,9.231590399260106716e-01,2.521464590645854376e-01,4.694872085405543682e-02,1.147522453813203114e-02,2.433788449547739409e-03,6.117567539091764905e-04,1.354069793442022216e-04,1.330755090556022798e-05,1.662413945923099085e-06,1.417567911573302021e-07,8.967533616044944619e-09,5.929577820435487709e-11,-1.493605796048282689e-12
9.975077600522969590e+01,9.607596668748638535e+01,7.506622903951080161e+01,8.893591589876791659e+01,9.361910338188526737e+01,9.856446356043278456e+01,9.633399632972559345e+01,8.329053813023899977e+01,8.431682448665948471e+01,8.022507131942261083e+01,5.865125750970491225e+01,4.270303517783250413e+01,2.769747417275189250e+01,1.643794255597898868e+01,9.631930489646663318e+00,4.184034617655178145e+00,1.828012693790506349e+00,6.133494143488291694e-01,1.741105928300845651e-01,4.505519789518354357e-02,9.446704308770335901e-03,1.649755934024535594e-03,3.352957522143469029e-04,6.704912951584328254e-05,1.013140688143810320e-05,3.816973951920652073e-07,2.846869951964198616e-08,3.314232748892877571e-10,6.013563008241981368e-12,-1.544776360452651776e-13
9.974020720331519385e+01,8.822098109888995054e+01,7.586121157889068911e+01,7.605323636866285142e+01,7.204747102101187295e+01,6.269918284070628545e+01,4.775855004281951466e+01,3.850607276792726452e+01,3.041224860053611323e+01,2.378297229132378376e+01,1.941315256367683517e+01,1.453844676952943438e+01,9.125204783783569695e+00,5.644120078839333310e+00,3.570179588846246421e+00,2.011001644367321095e+00,1.069586779396974663e+00,4.603960474162426264e-01,1.845226296774884756e-01,5.638147316427507411e-02,1.921026553712496671e-02,6.320642828730712974e-03,1.823518113048173571e-03,5.588104917569118547e-04,1.297311607453925100e-04,2.776463848361941661e-05,6.534559810497994157e-06,1.120096442035380237e-06,1.173782782300290649e-07,-3.671450273413405400e-09
9.898954342213860969e+01,3.914084782982453703e+01,1.924075027025760676e+01,1.020019667702181110e+01,6.793155173135176028e+00,3.046496826548922954e+00,1.176353985299636307e+00,5.845617657187457405e-01,1.743306324294192355e-01,3.878186849919526558e-02,7.792546151663637399e-03,1.240006825708036544e-03,5.319550880700786669e-05,1.075065291008180295e-06,6.558035672192066523e-08,1.681172443613130508e-09,3.363859463470116634e-11,-6.898768871151981492e-13,9.366727692314914577e+01,8.266565439689846073e+01,4.706781427607137402e+01,1.652691984177130990e+01,7.240535753208483527e+00,3.577597048237462829e+00,1.229448243548983077e+00,4.531502792165308935e-01,1.195959621877063644e-01,3.157358386122426780e-02,4.200547230290657859e-03,-2.826052973518451954e-04
9.992020056173487319e+01,9.052218683103046715e+01,8.337803625323013534e+01,9.836550583086821575e+01,8.970007407545151068e+01,8.529930182379131054e+01,9.892875304524567071e+01,9.362599189149021583e+01,8.300973581238962140e+01,7.590648344102231704e+01,4.476513767083431361e+01,2.896820209904224086e+01,1.604799820139753663e+01,8.092944645234547707e+00,3.788317548250833777e+00,1.835504937017970795e+00,7.656480828794955951e-01,3.286165435698250592e-01,1.159759666055412558e-01,3.917639004212405268e-02,1.199851709936792382e-02,3.265570368137068764e-03,3.550447573978059287e-04,4.453069047012573180e-05,3.856262648752808009e-06,3.365030304295805499e-07,2.900331545276207568e-08,1.007953817050739097e-09,2.225022136264530475e-11,3.711121638556108481e-13
9.908863540556433236e+01,8.981176058106379401e+01,9.354415384693078295e+01,9.054876028660999054e+01,8.898107839025129806e+01,8.764610373714515390e+01,9.411306086690653672e+01,7.604042982956558205e+01,6.394692305307800240e+01,6.022918054818996580e+01,6.449495131986009255e+01,5.472931439994303560e+01,3.832961924055179992e+01,2.276586534562921571e+01,1.402871798403170445e+01,6.832492056040424977e+00,3.365107336408201810e+00,1.301391033141141351e+00,4.739843640611603459e-01,1.775168539003641743e-01,3.902649781775711230e-02,5.988791136169045043e-03,9.886657508059750171e-04,1.869886235701359221e-04,2.502212182271634875e-05,1.566646357305511532e-06,6.578702116832736573e-08,1.842009280130724139e-09,6.332704750273022050e-11,1.699943430986323948e-12
9.992670711840861486e+01,9.999403399930358205e+01,7.914410621432990922e+01,8.818546489119850662e+01,8.438079639310380742e+01,7.263679874275746329e+01,7.458117683718330682e+01,9.716327715037121493e+01,9.797716542344004154e+01,8.523503376472923776e+01,6.330445049120449852e+01,3.553331656174184161e+01,2.212550380054779708e+01,1.431956540600136307e+01,7.554707772604678517e+00,2.833759985734848552e+00,9.047896350354218686e-01,2.436216815901906252e-01,6.435063445575642249e-02,1.565986394391626416e-02,3.860818286719237130e-03,8.894727884813893220e-04,1.604591456761496403e-04,2.543568357543713981e-05,3.463167252105813412e-06,4.327395142954603714e-07,6.753446533667591006e-08,2.676770238191708616e-09,1.113614181605524045e-10,-3.879948806359186790e-12
9.999985166567851991e+01,9.276567213654085720e+01,9.995862365584228826e+01,7.487290113308384321e+01,5.792758632574837208e+01,3.181255174165920607e+01,1.921626368112543659e+01,1.047880169496276359e+01,4.679379926247037247e+00,1.913069254638194217e+00,6.921294170172924698e-01,1.750743487468066906e-01,5.283981727843604925e-02,1.627361685783455802e-02,2.902294284032501653e-03,5.633051476986183654e-04,1.486107384069699364e-05,-2.159279081026841201e-07,9.848798649691023854e+01,2.643024725549442522e+01,5.338018213520280497e+00,1.292134213262765341e+00,2.921800810164911777e-01,6.124226956486846646e-02,1.258057220081465130e-02,2.865620035407461397e-03,3.378408507238108457e-04,5.200174895741166577e-05,6.855509002726439267e-06,1.032706392452811269e-07
9.960907550858820514e+01,9.067687816913179688e+01,9.112750330532202270e+01,9.948054488071586832e+01,9.376429359447894285e+01,9.125886011043300527e+01,8.889167154235909152e+01,9.057315496237583829e+01,9.384671026997534682e+01,9.549880738767541288e+01,6.740055662663365865e+01,4.470372131438177377e+01,2.632603098697018495e+01,1.429190126095429392e+01,6.986612383952277128e+00,2.628831112738242215e+00,8.509371102315745894e-01,3.059062638768257347e-01,7.186027043736281650e-02,1.496747285050171843e-02,3.163481577796905045e-03,6.618096470662881026e-04,1.207803624545867086e-04,1.532054682696731536e-05,1.693731639681292399e-06,1.846080846777333699e-07,7.820007814457005199e-09,3.382727576944922802e-10,1.295450011672400976e-11,2.617389663433173655e-13
9.976727462257426282e+01,9.873098821124609970e+01,9.288746096911437178e+01,8.501615036064769981e+01,8.142887245829771814e+01,6.991317364977707882e+01,6.533802943033512634e+01,7.372276513220977279e+01,7.197916814370294958e+01,5.873107965190818902e+01,4.509352991887233486e+01,3.607486550923184865e+01,2.670041296803428921e+01,1.526843584656376684e+01,9.039130989751791745e+00,4.563225967273909944e+00,1.873935352014000744e+00,8.734912461064134881e-01,3.289291897835762701e-01,1.232249138514807940e-01,2.342803697211894715e-02,4.152934018262273257e-03,6.727754332790365863e-04,1.039062658643799677e-04,1.559332439091655828e-05,2.452242402880917943e-06,3.111393768387586845e-07,1.447158436596859385e-08,5.508544180942745699e-10,-1.041604355826461044e-11
9.984008522063751911e+01,9.818218064044781102e+01,8.659868723468746055e+01,9.999789319850886216e+01,9.734414073393440958e+01,9.995493085960572444e+01,9.966097851155505793e+01,9.999677709074158827e+01,9.971367070743160355e+01,9.999908815503371784e+01,9.906401159625178821e+01,9.857575117019425193e+01,7.516760634833916299e+01,4.882034920025695612e+01,2.615668531559358101e+01,1.050372317874517059e+01,2.375602585747456974e+00,6.353472268544513302e-01,2.416068946433501674e-01,5.973254762933639245e-02,1.008250336927229117e-02,1.779237363513542754e-03,2.558243773332240017e-04,2.387299237595326437e-05,4.409632724341206691e-06,2.312771679382344246e-07,2.292847734291384250e-08,4.411691087488487433e-10,2.118085691239980746e-11,1.022136885689709949e-13
9.999432838674290736e+01,8.246391019140824596e+01,8.863476473031651892e+01,7.750327883888698466e+01,6.300442323648879039e+01,8.254464297367182724e+01,7.574857636530239802e+01,8.728439664895365979e+01,8.593994946942655133e+01,7.491799312469525773e+01,6.819684328132511553e+01,5.607892209545309470e+01,3.050827332724408336e+01,1.350525389578905511e+01,5.244057835652537136e+00,2.147225559519742699e+00,7.764373373991568794e-01,2.851639551295148678e-01,6.902827145833073663e-02,1.783285974700286880e-02,4.454512916638990287e-03,9.684080192374633226e-04,2.153480483899656987e-04,4.771128995621144362e-05,7.166552319999427371e-06,1.080392409705079283e-06,1.818751634760611183e-07,3.212300188539528070e-08,4.211728975582357461e-09,-1.258889291283200242e-10
9.993291700502045671e+01,8.946568411082405703e+01,8.242368602791874821e+01,8.017215889269662910e+01,8.211480931080133416e+01,9.148272534441663595e+01,8.181809940228589539e+01,7.694644945364497346e+01,6.740611494152545902e+01,5.003433709907820059e+01,3.371981558483847863e+01,2.185934165023444820e+01,1.445386294684043094e+01,8.683572979267569991e+00,4.774645501463863795e+00,2.547677916128268993e+00,1.289977066681566198e+00,5.706055784423785804e-01,3.122980383298756268e-01,1.186247873403473846e-01,4.129357379158765662e-02,9.858682353356072389e-03,2.442251303581344408e-03,5.883070913452123629e-04,1.609605585373137884e-04,1.613217101016905250e-05,1.176330003590299547e-06,1.015761609779666721e-07,7.656309413562422116e-09,-2.743184668276172821e-10
