-9.746933547838926870e+01,-6.598524135091059861e+01,-5.952393018730553109e+01,-8.475699755414642311e+01,-9.110854916246917412e+01,-8.795425837623945142e+01,-8.155127442148202022e+01,-4.716670835538426587e+01,-9.108883312817019373e+01,-9.457703915380463400e+01,-7.856778241296770204e+01,-9.430552127574667054e+01,-7.244265429523575506e+01,-9.143842802629841060e+01,-8.477858984158081057e+01,-8.801081557497556673e+01,-8.482271248419341703e+01,-9.427264685022932156e+01,-9.721392251842075893e+01,-9.436086333570987961e+01,-6.918866283607714252e+01,-8.799158443708569166e+01,-8.170647771458172315e+01,-6.908164807432908106e+01,-9.425723765595893155e+01,-8.794021215442721484e+01,-8.790003744493654381e+01,-8.546990345068049066e+01,-7.548902439864686187e+01,4.559315933838650053e-03
-9.054531859999161725e+01,-8.450585142550970374e+01,-8.748021058709112197e+01,-7.216775650182299273e+01,-7.849726685866632181e+01,-9.995959772223299922e+01,-6.591845168150908307e+01,-5.705517643493583080e+01,-9.491978831705283426e+01,-7.514808274873966809e+01,-9.147399864847463391e+01,-8.502443973406241184e+01,-9.086137724750763311e+01,-5.038087639095679293e+01,-7.864552386383175531e+01,-8.497959758622629067e+01,-8.674568869366403590e+01,-7.547173686036082074e+01,-8.125549046809850040e+01,-9.399043543821129276e+01,-8.792485900015545042e+01,-8.768696237087297618e+01,-8.470099494841358023e+01,-6.238685004954734126e+01,-8.145910302733391006e+01,-8.178635620192355304e+01,-8.148438530876063624e+01,-8.480244021510918628e+01,-5.362248354112507087e+01,2.191964119741793393e+00
-9.463669699428058379e+01,-5.352497285850659381e+01,-9.429431929024993053e+01,-6.553198953832863083e+01,-6.280107541662510329e+01,-7.266496247390894325e+01,-8.090011602914121625e+01,-9.418898565129985911e+01,-7.847058160139080485e+01,-9.752643158259235179e+01,-9.096399571651508609e+01,-6.621352195195349566e+01,-9.715030905620508861e+01,-9.736797454290189080e+01,-7.894609558406251892e+01,-9.683736830511786309e+01,-9.759956778879372052e+01,-9.119810615566397871e+01,-9.087752921263333405e+01,-9.107250203010482892e+01,-7.879454663253487468e+01,-9.752297941627664102e+01,-5.920900951818448732e+01,-6.636457928046580435e+01,-9.162823074794491163e+01,-9.460429111790293177e+01,-9.125981880809193569e+01,-9.109937485446945971e+01,-8.227528462799705267e+01,3.184197383888055288e+00
-9.805678354868557278e+01,-9.104984945439316846e+01,-7.231226837224194526e+01,-8.485456459814412256e+01,-9.070990135268412757e+01,-8.471377709327984462e+01,-8.826927113809439618e+01,-9.746197626618877052e+01,-7.238412625081326723e+01,-9.795295673292675076e+01,-8.808899095477323726e+01,-7.846682928391879841e+01,-6.648580504670312052e+01,-7.587166088914514717e+01,-9.732700444480734348e+01,-8.779017397930410027e+01,-9.714726330073537497e+01,-9.440022491542086414e+01,-8.207924593226179866e+01,-9.988384934365291201e+01,-9.738511269347442578e+01,-8.779398779264610653e+01,-7.245435252084416788e+01,-7.860762251174411119e+01,-8.789003187834379105e+01,-7.262227992477350824e+01,-7.200550221535387152e+01,-8.837384831707069566e+01,-9.709592349355040142e+01,9.435842008021332106e+01
-9.683777176101706630e+01,-9.388603304532450977e+01,-5.996435834347347793e+01,-9.763321905068816875e+01,-7.527504408695256188e+01,-9.717404842716462099e+01,-8.117823974362219985e+01,-9.679835491260152480e+01,-8.724111883130807144e+01,-8.189672560689345460e+01,-9.076592535395933226e+01,-7.846280390768932023e+01,-9.140400392837716481e+01,-9.087818479282144324e+01,-7.561139251478265066e+01,-8.169062080875907839e+01,-9.102419331188306728e+01,-6.538024634318853145e+01,-7.866483354266487993e+01,-8.804128748199178744e+01,-8.833663476380731083e+01,-9.387029297535937644e+01,-8.831764731558632775e+01,-7.539819066899629263e+01,-6.914672216319411291e+01,-9.724080538109377869e+01,-9.725249848907164107e+01,-6.301117860085958711e+01,-6.906929635378112664e+01,-8.468993825270930698e-01
-8.833473324394735471e+01,-8.463788880156117500e+01,-9.120876496889930252e+01,-5.063924119117374545e+01,-5.632149680782104895e+01,-9.789883168275478909e+01,-9.108500877071656987e+01,-5.341489928342505067e+01,-9.759238049974418061e+01,-9.404858853513806594e+01,-9.474496073683853581e+01,-9.751501212245598538e+01,-6.915873489201780444e+01,-9.219826514164675757e+01,-9.992337299500429992e+01,-9.116064411352471097e+01,-6.926269753036980603e+01,-9.447579805325057123e+01,-8.490472207904821289e+01,-9.410534185293556675e+01,-7.240373400064974874e+01,-7.580225816620396984e+01,-6.925461686749883938e+01,-9.684883143803830308e+01,-9.409346451142354795e+01,-5.663615094001330164e+01,-7.846019399138008055e+01,-9.138501067263233324e+01,-7.277882589165452032e+01,4.410309390203982360e+01
-9.099664807028285907e+01,-5.598010434797285484e+01,-9.431175361349367847e+01,-9.387498370713846896e+01,-9.687835998108204194e+01,-9.111277399163365942e+01,-9.344506592251914867e+01,-9.369395793115404558e+01,-7.579254832092827598e+01,-9.148016108160024373e+01,-8.516695088499942301e+01,-8.772735469467623659e+01,-8.850917658519226450e+01,-9.417405181329756658e+01,-6.613026526054609633e+01,-8.772392177716395167e+01,-9.704841784868467869e+01,-8.415602396477625291e+01,-9.461669859090939383e+01,-8.143789788118063200e+01,-9.045503131488796100e+01,-7.235335063140719569e+01,-5.945252819065333938e+01,-6.526571392914435421e+01,-7.778781984723508458e+01,-8.803886741113782932e+01,-8.548641238845004864e+01,-8.831616077040220603e+01,-9.114381094986883625e+01,9.139996310512982447e+00
-8.986174411098147630e+01,-7.601907792486998972e+01,-9.075602793951853187e+01,-8.175367164652857355e+01,-6.574635532217044442e+01,-9.061111341739535874e+01,-9.117954436702859766e+01,-8.140038615441521586e+01,-7.809308420914753412e+01,-9.110525445169470515e+01,-9.740051255000788899e+01,-6.924446602790463601e+01,-7.217262027426818349e+01,-9.770249064157235352e+01,-8.479702095122344474e+01,-9.427558627196046359e+01,-7.259402400899833196e+01,-9.118385388135806124e+01,-6.967242596744998195e+01,-7.780954810396667654e+01,-7.244954861190078077e+01,-8.194263857016821362e+01,-9.773599689261678236e+01,-8.720334446023028363e+01,-6.907771565293985816e+01,-7.594644849546826038e+01,-8.841071439092664264e+01,-8.175472417682695436e+01,-8.175428686208633167e+01,-4.995437779563696523e+01
-9.687279896493028275e+01,-5.340155449044745950e+01,-9.731348342714318278e+01,-8.179302622262652278e+01,-6.588945966520853403e+01,-9.737128649749934084e+01,-9.108899221936879087e+01,-7.860397937541968361e+01,-8.180116948211865235e+01,-7.855092013807497153e+01,-4.400739577829855875e+01,-9.727954261724771357e+01,-8.488377772938385135e+01,-8.797472934887477436e+01,-9.427384196473492750e+01,-7.229652021406249673e+01,-7.855336344542502047e+01,-9.111016456454677837e+01,-7.532455877831326063e+01,-9.107807975526934285e+01,-9.748244393729660828e+01,-9.739454178158625552e+01,-9.107270439573061083e+01,-7.225438779779726417e+01,-8.171728147764518724e+01,-9.424719198009110244e+01,-8.170772474314156852e+01,-8.801874700789539929e+01,-4.091824790367086706e+01,-3.452912827899106674e+01
-9.589237452022317143e+01,-7.583463847695099957e+01,-9.093724738929820717e+01,-6.902815382049226400e+01,-8.779420985794203602e+01,-9.439366898057352273e+01,-9.398245414015093502e+01,-9.045325055613194820e+01,-9.138536037323187600e+01,-7.784987713126363928e+01,-6.939039769235141364e+01,-8.125389333847782325e+01,-9.722191008828229997e+01,-8.118941604703887549e+01,-9.757185143721433462e+01,-7.805591852415088283e+01,-9.997139225601421231e+01,-6.607809557874196571e+01,-6.602278087225012371e+01,-9.725711662824964776e+01,-8.175186101684379025e+01,-4.042844500801739827e+01,-6.898987875677524073e+01,-7.228852685292383740e+01,-8.513959219792423028e+01,-9.080192837569586572e+01,-8.740500724521871234e+01,-9.469844250885125803e+01,-8.491764094825957443e+01,-2.514370337253073373e+01
-9.508009485840534580e+01,-9.815150645239069149e+01,-7.500337444848682367e+01,-9.651872875467397250e+01,-8.467286721390084381e+01,-9.493527226125949880e+01,-9.109604321226403556e+01,-6.613806834343893115e+01,-9.391368754383958617e+01,-7.483627997373375251e+01,-9.425292577883629974e+01,-9.083984344636445485e+01,-8.186544990142095912e+01,-7.500362166320287827e+01,-9.657340187386202501e+01,-8.849207466630763008e+01,-7.840896068046986045e+01,-8.821054210702043008e+01,-8.405852881518841002e+01,-9.159691331544046022e+01,-9.101994233826385994e+01,-9.433704263858223271e+01,-8.116888252317950503e+01,-8.515478118332106305e+01,-7.529068792942540256e+01,-9.707684339858477074e+01,-9.717159633675466068e+01,-6.290710532754975048e+01,-6.384325120361215511e+01,1.277005631052892021e+01
-9.817814637175908388e+01,-4.398567447624886739e+01,-8.731853066276823938e+01,-6.606579858293193297e+01,-9.399263148643838406e+01,-7.852740973573892802e+01,-8.744115665177288577e+01,-6.267643323618943185e+01,-8.200350354380805129e+01,-9.767915150261136148e+01,-8.827829866569976502e+01,-9.098243604623461067e+01,-4.693617945272885805e+01,-9.965180027988995448e+01,-9.730358688256862365e+01,-9.454339923110691757e+01,-8.454004055386711514e+01,-8.759181589067999596e+01,-9.048264499376978165e+01,-6.647660798130921478e+01,-7.856979204135087969e+01,-8.434369003190828096e+01,-9.748945095561789742e+01,-9.106093584825663356e+01,-7.845426828906720118e+01,-5.990983433629318711e+01,-4.023938780609992705e+01,-7.017415971128085062e+01,-4.107779207310074554e+01,3.783083911636088459e+01
-9.501912335697214473e+01,-4.739607921358263809e+01,-3.779928103563309350e+01,-4.398285946248486766e+01,-7.847425983260866644e+01,-9.105936141840467712e+01,-8.494654642171713022e+01,-9.119950130435078961e+01,-8.166934786621824571e+01,-7.858924727696359014e+01,-8.788632215353879928e+01,-9.741156631880097905e+01,-9.727081859066251468e+01,-9.739019169737944992e+01,-9.742655651118437277e+01,-8.196058674813289713e+01,-9.755684108375176322e+01,-9.429946334682475140e+01,-5.971606965654395793e+01,-7.220876059640029609e+01,-9.153866713081883688e+01,-9.419056573654340525e+01,-8.799315601035630152e+01,-8.182620728367247409e+01,-9.113826442046872955e+01,-4.711843651747756212e+01,-8.788187678662072244e+01,-8.491871133447716602e+01,-8.465778611214864213e+01,3.765992440320803070e+01
-9.502143958037183324e+01,-7.858000721391857724e+01,-5.938167065381697540e+01,-4.750390964029632102e+01,-9.446695065650332879e+01,-9.395192715734683020e+01,-9.730571921247265266e+01,-9.422625593321980375e+01,-9.097935074867721994e+01,-8.441734214403982151e+01,-8.470215696182529541e+01,-8.426595296911911248e+01,-5.985206266321574020e+01,-9.366746211663844690e+01,-6.599964220968691109e+01,-9.125626077514098711e+01,-7.880610675177695157e+01,-9.702176776144315795e+01,-9.440782820006891995e+01,-9.138949832195091005e+01,-9.140001485711557905e+01,-6.244795997379964803e+01,-6.316663098730754200e+01,-7.221745827187913847e+01,-7.822059872651824719e+01,-8.571980514194287082e+01,-8.783641186307706050e+01,-4.356044240999921868e+01,-9.401465761458916859e+01,4.388052894683139016e+01
-8.760105738288393695e+01,-6.267387008203751719e+01,-5.353662653334639288e+01,-8.480924296051065880e+01,-8.430851794182089520e+01,-9.724146699297196506e+01,-8.176301913654558007e+01,-8.490018638768418668e+01,-6.891480338460820576e+01,-8.809339518175866601e+01,-4.711674322108753188e+01,-2.478863458829099287e+01,-8.146793296131737350e+01,-9.746112900811796464e+01,-8.795119221670937293e+01,-9.738336679514274863e+01,-7.237981331982166466e+01,-6.908808581191092912e+01,-7.862763521263786970e+01,-6.557729829488141604e+01,-6.605776439729585547e+01,-9.102306777496073664e+01,-9.116490002730732556e+01,-9.423081025553348411e+01,-5.328962661543805268e+01,-8.401115507318509401e+01,-5.331581133538482220e+01,-9.754499420479659477e+01,-9.403987713693088324e+01,2.199699782719734031e+01
-9.767820695797652775e+01,-9.743259180088968208e+01,-9.743969627678045242e+01,-9.744056644788959431e+01,-8.760379323432684373e+01,-5.023922381860196396e+01,-8.205633890305603018e+01,-3.745131592724481351e+01,-8.447259471524986907e+01,-9.736245759274980571e+01,-9.752092768908040910e+01,-7.861020547669846792e+01,-9.727681429863636708e+01,-6.952992863127731482e+01,-8.739981680845758660e+01,-9.725104681361888481e+01,-7.534773524907724607e+01,-8.162424123721281433e+01,-8.811480445336079015e+01,-6.268661507264144461e+01,-9.097858641014423142e+01,-9.763515620686806074e+01,-9.740594265873737356e+01,-9.110759941843704723e+01,-5.336569555262926201e+01,-9.273800922026420324e+01,-8.172062056725670232e+01,-9.131520660708450521e+01,-7.848660039457320181e+01,-6.292002032244832321e+01
-9.892994639069753759e+01,-9.431571287195386333e+01,-7.193806388986720890e+01,-8.154010557867543696e+01,-4.701329451401294790e+01,-8.472746180993765108e+01,-9.435376019906475165e+01,-9.419221191085813416e+01,-9.732599860106168421e+01,-7.846571309726654420e+01,-9.437474755596034015e+01,-9.751352887953694903e+01,-9.752211647570327102e+01,-8.781619716142471077e+01,-8.151714376597887224e+01,-7.553678975085323088e+01,-9.093336825373373244e+01,-8.524591394137200950e+01,-7.577507775711055160e+01,-8.449428420192133160e+01,-8.488029128312371085e+01,-7.550116034847221158e+01,-9.431950252847261140e+01,-5.975924094642176954e+01,-8.788600509464546917e+01,-9.425394747708271836e+01,-9.128667077195981960e+01,-7.234758545207557745e+01,-7.845063406646075066e+01,-6.405758666717282779e+00
-7.934877587121523845e+01,-7.812313101372713220e+01,-9.732995930147596653e+01,-9.114001750103193444e+01,-9.129924148444463583e+01,-8.786789626916001339e+01,-8.442759359795822149e+01,-9.719481453392940296e+01,-9.705012903751205045e+01,-8.779689698583123914e+01,-7.890066665923885125e+01,-3.443187788323700715e+01,-5.673033310444464661e+01,-5.346456694066977633e+01,-8.783232857509884184e+01,-8.470021363263259673e+01,-7.881051123071262055e+01,-6.626201784048296872e+01,-9.391087398721577983e+01,-8.800660821604658679e+01,-4.398256056289757510e+01,-5.974457513802281028e+01,-7.571749858326421645e+01,-8.175449317055044673e+01,-8.781250277358761025e+01,-7.265701523412531060e+01,-9.760178556924498139e+01,-9.407749632128161466e+01,-4.698497440818987769e+01,2.225528569978839855e+01
-9.418527838660655505e+01,-7.856183821199357453e+01,-8.832013868810943791e+01,-6.260664302992334029e+01,-4.151622725074391695e+01,-9.121622021538345848e+01,-8.824781399144421812e+01,-7.264250591711810046e+01,-8.816807742978910767e+01,-9.094066857514856395e+01,-9.135678010426374840e+01,-9.783103441913014819e+01,-9.751122318536974376e+01,-5.341148852778309220e+01,-8.090402497263310977e+01,-7.547573411844038560e+01,-7.236000191746740029e+01,-9.092429998293904703e+01,-7.844188079103527400e+01,-9.469548610486822326e+01,-8.802424173315102962e+01,-9.659054292085467353e+01,-4.407093180049260184e+01,-8.572412759718523034e+01,-9.726833169741672691e+01,-7.832474589530465892e+01,-6.005126693036776686e+01,-9.665547574018732746e+01,-9.110747948363663795e+01,-2.536348366059640469e+01
-9.518383331544181658e+01,-6.289850464554334053e+01,-6.281709175606049911e+01,-6.907056608951006638e+01,-8.802844646328605904e+01,-7.850332979798172062e+01,-8.820268076390637191e+01,-6.588003975930725176e+01,-8.414050420981649836e+01,-9.748605261573959524e+01,-6.908804074493546921e+01,-6.894318243160067539e+01,-9.657007883407938209e+01,-8.176000439123410501e+01,-7.533621288344200195e+01,-8.482425347692975492e+01,-6.583972631118942331e+01,-7.871722044571183119e+01,-9.743383903999827567e+01,-9.437765381302605761e+01,-5.985751005917610712e+01,-7.225866464445790882e+01,-7.553845441487040091e+01,-7.206731223066444159e+01,-7.820213098530331308e+01,-6.300443665097927948e+01,-7.905158894228826227e+01,-7.199719967145534838e+01,-7.813755232063708434e+01,-2.841696533186331308e+01
-9.398840843001474354e+01,-9.725482472583242100e+01,-9.442722373234494171e+01,-9.167040333908735761e+01,-9.762896202695731063e+01,-7.877554503854851475e+01,-9.721569673413603141e+01,-8.159382686123426254e+01,-8.190342453309715154e+01,-6.273268450941650798e+01,-3.460601681891613168e+01,-7.820445395118552767e+01,-6.025052913780324104e+01,-9.194905494070643215e+01,-9.131442662363265583e+01,-7.854892051018794064e+01,-8.511770044772757160e+01,-8.139703178481661894e+01,-9.115427185468527682e+01,-8.755056266304396217e+01,-9.131174042216088083e+01,-7.237070230649572977e+01,-6.885395883213115553e+01,-8.146327485103650190e+01,-8.820302024158515053e+01,-9.746254184679335708e+01,-6.248744329609404247e+01,-9.460988414800178248e+01,-7.532858738464018700e+01,-5.961211640331659289e+00
-9.825117964231702672e+01,-6.897134964893955100e+01,-8.784498908197083722e+01,-9.718024558195041607e+01,-7.560798109748606066e+01,-9.784568933315797779e+01,-9.779247091673920522e+01,-8.211579436007353650e+01,-6.278974733587843815e+01,-8.834528945284969836e+01,-8.526074901058953515e+01,-7.255807013076524470e+01,-9.774334526702203618e+01,-8.193642338369595279e+01,-9.100641966914152192e+01,-9.068378487457778192e+01,-9.366035794779247681e+01,-6.591683885991521663e+01,-6.517928898769419277e+01,-6.680267762348006499e+01,-9.108894660508290997e+01,-8.141355048595696076e+01,-9.048449141251141725e+01,-8.172376804637917758e+01,-9.376489751662450089e+01,-9.451328359941069834e+01,-9.145137805165342115e+01,-8.493632725736667055e+01,-5.962320856027263005e+01,-1.272418968880695189e+01
-8.494930739950457621e+01,-9.107272658201880233e+01,-8.458684487432951471e+01,-9.156908537211573673e+01,-8.469672586159326499e+01,-9.423297895338392038e+01,-8.828465111348218386e+01,-9.114617048227530915e+01,-5.994586224406223351e+01,-9.473908752947586720e+01,-6.031125492983760239e+01,-7.258073516745109544e+01,-6.625630669818691842e+01,-8.460799011641552170e+01,-9.739870472443863036e+01,-9.415199263874423252e+01,-9.476120306563585416e+01,-9.099544558745117229e+01,-9.160120718114113458e+01,-8.163997536571160651e+01,-7.244810958638618104e+01,-9.713742629658059968e+01,-8.153702716698826691e+01,-7.224570295748772253e+01,-9.759430525733191075e+01,-6.568328641530834489e+01,-8.199298657440169791e+01,-6.316089246760989795e+01,-9.107071421335903949e+01,1.545304143544714037e+01
-9.499484295217314411e+01,-7.848144805319481065e+01,-9.415716003382506472e+01,-8.169796610430825012e+01,-5.952297364492598319e+01,-7.835822535379826093e+01,-5.342747744764110251e+01,-5.971788460864530634e+01,-7.541635201238203479e+01,-6.284372594489488506e+01,-4.080836819840546070e+01,-7.885598678833061115e+01,-8.792583186560838726e+01,-9.111568183421501033e+01,-9.440077842902034888e+01,-7.856716099597910841e+01,-9.118390019148390024e+01,-7.859093593216829277e+01,-8.166544070948583567e+01,-7.226382182437376400e+01,-8.169001771490185604e+01,-7.857143853860503668e+01,-6.913248120483437731e+01,-7.478809602478182228e+01,-8.166818016456997498e+01,-7.543151343363881267e+01,-6.600549840251093769e+01,-8.472092974773123331e+01,-8.795891055245952828e+01,-3.105644458628943383e+01
-9.374582982219367011e+01,-8.148185886761494601e+01,-6.868887288791040646e+01,-9.353570796008473565e+01,-9.385520305130496865e+01,-6.605843762171670619e+01,-9.747081941327726895e+01,-9.109299747486002730e+01,-8.474992099347313967e+01,-7.554457031273406642e+01,-8.181349132267189361e+01,-8.481481819250707588e+01,-9.785514315763867899e+01,-9.736817052676977369e+01,-7.163483237119491776e+01,-8.781837480254363015e+01,-9.102818505924142301e+01,-9.400147631109068413e+01,-7.240983856794682083e+01,-7.215690419754021434e+01,-8.782756021082926168e+01,-9.706534028989177898e+01,-9.425983186317598950e+01,-9.776582795015741567e+01,-8.826284961272568808e+01,-8.799553049212313738e+01,-7.208773887341395437e+01,-3.482952803419792787e+01,-3.440515819980853252e+01,-6.590182525063976726e+00
-9.881426006968496267e+01,-8.455467444077832795e+01,-9.425801990472601233e+01,-9.135320760307590149e+01,-9.706170493053066650e+01,-8.458213040152800488e+01,-9.070462092348981287e+01,-8.811022093455618176e+01,-7.170372389199206964e+01,-2.438176516817130590e+01,-8.293950132757659333e+01,-9.104275983430471797e+01,-8.851359749447263425e+01,-9.773875835173222981e+01,-7.840503253999652600e+01,-9.698406300834965066e+01,-8.803892686642747378e+01,-9.145419660921820082e+01,-9.131407784762156155e+01,-9.172977356029392126e+01,-9.419599111150746751e+01,-7.594312046041298458e+01,-8.722197981959132562e+01,-5.007474995419204333e+01,-6.867985953868159754e+01,-9.845446186515687259e+01,-6.643151893507457828e+01,-8.807781155370744841e+01,-9.429849866932059399e+01,-1.259503886075770396e+01
-8.439545892933649895e+01,-6.920446474953986638e+01,-7.865993293556954313e+01,-9.091483708183514523e+01,-8.503114306378624576e+01,-9.124477768204674533e+01,-9.756262210350394071e+01,-7.257420022400442861e+01,-8.523902378083262477e+01,-9.109538658911458242e+01,-8.803188800342539366e+01,-8.470621571697883212e+01,-8.482747316058771503e+01,-9.734615405407279809e+01,-7.550701710772885633e+01,-9.387311116741911121e+01,-8.487437681061837225e+01,-9.736022139389774566e+01,-9.743375580207249698e+01,-9.420272552031494229e+01,-8.796662591310504808e+01,-9.119604598453044275e+01,-7.525022156962798192e+01,-9.120215695769358888e+01,-8.468367950815726886e+01,-8.472839238316883836e+01,-5.968125732251179727e+01,-9.487868168989781736e+01,-7.228378918658989960e+01,1.887371265223379524e+01
-9.804452548159073899e+01,-7.535509251282032039e+01,-8.159855804109437827e+01,-9.112413603004682727e+01,-8.528580306685647372e+01,-8.236577510161454541e+01,-6.919513021903161132e+01,-6.871000625005180495e+01,-7.566428144540198275e+01,-5.657567491998830178e+01,-9.463333881193844377e+01,-9.210565769157015836e+01,-9.092919553983374215e+01,-6.561764182986074445e+01,-8.833061554632223533e+01,-7.187164218174963537e+01,-9.699436137411989023e+01,-6.929683983444816420e+01,-9.843754040622170010e+01,-9.056093822732887588e+01,-8.473791331231863921e+01,-8.173356350900279210e+01,-5.662220300943922524e+01,-7.991054467701165720e+01,-8.777394083438970540e+01,-9.090736123329635632e+01,-9.115616983813249874e+01,-7.845178171561992997e+01,-9.478664314221948928e+01,2.872192383130152571e+00
-8.268737596786958477e+01,-8.487784536893934728e+01,-6.599430669167659858e+01,-5.355105862689384111e+01,-4.704175924559414312e+01,-9.734301833400334658e+01,-7.841135508217202243e+01,-6.003773689348454923e+01,-8.465005679220435297e+01,-5.669480790942182580e+01,-9.730939670269525266e+01,-7.527387130871885290e+01,-7.217754947068381455e+01,-5.908155855516437782e+01,-8.396358408326328515e+01,-4.731043464592775649e+01,-9.424733192276738691e+01,-9.413056196231968897e+01,-8.163670510034802419e+01,-7.842774118212362566e+01,-8.792636763774540043e+01,-7.886102494399239049e+01,-6.604533565318992316e+01,-8.752125477905543960e+01,-9.094034937273237063e+01,-8.511890056201059451e+01,-9.112452107449509242e+01,-8.496755073755505805e+01,-9.121226464972701820e+01,1.887890013786214638e+01
-9.900293874833772634e+01,-7.545773271007287519e+01,-6.281152080745422950e+01,-9.110247051640513405e+01,-9.747286158819005664e+01,-8.802694875872548153e+01,-6.596664170733332355e+01,-9.417587677509851574e+01,-9.107697163788061800e+01,-9.419202150439014076e+01,-9.741713674441832893e+01,-8.790788706376807227e+01,-8.484787645235424236e+01,-7.218497834191009588e+01,-9.748011074213292204e+01,-9.744019693318118414e+01,-8.178278502818471907e+01,-9.751117769231484544e+01,-4.402251899370696009e+01,-6.592141322591058383e+01,-8.161188047624916919e+01,-7.545559481570631988e+01,-8.483059587011109670e+01,-9.729007948606209766e+01,-9.431642910547458314e+01,-6.918355512159145349e+01,-9.737179263113495153e+01,-6.913024024666097489e+01,-5.666489524712650905e+01,-1.262504590503993640e+01
