-6.510174462522507193e-05,8.814719628997890822e-05,-2.729247802202241938e-05,-2.047434803949701565e-04,-3.910896611065394624e-05,2.675007091509876579e-04,1.243349404431508503e-04,-9.372825845005779046e-05,9.577305544316162388e-05,-2.370549030533009992e-05,1.512112228309170749e-04,4.431347349212063967e-06,-2.841115703533823389e-05,1.196173176666749373e-04,-1.592528724887797909e-04,8.027026230937271136e-05,1.646627272437753355e-05,5.265410680034592538e-05,-2.209022393448266527e-04,5.237891094156284222e-05,-1.628833302818907843e-05,6.480043102395351097e-05,-8.992926762176923372e-06,1.440217003390189778e-05,1.169580060200163952e-04,-5.107817240919588922e-05,-3.016353832794313469e-05,7.364473282766475018e-04,-4.168372035789976880e-06,-1.660114057855612835e-01
7.629628761096353103e-05,6.557412709287937722e-04,-1.378490794683531501e-04,-7.929168022410424050e-05,1.429308828544676075e-04,5.999978454118809040e-05,3.132583202835729260e-05,-7.627894695812183830e-05,-1.169046901454393500e-04,-5.721353987689276651e-05,4.299396905288906915e-04,3.742119603112956517e-04,-2.651285688288993478e-04,-2.822922080334260030e-04,1.112560499957993096e-04,7.098486339244076341e-05,2.075892630541276011e-04,1.659199876563317952e-04,5.977247029225705175e-04,-7.018640328791126684e-05,1.859889138696819912e-04,8.553129643415291830e-05,-5.795437228391745474e-04,4.346663373292699879e-04,-8.545193303350163483e-05,-1.689341990147467997e-04,-3.663027218709972944e-05,2.544247211667922471e-04,1.970160451882850246e-05,1.491185473896076419e-01
4.159938959342159628e-05,-5.050163093668861306e-05,5.050755480839382993e-05,-4.203025795564200079e-06,-2.999999491486686357e-05,-2.796045475966964775e-04,7.944809983805925773e-04,-5.628068719328670590e-04,6.972489432593741490e-05,6.758961147364844139e-05,-9.386893359401035389e-06,-1.096203346571233809e-04,-2.193474528278004565e-04,2.571599338872982451e-04,1.514811439684189145e-04,2.337394495986277090e-05,-1.400676254223119069e-04,4.475144641476180095e-06,2.139811498055880698e-05,3.696965501402273515e-05,8.788421653436320822e-05,7.289310663394490074e-05,-1.013903004491611590e-04,1.935916387984310189e-05,9.974498326436558439e-05,1.154145683922502889e-04,9.535126958124575660e-05,-8.237740614261056477e-05,-4.755479213351987421e-06,-2.281916617260004720e-01
-9.632571561832219240e-05,-1.840503828333415199e-05,-2.401933372055459930e-04,-4.457933304523081620e-06,-1.696683605471489627e-05,3.074940670535580801e-05,-2.633237305454489498e-05,1.614725350765882771e-04,3.093338217867151215e-05,1.172914475130548443e-05,-2.720618379950322349e-04,-1.102427830870351776e-04,3.953900535162349758e-04,-2.657954745194110002e-04,8.670156363442095093e-06,3.967807095093524669e-06,-1.267301300802184622e-04,-3.142649669936341581e-05,-2.486049455375289907e-05,-2.235512920904362850e-04,1.260533041631829970e-04,-1.589093949148350654e-04,-5.396110795935813538e-05,3.857222202711581836e-05,-2.467348246231439182e-05,-1.078829694353861687e-04,-1.679901224907643401e-05,-7.912924521697242697e-05,-2.936520207701623539e-06,1.115636131045543711e-01
-9.968398482798652299e-05,2.750748748589291659e-05,3.157952095037379879e-05,-7.249288846570107147e-05,3.220112879555141703e-06,2.672089050170378807e-04,-8.694100609513559269e-05,8.041908070707756717e-05,1.389837465342087124e-04,6.427065236943857310e-05,-3.877466086111029317e-05,-1.300507860976930330e-04,2.817193544256694205e-05,1.327505010434284380e-05,9.519365271871304450e-05,-1.463911197284372084e-04,-1.027418591041497897e-05,1.090655839439755716e-04,6.691262249493630853e-06,6.299132721146088250e-05,-1.512821502308245043e-04,3.251579278499598050e-04,1.821773085555571906e-04,9.404979248179983760e-07,-8.335046657269506380e-05,1.539329734607091933e-04,-6.707585782004746181e-05,-7.844147400537846261e-05,-1.229304453543947135e-05,2.913717100684400443e-02
-3.167277963143982835e-05,-8.383766514607778714e-05,5.704682866758371560e-06,-8.428367659553692725e-05,-1.715768173835989280e-04,3.473534136518031652e-05,-1.549104130803856990e-04,4.193820627711638405e-05,2.633294993580259299e-04,-1.355974282736280919e-04,-5.316631563175563469e-05,-3.857058979941891752e-05,3.802505605428954660e-04,4.878096252139299625e-05,-9.145006673870379702e-05,-3.186115212065089987e-05,-1.270648514753809275e-04,-2.553511928397966639e-04,9.619496109116601012e-05,-1.454211221008929432e-04,-3.696326586493501221e-05,-1.070173486477936142e-04,-1.637395192592951880e-04,2.018846212608390111e-05,-2.266447085054534101e-04,8.315243795577497755e-05,-1.220385460379287934e-04,-1.282550265496471356e-04,-1.729290254194362742e-04,-5.217030686004305549e-03
6.927996999257496206e-05,-6.460869416026816835e-05,-4.356931202342088916e-04,-9.333162034488420356e-05,-1.802233890455573787e-04,-8.897685686328897807e-05,-5.646434510301515488e-05,4.602608430602919210e-04,-1.811024653761526414e-04,2.630040005302297480e-05,-1.180154072544948039e-04,3.232325823094735467e-04,2.489601374681634275e-04,-1.395107559305705785e-04,3.476043138406009151e-04,-1.269089173677548517e-04,2.093841850012908299e-04,5.390248825153531485e-04,6.493538149729860976e-05,-4.880432119999160786e-05,1.814617849064466715e-05,7.726670421211022811e-04,2.889417377152707312e-04,-5.256489153305182418e-05,-1.163201531056843241e-04,5.233005073558340698e-05,8.946730731046859239e-05,-1.149820739723672039e-04,1.155590858643314490e-05,-8.566895554630736542e-02
-9.427125872904238758e-05,6.254464173205274069e-05,-1.162353184129333365e-04,-3.841573997997236835e-05,-4.557980967164574092e-05,-1.042615575531434994e-05,6.881570687177707905e-05,-5.046046450378138072e-05,-4.685075847214327364e-05,-6.837242332743617701e-05,7.573123526728018262e-05,1.683602429962265348e-05,2.171454084207900015e-05,-2.987727609428811261e-04,1.033859027638461408e-04,3.676415358877082039e-05,2.753280027882468102e-05,1.882243473768066604e-05,-1.315333150228412879e-05,-4.751354762605860600e-05,9.723805804548357377e-05,-2.966771015864767648e-05,1.016679741490708414e-05,-4.086361235603259203e-05,-1.736321658613679145e-04,6.610245975711116447e-05,2.455073815821271282e-05,1.061442705228978438e-04,-8.974877370967882634e-06,5.355275572281420482e-02
-1.755837864889713505e-04,2.565466599161080529e-04,-5.269934913185819433e-05,-1.846175165581640388e-04,-4.658040362319704414e-05,-2.317800915350603271e-04,-3.632763895985488393e-04,6.245815435153936640e-05,2.088785609295581882e-04,4.108727233489480198e-04,2.543556240318936503e-04,3.292547497945265449e-05,-3.851064494969999737e-04,-1.417713400479199252e-04,-1.546234649325579046e-03,-1.126096914924443784e-04,-1.333293198522521978e-04,-9.513960904799580490e-05,7.032555382629558963e-05,-9.122871189118046670e-06,-5.718628869684439170e-04,-5.035365745153319399e-05,1.686447575621757714e-04,2.219524783904860304e-04,2.073107688581118263e-04,2.628231367754622406e-04,5.307803410924779490e-04,-4.099442592143467414e-04,-6.035734699624054338e-07,1.100076640772382555e-02
7.179747810812282544e-05,-7.557226540916739572e-05,2.929131795437846104e-05,-2.698968816952928857e-04,-1.896822871126503771e-04,1.353934408219278146e-06,-3.579308875362647072e-04,-2.903443852960727674e-04,-3.682298772880593916e-04,-1.754256385589478807e-05,4.432772910472526553e-04,4.183482241807961869e-04,1.933802684627670130e-04,-1.488506493600404021e-05,-3.275750142741802335e-04,-8.058309139479403332e-05,-5.616780050481870457e-04,-1.437935742334725741e-05,7.176553003169191863e-05,-6.730763559802492196e-06,8.809494490543864334e-05,-1.723209141143651794e-04,1.691259697828719448e-05,4.956463089161919746e-04,2.048748104116012879e-04,-2.036064337908291124e-05,-3.687199318316744761e-04,-1.188888974780367161e-04,1.806931006808658587e-05,-1.950874844694036950e-02
5.737691008743299071e-06,-1.700940440892134014e-04,4.216553028398667099e-05,9.369652714226585171e-05,-1.039325610789394337e-04,3.681599948920443957e-05,8.967560432412921567e-05,-2.866656764511712487e-04,3.627665949920602217e-05,-3.168290326895085692e-04,4.996938529628481537e-05,-5.091385030360484203e-05,3.933748769908923602e-05,1.137378606374083810e-05,5.071708717903230618e-05,-3.316471071202224869e-04,2.772343649597084324e-05,-9.554548848774943072e-05,2.176986483696486757e-05,-1.005132267855468049e-05,7.706579925480484480e-05,4.568641803043731523e-05,2.927917528786152818e-04,2.372830974432680793e-04,-1.696816371695325260e-04,1.967848708054015065e-04,2.345496084732237043e-04,-3.506889426661001139e-04,1.067386647096029865e-04,-6.080590104043127712e-03
1.100502480426850295e-05,5.392100524395703685e-05,-1.083437113497951111e-04,-7.553581167967845383e-05,3.632000521819908032e-05,8.857933015827876137e-05,2.458103071269118539e-04,1.715869866327499667e-04,3.941001453914217865e-05,-2.218836756664695138e-05,-9.008510913655759511e-05,2.340529793049650302e-04,4.225692070334759740e-05,9.939503856773681981e-05,-4.568409454929952678e-05,1.668165411967341253e-04,2.112959879146723114e-04,-2.237468023588624108e-04,-1.149193171344556612e-04,-6.738788226197606548e-05,6.494967199965185180e-05,1.170909214163068119e-04,1.964250092409162095e-04,7.949398837562231908e-05,1.926009809149576712e-05,3.757909257450802354e-05,-2.571854273501007261e-04,1.169661103722323137e-04,-2.593485950963245922e-05,3.564552953437838401e-02
2.639918278386412659e-04,2.080455514938089445e-04,-5.885235362204334830e-05,-2.432428261049453418e-04,1.334478337641051998e-04,4.170976850750836653e-05,1.315334848368724752e-04,1.241154101500491235e-04,4.286624662127601934e-04,-5.184853130534861629e-05,-4.967007953988621696e-07,-1.232291820505623713e-05,1.049866547916736959e-04,8.592748086211251775e-05,-9.510353228338545292e-06,-2.819004638190375270e-05,1.236220512254177809e-05,2.319350051143408706e-04,-3.832447424587698579e-05,-2.714183637948429601e-06,1.919742345054287495e-04,-1.576044069643925958e-05,-5.609116039346327692e-06,-1.160165748459687947e-04,4.096290179371751871e-05,-6.983621759162816564e-04,1.978306458692195177e-05,4.172234855451244652e-05,2.214946771458656152e-04,-4.079448734648157687e-03
1.417749386027065790e-05,-6.011587493351156245e-05,1.045790062936884803e-05,1.932860643601778510e-05,-5.304311442523102285e-05,-5.592385624849746384e-06,-9.201896347104391227e-07,-5.982932430004151857e-05,1.027846735312735096e-05,-1.026000493834948149e-05,-1.122733420767157871e-05,2.454567687361088838e-05,-7.463690819203920015e-05,-7.761296413580779291e-06,3.073482416789248236e-05,-1.838881733377360631e-05,3.291173457309549140e-06,5.323867559762825722e-06,-2.822874454961487155e-05,5.523958525545213267e-06,3.155766651128430450e-05,1.155282241309147579e-05,-2.671768347813778305e-05,-6.418702672422052385e-07,-5.399100951631716943e-05,-5.150071229989289511e-05,7.129375279692646461e-06,-1.257244601420864254e-04,6.174802803844345322e-05,5.504645146029286604e-03
3.242261066100003372e-04,9.620686129109412977e-05,6.649054944624453311e-05,1.396812023694590874e-04,1.986895649238879912e-04,-3.876847921225075170e-05,-1.068117060883918071e-04,-1.792598098996256624e-04,-1.092109842612238408e-04,-1.755185639533123759e-04,-2.810824511335564726e-06,3.961353936235405016e-05,-1.680447207378758269e-05,-2.471629486354618940e-04,2.384520181053260220e-04,-1.247401287604056868e-04,5.727909257396562245e-07,1.990266206181497686e-04,2.757057744488586705e-04,-5.477882235448010859e-05,9.201888605231453957e-05,1.978783602618850400e-04,1.674222120621366740e-04,1.211312239913095662e-04,-1.898919700533103854e-05,-4.810077654507178223e-04,-2.528933355185274842e-05,-1.310366300056874404e-04,-1.013690472593672143e-05,2.730692834197264163e-01
-6.283500016904021445e-05,1.864979709363091495e-04,1.327137137839780648e-04,7.619468600425848101e-05,-1.153637542016856148e-04,1.999781440785599977e-04,-5.599048186063127522e-05,3.324675383948058702e-04,4.854281865564079914e-05,8.685733256559196637e-05,-1.848229752371153070e-04,-2.406109775128773869e-05,-5.611041182588910560e-04,4.213142701304238466e-05,6.319498730871804916e-05,-2.959320980643620220e-04,-6.133242252738492148e-05,-3.794552319772880240e-04,-1.237645092065130584e-04,-2.704980499536929132e-04,8.351275467067926996e-05,1.773687487059429194e-05,-7.364122039616794509e-04,-2.142875113098504606e-04,-2.151540684913965892e-04,8.551629624978216468e-05,8.663883340864425922e-04,-1.372866895748000389e-04,-6.091049233163967554e-09,-7.141521590879049697e+00
5.650011849285410339e-05,-9.445654743396803476e-05,-7.081660657754088647e-04,1.117665933490236011e-04,1.279851900760756221e-04,4.242013298199268355e-05,2.387255682684870310e-05,7.613229841701970116e-05,-1.737586815597019448e-04,-5.214724127643385243e-06,-1.323434469240987931e-04,7.315826505881196896e-05,-2.853525278969101195e-05,-1.783785749509632823e-04,-9.679828463787702004e-05,-3.470252834196237536e-04,-2.903433830792107902e-05,-4.133539230054369853e-04,1.035057468625508347e-06,-8.074243399122307948e-05,7.993203449331879465e-06,-9.492804095015226892e-05,-5.977289939741344796e-05,-2.315638205292646289e-04,-6.483822266228316119e-05,2.121367018465518265e-04,-4.061277722511965260e-04,-6.498413846040363773e-05,-6.668502214303956464e-06,-1.842298180251520767e-03
-2.769791218979080600e-04,2.824432848705253412e-04,8.179107462958958030e-05,1.480222976777355022e-04,-1.103335197894799878e-04,4.256821315081822004e-05,-2.002221982417608316e-05,1.409404309848995046e-04,-8.024807334135137865e-05,-4.382658787878943310e-06,-7.544156395397923058e-05,5.027458249925390309e-05,-4.002087124809040961e-05,-1.930150086152607886e-04,1.693758194627261818e-05,9.005923736676439998e-05,4.155919409120321928e-05,5.919857813724961973e-05,-5.158245503497566390e-05,5.810405907596854130e-05,-2.508866044022558064e-04,-3.659098439540523775e-05,-1.462243308484590092e-04,3.951176862275083621e-05,7.474972268506410711e-05,-3.601280430217009801e-04,-1.472659467971119812e-07,2.387460613467369834e-04,3.153383521496337758e-05,-3.030266008462881647e-03
8.917461863911928547e-05,6.363449759560804958e-05,8.849849373880914067e-06,-5.194852826775171132e-04,-3.261921836372884236e-04,-5.049201737337657200e-04,-2.781587431083662728e-05,5.794281920405227893e-05,5.415361008631850868e-05,-1.050874849785718371e-05,1.481743098568518682e-05,4.472278897761195024e-04,-4.202435818405373606e-05,6.353349709128960194e-05,-5.266864046958538465e-05,4.166044861570340611e-04,6.271476484752026175e-05,2.551753417214047356e-05,3.093951550117802281e-04,-1.561022745837037736e-05,-1.951355852037827657e-06,4.074771352161846594e-05,-7.265958588455226862e-05,-5.052159524391232771e-04,-1.467539809361437914e-04,-3.608487052111653139e-05,6.188045714293082021e-05,-7.320875758975642212e-06,-1.379050994407417934e-06,8.281767948184580730e-01
2.642389311448199200e-05,-3.218773841008121727e-05,2.822556983490602208e-05,6.156878348858655357e-05,2.316992370462274604e-04,6.030108927777274664e-05,1.139670109213739794e-03,-1.888653100613039518e-05,4.970762189375674392e-05,1.140437591657414662e-04,-2.174399099829573843e-04,-2.542538876914335094e-05,-2.820779245418371752e-05,1.159568196020081956e-04,1.489008694780384034e-05,-1.101501352840045196e-04,-6.948066918562235310e-05,6.362830708213224051e-04,-1.597172920638457262e-05,-1.752302200958856708e-05,-1.337399974405155325e-04,1.085522857363222307e-04,1.178770732049603327e-04,-2.451404414490201416e-05,2.231767717557647422e-05,-5.444051917875949363e-05,-3.472041382194782804e-04,-6.123805409797597292e-04,-1.242330443130705389e-06,-2.458081858253517549e+00
-1.707438712213200504e-04,-1.023933801994561131e-04,-1.528336409920120544e-06,-5.810483785377411754e-05,3.916447875950749527e-05,-3.078130514833804576e-06,-1.027042608456760165e-04,-8.800317448048605316e-05,-1.073888969079846048e-04,-4.587021349863648053e-06,5.810077386085446896e-05,4.035091202243337591e-05,-8.560015713734066289e-05,-2.691850164757208987e-06,3.155448887783544068e-05,8.551286152505565858e-05,-2.568203751087050745e-05,1.403032688887811020e-04,1.792323251364135373e-06,8.953217830307068185e-05,-1.051527413068985826e-04,1.477808801240643383e-04,-1.909284360242264483e-04,-4.759544081779055552e-05,1.130336059608950751e-05,4.985787359627907736e-05,-1.409596125597554391e-05,4.756119852652810340e-05,3.293551179605510833e-04,-1.112844046275179855e-03
1.061171846050117654e-04,7.656139005833282924e-05,-1.793714053789199404e-04,9.765707262258188843e-05,2.006220426350998484e-05,-5.487633117893622667e-06,-7.723610897897193475e-06,-3.586521813751937618e-05,-2.609384637449739620e-05,-1.995078885920776446e-05,1.499117338238026081e-04,3.035362295339804478e-04,4.386207335315403711e-05,6.333912274825648973e-05,-5.845775602605741438e-06,-1.973330573544057056e-04,2.953148670465338254e-04,-1.200825601261191012e-05,-2.935991535331158192e-05,-3.931202737295725952e-04,1.683057055268189219e-05,1.414078601448594686e-04,-3.263996923628526952e-05,9.429161078216236416e-05,-6.595958150034890834e-04,-2.437434627479322483e-06,2.813706120725681777e-05,-8.628539150694425970e-05,-1.346869028217715432e-04,-7.856248534735108327e-03
-2.030784739677151421e-05,2.286550324828186525e-04,-6.117221585409397442e-05,5.902243921996674426e-05,1.917543281211096361e-04,1.913056309474014613e-04,1.793764611033132179e-04,-8.100326184255087999e-05,-3.953929687788123508e-05,1.656537034984692308e-04,2.443177774525825355e-04,-3.942570174727361653e-04,1.750275773105727090e-05,-2.392912384400840121e-04,1.622830508904766654e-04,-3.043289511901767306e-04,4.144263431383920691e-04,-2.952083741268556722e-04,8.325789886903449497e-05,3.341355844158525696e-04,-8.612379843964147188e-05,-4.196960706686910880e-05,-1.176851873442514088e-04,-5.555106987263000440e-05,-1.098497110663329557e-04,-1.054569754907351466e-04,4.093788027048664529e-04,-8.244532626381530899e-05,4.273291548358862941e-06,3.472193348677795558e-03
-2.788646195677787869e-04,-1.324510983243294823e-04,-3.042559323594403787e-04,1.289425457522009856e-05,2.626126911619115702e-04,-4.473667624966780196e-05,-6.084772143308183473e-04,-1.141043475999645222e-04,1.521064166743713269e-04,1.046970657146245826e-04,1.153969433412796751e-04,-1.711437647270965456e-04,-1.131046447413416346e-04,-7.502214518117708564e-05,2.989716506382884527e-04,-2.326393485388874281e-05,-2.567522743224602392e-05,-8.628913676390133781e-06,-8.770666437435993285e-05,9.068734930438880341e-06,-5.511932807180846075e-05,-1.701094914348402168e-04,-5.935348379583257065e-05,-4.003685321609745337e-04,-1.291050862762527078e-04,-2.272612114563689399e-04,-4.162123414520843047e-05,1.759017443295550855e-04,-7.164544111711844160e-06,-4.843414041182438068e-02
-3.825756320269656134e-06,-1.557649917592540071e-04,-8.617134080722157428e-06,-4.804037904249741588e-05,1.092719870369101734e-05,1.469645798546443259e-05,3.443479686548725418e-05,-5.476677033251825039e-05,1.280804801565225135e-04,1.809104848610992286e-05,5.423703328586588753e-05,2.814575333279350773e-05,1.031545723637776116e-04,1.327746987253359890e-05,2.998976600526733781e-05,-3.923247423954746479e-06,-3.217420681860086077e-05,2.018232436297634602e-06,-5.813024589267799862e-05,3.141638815533754985e-04,-6.086629409157167541e-05,3.151754045885422786e-05,6.011517781247450488e-06,4.770365515301779508e-05,-1.268476348553141458e-05,-1.773074006083082740e-04,-8.097048911189347580e-05,4.354520403212665394e-05,5.971876892323111708e-05,3.137426435221199461e-02
6.259142924309072731e-04,2.029755867383597351e-04,-7.963270118034889529e-04,-7.969074922571189835e-04,2.360284644346783756e-04,-7.985443189650453383e-04,4.755078744558093983e-05,-2.894223202590904143e-04,-1.589761370151257438e-04,4.349181194762704694e-04,1.010398127531388903e-03,-1.043301935795878238e-03,-2.345738648016935186e-04,6.307536856578903383e-04,5.353385241386146478e-05,7.172475827893611076e-04,1.035032793793377675e-04,-1.275614146243268636e-04,-9.125312059374881537e-04,-4.847993155823479648e-04,-5.782630173726492802e-03,-3.836928490144529648e-04,4.734280857462602114e-04,1.665042757137993835e-04,3.919578917733083164e-04,-4.171439145683818834e-04,4.399456074734205417e-04,-1.069636724281693515e-04,-3.874681282698621502e-04,2.355747200936290225e-02
7.819895468610447531e-05,-1.809989063095944885e-04,2.340041618157883937e-04,-4.557250868792429269e-05,1.916008021247248721e-05,-5.587404251138651512e-05,3.794343058938507763e-04,7.382149489305979753e-05,-5.204913277470988979e-05,2.818991859355931203e-05,-2.345681315224277738e-03,5.483528178758465948e-05,-2.932500085506534843e-05,-6.255327175240964677e-05,-1.309118216494731713e-04,1.954378444009174801e-04,-1.168111285415836443e-04,1.450838858285335249e-04,-8.636448117478286775e-05,1.502153568903423226e-04,-1.110993593798281846e-04,-1.776983335577659944e-04,-1.313708111436511189e-04,-8.656988634990981301e-05,8.520405663577624807e-05,-5.268969389532196241e-05,-1.870498532135055821e-05,-1.311245476122160035e-04,-3.516757476011979312e-04,1.128351234741286312e-02
9.281091779856826571e-05,-1.565001325021121291e-04,-4.961483672203879621e-04,2.810497507258517149e-05,-1.013359526848572262e-05,2.328524546646683948e-05,9.191146338168668117e-05,5.936765397143345434e-04,-6.080560884590146159e-05,9.968852422121243407e-06,-1.715164503246588010e-06,1.459906441729040950e-04,-6.010040792172961554e-05,-3.528318325775920848e-05,-2.334752463222455697e-05,-1.489135323346579647e-04,-1.560142795724011596e-05,6.090719092097923986e-05,1.182290474236115423e-04,-5.781414482979581966e-05,2.750941930300943491e-05,-1.684185292115907476e-05,-1.187806650991131787e-05,-9.048941107067253083e-05,1.308774519613350844e-04,-2.484253831187730691e-04,3.858759401253619324e-04,6.739184075756966298e-05,1.895917251070764956e-05,7.871124335608614686e-02
-6.693702714469939750e-05,-4.558627235523565459e-05,-1.839151405908408525e-05,1.172651051029800263e-04,-1.641650171930805887e-04,4.519998668908107838e-05,1.988450886216935182e-04,2.695365702528673495e-04,-3.007912915751753747e-05,-3.210690925131503507e-04,3.387040611191979205e-04,-7.617809356893036950e-05,-8.281303889702070105e-04,-1.157556181750776472e-04,1.306107411290658034e-04,6.339947897310857852e-05,2.459974436367235178e-04,-1.282212947431587307e-04,-1.021955002262241240e-04,-2.364978176148615390e-04,-1.713966333012577862e-05,-1.381982391998389393e-04,2.059186979662007617e-04,-4.090111785255121981e-06,-3.194087246970435640e-06,-1.205918180018315247e-04,1.480685007610243785e-05,-9.298328296651136129e-05,-1.373670815942451658e-05,6.138988514591249557e-02
1.116681971104908005e-04,1.426212320652559028e-04,9.843938524977822926e-05,-1.026546357409525946e-04,4.892465796322895241e-05,8.128804259867782511e-05,-1.272147688718957762e-05,-2.214472533504006384e-05,-1.643878549441327923e-04,-6.296771592767868100e-05,-6.421417021695589780e-04,2.184392648680554808e-04,-4.271952821484633440e-04,-4.808668369445474937e-05,8.940877337940794070e-05,1.868201226768770155e-04,-1.488686112583129800e-03,2.783091510518072059e-04,4.114254231172353662e-06,6.788333435818751332e-05,-4.957403123936208664e-05,3.284829419253059856e-04,-4.037143871299754062e-05,-2.199612221496539141e-04,-4.672675064379823136e-05,-4.420534387188191174e-05,9.124847355550172857e-05,-2.036268601061286450e-04,-3.320266661716741617e-05,2.420069006683776835e-02
