-5.330222137284221162e+01,-9.974907173841549479e+01,3.515390010721517200e+01,-8.544472284332699985e+01,-7.164999278011565309e+01,-4.537442258711372745e+01,-1.000000000000000000e+02,-1.000000000000000000e+02,-1.000000000000000000e+02,-8.012564988372355401e+01
-6.805522426913655920e+01,2.037687038559727526e+01,-1.000000000000000000e+02,-7.686693214022453446e+01,2.460226559834415383e+01,-1.000000000000000000e+02,-4.571942028650916257e+01,1.000000000000000000e+02,-1.000000000000000000e+02,8.335617807219136921e+01
-1.261653959035722394e+01,9.665762577367658537e+00,-8.537159443107626089e+01,-9.101277728870981321e+01,-1.412321266780038620e+01,-1.999999997720810185e+01,-1.998594399548632694e+01,1.202527013992378180e+01,7.603284400130191045e+01,-1.383435402145262216e+01
9.170537461042005134e+01,8.678950149403691228e+01,-1.000000000000000000e+02,-9.992971986454257660e+01,-1.000000000000000000e+02,-1.000000000000000000e+02,8.195152648471021450e+01,7.705347606025169682e+01,-7.378044863204199721e+00,-9.818480078707365521e+01
-9.871607894634527725e+01,1.901608307814110788e+01,-1.000000000000000000e+02,-1.000000000000000000e+02,-1.000000000000000000e+02,-1.000000000000000000e+02,-9.290735784722815538e+01,3.027994273982767481e+01,-1.000000000000000000e+02,-7.497471720637658166e+01
-5.703044832696944866e+01,2.636984955646150297e+01,-1.822632034547776669e+01,1.763692618364204634e+01,-4.546844096070996244e+01,8.624633446876978837e+01,-4.914990010450788560e+01,2.286605103801735339e+01,9.157476407673667040e+01,5.562742760902517603e+01
-1.000000000000000000e+02,-4.267049902259427085e+01,-3.244340170010351443e+01,-6.784319099610833348e+01,-1.000000000000000000e+02,-7.013474448715614074e+01,-4.384658894653104255e+01,2.457835875772998691e+01,-1.000000000000000000e+02,-3.002729181173872064e+01
-1.000000000000000000e+02,5.772500869917179500e+01,-1.000000000000000000e+02,-4.992144633956971944e+01,-5.108887325709807925e+01,-9.380399767892863849e+01,1.000000000000000000e+02,-3.917366332288077047e+01,-1.000000000000000000e+02,2.484691697517540376e+01
-1.000000000000000000e+02,-9.992971986454257660e+01,-1.000000000000000000e+02,-1.000000000000000000e+02,-1.128499112465063092e+01,2.154101810434942976e+00,1.000000000000000000e+02,3.250077253558715284e+01,-1.000000000000000000e+02,-9.973486511350219530e+01
-1.000000000000000000e+02,-1.000000000000000000e+02,-1.000000000000000000e+02,-1.000000000000000000e+02,-1.000000000000000000e+02,-1.000000000000000000e+02,-9.992971986454257660e+01,-1.000000000000000000e+02,9.689128418209575599e+00,-1.000000000000000000e+02
-1.000000000000000000e+02,-4.511215555723434534e+01,1.000000000000000000e+02,-1.000000000000000000e+02,1.000000000000000000e+02,-1.000000000000000000e+02,-1.000000000000000000e+02,-1.000000000000000000e+02,-1.031866787504585936e+01,-1.000000000000000000e+02
-1.000000000000000000e+02,-1.000000000000000000e+02,-4.474158932127790678e+01,-6.454992194075785505e+01,6.126859525318014477e+01,-7.779470263275031527e+01,-1.000000000000000000e+02,9.606968313559995920e+00,-1.000000000000000000e+02,-1.297041421789890236e+00
1.718870343037937332e+01,-6.242073331891319299e+00,2.397054472884084575e+01,-2.913114894002945476e+01,-6.212614254890924315e+01,-4.415944663132639647e+01,-9.926529643100801081e+01,-9.621639282978922836e+01,-1.000000000000000000e+02,5.282998489316278068e+01
-1.000000000000000000e+02,-1.000000000000000000e+02,-1.000000000000000000e+02,-1.000000000000000000e+02,-1.000000000000000000e+02,-3.459715560034669579e+01,-6.584630080559799126e+01,3.071792147265151129e+01,-1.000000000000000000e+02,-8.118377299824895488e+01
-1.000000000000000000e+02,-5.580277660881080237e+01,-1.395031022417384747e+00,-4.276010544522360846e+01,-9.384455037649141218e+01,2.738113652389452035e+00,-9.907023471833656458e+01,1.707523058611695532e+01,-4.279065570679538411e+01,-1.000000000000000000e+02
-5.798405669526474782e+01,-3.817057224854524478e+00,-9.571187880601685549e+01,-6.037333383439319334e+01,-1.000000000000000000e+02,8.578235026872602020e+01,-1.000000000000000000e+02,-1.031866787504584870e+01,-1.000000000000000000e+02,-9.947956888550324095e+01
-1.000000000000000000e+02,-1.000000000000000000e+02,-9.992971986454257660e+01,-1.000000000000000000e+02,-1.000000000000000000e+02,-1.000000000000000000e+02,-1.180770243547480192e+01,-9.321829819902566783e+01,-1.000000000000000000e+02,-4.017736651604846543e+01
9.967125588014928894e+01,-1.000000000000000000e+02,8.412131501333014683e+00,-9.307093977522268347e+01,-1.000000000000000000e+02,-9.999676662403682315e+01,4.443185244341111684e+01,-9.992971986454257660e+01,-1.000000000000000000e+02,-1.000000000000000000e+02
-6.000000000000000000e+01,9.374663623860907791e+00,-9.491220228368612766e+01,-4.899932042049556458e+01,-1.000000000000000000e+02,-6.752375944634803773e+01,-5.752862844109355933e+01,-7.585160144162368567e+01,-1.000000000000000000e+02,-2.941614917019187914e+01
1.440644439834071910e+01,-9.957233157266951196e+01,-8.170774624846065137e+01,-9.106128952316505831e+01,5.373874594680559369e+01,-7.405606016159146066e+01,-1.000000000000000000e+02,3.875557665738129742e+01,-1.000000000000000000e+02,-1.000000000000000000e+02
-1.000000000000000000e+02,-9.992971986454257660e+01,-1.000000000000000000e+02,-1.000000000000000000e+02,-1.000000000000000000e+02,-1.000000000000000000e+02,-8.917615763495422243e+01,-4.699228113424030084e+01,-1.000000000000000000e+02,-1.000000000000000000e+02
-1.000000000000000000e+02,-9.937043723872415057e+01,-1.000000000000000000e+02,-9.982705569893562370e+01,-1.000000000000000000e+02,-6.000000000000000000e+01,-9.940823931267262026e+01,-1.000000000000000000e+02,-5.925781319869414432e+01,-2.002949664865735002e+01
-2.249388899511592044e+01,1.000000000000000000e+02,-1.000000000000000000e+02,-7.167850543534615326e+01,-3.834896207109964195e+01,-9.999352502125567810e+01,-3.651450583058908705e+01,-1.000000000000000000e+02,-1.000000000000000000e+02,-9.992971986454257660e+01
-1.000000000000000000e+02,-1.000000000000000000e+02,-8.922608291310764628e+01,-1.984774330333983627e+01,-1.000000000000000000e+02,-1.031866787504584870e+01,-1.000000000000000000e+02,-9.996983487562366122e+01,-7.972607611798204630e+01,-1.000000000000000000e+02
-7.463417211766405046e+01,-1.000000000000000000e+02,-9.992971986454257660e+01,1.000000000000000000e+02,-1.000000000000000000e+02,-1.000000000000000000e+02,-2.729107717105247133e+01,-1.000000000000000000e+02,2.726727164886753485e+01,5.804205908792442870e+01
-1.000000000000000000e+02,-1.000000000000000000e+02,-8.526719709741020381e+01,-9.966469774860992459e+01,5.345984772974131971e+01,-8.114269009489025564e+01,-6.141418591437941998e+00,-7.642409420171526335e+01,-1.000000000000000000e+02,-9.000317839844171885e-01
-1.000000000000000000e+02,-1.000000000000000000e+02,6.335801181404288229e+01,-1.000000000000000000e+02,-1.000000000000000000e+02,-9.992971986454257660e+01,-1.000000000000000000e+02,-1.000000000000000000e+02,-1.000000000000000000e+02,-1.000000000000000000e+02
-1.000000000000000000e+02,-6.449716590958439610e+01,-1.000000000000000000e+02,-1.000000000000000000e+02,-1.000000000000000000e+02,-1.031866787504585048e+01,-1.000000000000000000e+02,5.476271306023745922e+01,-1.000000000000000000e+02,-1.000000000000000000e+02
4.800861187500991178e+01,-1.000000000000000000e+02,-5.007609305328067961e+01,-1.000000000000000000e+02,1.031866787504577410e+01,-1.000000000000000000e+02,3.470379095717606077e+01,-1.000000000000000000e+02,-6.314804120134834164e+01,-3.342546568810535490e+01
-7.715541746031021830e+01,-8.576910691496586026e+01,1.000000000000000000e+02,6.161741916936281882e+01,-1.000000000000000000e+02,-1.450397209734319759e+01,-2.427082109985875746e+01,-1.000000000000000000e+02,1.000000000000000000e+02,-5.865376895053741180e+01
