4.856464758490895406e+01,-5.186693996219564440e+01,-9.897462767854064225e+01,5.499550024740239706e+01,-3.294536502394701216e+01,-9.579343992741638658e+01,-8.014028003368366626e+01,-1.728675604517641773e+01,4.763298734830142322e+00,-3.621392561077669114e+01
-7.700518919360322911e+01,-8.448194179264588044e+00,-8.966990958389713740e+01,2.937141628491110623e+01,-3.619517859514387226e+01,8.657126258742549396e+01,5.809151323180830673e+01,-1.734560159016912451e+01,7.995968915370632146e+01,-4.230299706488361977e+01
-2.370294013411743705e+01,9.573925801112801537e+01,9.908852396023644360e+01,4.364799099576241126e+00,-6.149280128772406329e+01,1.848107955070334985e+00,-5.209791254291711482e+01,-3.931035311656002307e+01,-7.718436106095350624e+01,-1.914099703086234561e+00
-1.732534611890056198e+01,2.335754231927573699e+01,-6.124260952524652168e+01,-1.563981293751379731e+00,-1.084840344227603914e+01,9.575498283115311438e+01,-5.806370740545299469e+01,-1.414818176328470223e+01,-1.109092054308816166e+01,2.049661177638541787e+01
1.103432088550466261e+01,-8.322929632202789207e+01,-9.896230892995218653e+01,8.009267767767683210e+01,-9.576148065646141561e+01,7.781917500334972537e+00,-4.671411354678919103e+00,2.045812078194028416e+01,-3.294623462924448631e+01,-6.129236053088395408e+01
-4.683625079249952528e+00,8.927240984350471820e+01,-4.218215930739855679e+01,-2.369842851036883857e+01,7.963968578517474306e+00,-9.918465489097202692e+01,-9.899706735289534265e+01,-3.281611767891232745e+01,6.446490742262844265e+01,-8.964109333139170133e+01
-1.413564009705500268e+01,2.984221658309958514e+01,-7.383052698381266055e+01,-1.000000000000000000e+02,-9.896318969918135622e+01,-2.984404551968200536e+01,3.613957041776089341e+01,-8.639549705409429237e+01,1.414281699350818577e+01,-1.727590190211533994e+01
4.232505783946545108e+01,-1.097267482423849216e+01,-7.065347726629693170e+01,3.919608844351571975e+01,-8.948726978638138974e+01,9.265711807363837238e+01,-2.037909355312744353e+01,-1.414332221280558954e+01,-7.071885974369925520e+01,7.702237606716548157e+01
1.137642965442950072e+01,-7.907902337197461939e+00,-7.071553828736601588e+01,-3.614905975129354943e+01,2.692876475773796230e+01,-4.231539270281267306e+01,1.412745097919164294e+01,-4.283897118113753066e+00,-9.926808483211193845e+01,8.211657539239119785e+00
-6.436378083923659688e+01,-9.884718933650945871e+01,2.032287628930986045e+01,-5.496209800547941882e+01,3.935489771965288242e+01,2.672812239554443892e+01,-4.242631126291168897e+01,7.934759596022192163e+00,-1.090497261120773409e+01,-9.275574128670341167e+01
-6.439123397017202421e+01,1.588009534860163052e+00,-4.241599662574784446e+01,-1.000000000000000000e+02,-5.186001492922590472e+01,-9.899768756045563123e+01,-2.985026985001453781e+01,-8.639243149756529760e+01,-4.553581375254191954e+01,-2.982836995886103182e+01
-3.629251225218997234e+01,-1.472726821725716384e+01,-2.043419558107304823e+01,-2.020079622669484820e+01,-4.246538600465706992e+01,4.748284575618087366e+00,-9.854174046767403183e+01,1.646904116340174973e+00,-1.437922779970879894e+01,-3.022280390710336917e+01
-7.701099119735451382e+01,-7.380237056498990000e+01,-7.694777951326327070e+01,4.690546211284237543e+00,6.438259851150779411e+01,9.266526163164063234e+01,-3.291464990279582281e+01,1.652722419209222915e+00,1.094498357175544712e+01,1.603779888447665725e+00
1.555229860329759850e+00,9.890689949519158120e+01,-4.692668803145442880e+00,-8.315648994909653879e+01,4.784606173032007526e+00,-1.715100289014555202e+01,4.235688755115428705e+01,-9.915604456568568992e+01,-6.106409476950381787e+01,-8.034974823836184044e+01
-9.295096675914027173e+01,-9.913981106746248884e+01,3.260255234537874003e+01,5.218202974298601760e+01,4.570655422537488732e+01,-2.056198700920038647e+01,-6.144295568487500958e+01,-1.091082109063816574e+01,-7.073669291414363158e+01,7.751575989851638759e+00
-9.567173006899271570e+01,-7.698925282822601446e+01,-1.000000000000000000e+02,4.227310360094990926e+01,-6.752111495940094699e+01,-8.949206221412276818e+01,-2.980284634431768609e+01,1.700827923508090223e+01,-2.357748428033465160e+01,3.312895345800976088e+01
-9.897236910819603395e+01,-9.897990890807065512e+01,-1.000000000000000000e+02,7.850561142921915980e+00,-5.498685020276911928e+01,8.325266370136930050e+01,-4.241194844240303041e+01,9.895048280567954180e+01,9.581151292633116157e+01,4.869806299258405602e+01
-2.984943874255881724e+01,-9.896142623190644372e+01,-9.896595471345709427e+01,4.555225164007822514e+01,1.574488343006434254e+00,-4.710588232480340309e+00,-9.267699372997847718e+01,-8.639317647442314296e+01,7.697332241121488039e+01,-9.267273997977029865e+01
-5.175394817859505281e+01,-7.060964674410240605e+01,4.285826221306886197e+01,4.272140700248009182e+01,6.449962164497102890e+01,-7.706980163777190285e+01,1.102643053856633770e+01,3.292519065134292333e+01,-1.710755485226812667e+01,-8.675791785894149655e+01
-9.899711072197924011e+01,-4.558470558474934364e+01,-8.952134885640357709e+01,8.952293106800242128e+01,-1.602754679326914955e+00,-6.758520188769641379e+01,-9.897467830564239932e+01,-7.383438528833680436e+01,3.610988544598966143e+01,-4.236798426197662337e+01
-5.807771150983489861e+01,-1.000000000000000000e+02,-2.968114734385848053e+01,-4.245329252857879965e+01,2.356010311124930467e+01,8.003295090319397787e+01,-3.296886909675985322e+01,2.367319478763512208e+01,2.364582203432746610e+01,-4.568914689767462534e+01
-4.243011526087030205e+01,-5.191277467724000161e+01,-5.511508382425503072e+01,-9.571393975779059815e+01,-6.118217018814054597e+01,3.615579202106086854e+01,-2.356653140589134310e+01,5.819984964660643101e+01,-4.554600065509897178e+01,-3.936404990129778270e+01
7.706086738571302419e+01,-3.008323748210423432e+01,5.482160881710773026e+01,4.701425163771795646e+00,-2.949095662813980923e+01,-8.315220908819622991e+01,7.723251564509001810e+01,-1.000000000000000000e+02,2.640055776430754975e+01,-7.678198529501258918e+01
-1.599181687421065368e+00,1.520808523034291815e+00,-2.043652314837647666e+01,1.102853207209388486e+01,-5.818255587564206621e+01,-8.011463645848958492e+01,-8.954905001187042046e+01,5.182233182876832700e+01,3.617154409483671174e+01,-7.996875466142678590e+01
-7.697673719892046051e+01,-1.571693355559807159e+00,2.670027491368313832e+01,-2.669356438415638877e+01,2.357406236827960200e+01,-1.728745627448266831e+01,2.983426020006284318e+01,-7.068995046169450802e+01,8.954198778323197416e+01,9.581677540511233815e+01
3.298695385419804893e+01,-9.895915741061719473e+01,-2.042026535928128794e+01,-4.241062953782462586e+01,-5.811951873577575611e+01,2.670370782967107459e+01,7.696846949366056378e+01,4.711791731190990262e+00,7.853513552172844747e+00,-1.000000000000000000e+02
9.267912657264028553e+01,7.844185646818274016e+00,5.187781754486920249e+01,-1.000000000000000000e+02,9.582946639849079418e+01,9.268127374966867649e+01,-2.042336359581900140e+01,7.859633958563366107e+00,5.183540678584791550e+01,5.811039745432957915e+01
7.380542583127353851e+01,-9.264818842315357017e+01,-3.576038077649386082e+01,7.999394182550653909e+01,-2.017914585432146879e+01,-4.547222665761374572e+01,1.752853358940676287e+01,8.045206652374167788e+01,-8.315103411524451360e+01,-5.184357596018003278e+01
-1.000000000000000000e+02,-9.268271976671974244e+01,1.093772348715855181e+01,-6.750797338911914380e+01,6.124218493337020419e+01,-4.240485385819021502e+01,-5.187756033226293084e+01,-2.669367552176303349e+01,9.896425652880616042e+01,-1.000000000000000000e+02
-5.183628342498744956e+01,-7.854002235345124205e+00,-1.413718406361545021e+01,1.099559798269223165e+01,-8.325218795568079599e+01,2.670351960222559384e+01,-3.298672200730794657e+01,1.413718432854794926e+01,2.042032498154256359e+01,2.984510300150561690e+01
