-8.422145458502279780e+01,-3.780078823382507380e+01,-4.415705635569064214e+01,-1.852274031544485666e+01,9.407258561676101749e-02,-6.131048781639588441e+00,-7.238110292041710636e-02,-6.442003027268141224e+00,-4.703180611071644535e-02,-5.995349886646391013e+00,-3.226505885825218467e+00,1.219370452652839276e-01,-3.457695873296895428e+01,-6.330855085599740306e+00,6.203637574258850762e+00,-9.558615071092130933e+00,-3.240337907020371944e+00,1.544936300766153181e-02,-1.581590610170130873e+01,-1.269059918965423250e+01,-5.993913207615837457e+00,-1.901787495673709927e+01,-1.274131602337572033e+01,-3.082052005203507861e+00,-6.420516014164558527e+00,-2.170432954488402544e+01,-1.266825321286821548e+01,-4.268938744720038869e-01,-2.187020192056603918e+01,5.953300739991390422e+00
-9.996900961112848449e+01,-2.831001144111605328e+01,-3.173284685462075316e+00,-3.150883396952242066e+00,-6.280985032630877818e+00,-6.270876067853693669e+00,-3.143130568283978299e+00,-3.154148337991528273e+00,-3.144701280549390798e+00,-3.133785287219388760e+00,-6.301458432799818266e-02,-2.048569654857987365e-05,-1.434654538134766616e-03,-2.164436819567745751e-02,-2.728682046074393241e-02,-3.149841860485255385e+00,-3.139806578188555353e+00,3.894145760361755748e-02,-1.398930452274793623e-03,-1.008337158207019968e-01,4.816937999070125542e-03,1.102545590814507648e-02,2.908167228373947921e-03,-3.012950017744486786e-03,-1.880455804284318893e-03,1.615810867338590001e-02,1.642679568315594252e-02,-5.936430276759940838e-02,-1.416212009950206484e-02,1.555021925953884061e-02
-9.992086038145720295e+01,-5.321252783287310706e+01,-2.826924101460173944e+01,-9.742462300040561018e+00,-1.907628551394034844e+01,2.543567445727390464e-02,-1.586032397690431317e+01,-1.251568191009249098e+01,-2.181477971492333268e+01,-1.894393044535117809e+01,-1.596210075603769774e+01,-1.576219905399276122e+01,-9.339931722198214104e+00,-9.294054572815021231e+00,-2.872883361151572501e+00,-3.212793492043022781e+00,6.102863446448090201e+00,-6.428508817496400241e+00,-1.244595790987137640e+01,-1.275175377794261422e+01,-9.667108929656352601e+00,-6.378597940281078849e+00,-3.453031942107482166e+01,-3.125058004917379151e+01,-1.866232630235403533e+01,-1.245269527744433624e+01,-2.840654247992392456e+01,-2.202720765896435040e+01,2.998929764424779876e+00,3.158478358371366923e+00
-9.914222555549208948e+01,-2.509549522994851500e+01,-1.557480855717316537e+01,-1.584935362584261043e-02,-9.407141854016014548e+00,-2.511341337739183643e+01,-1.568225037203996131e+01,-2.792243181186545797e+00,-9.201967979235325501e+00,-1.249299934646673726e+01,-1.571484494822719924e+01,-9.386627384667407981e+00,-6.147209460171474404e+00,-6.093338122224185582e+00,-3.395379889131795892e+00,-9.427827537360222721e+00,-3.035046252741278039e+00,-1.308920888362017365e-01,3.142967907920130699e+00,-2.956491882222790579e+00,-6.141889787166977754e+00,-1.247696951398755871e+01,-6.537813219477605742e+00,-6.408930669494022681e+00,-2.932995315860154051e+00,-3.141137691373141472e+00,-9.613565873018849572e+00,2.985276838446061731e+00,-6.281629960182652184e+00,3.345856338254711293e+00
-9.554361987620291075e+01,-2.983230263983802644e+00,-2.197686703220130511e+01,-4.122772781565269185e+01,-6.382184522870907983e+00,-6.203482907144554304e+00,3.052495098346064140e+00,3.240335769999159510e+00,-5.000281760277955101e+01,-4.090870878280431100e+01,-5.051351569449955292e+01,-5.658787099956653321e+01,-1.258178083436092720e+01,-2.840002007792989502e+01,-4.435644941787447237e+01,-4.087570303186872422e+01,-3.131811212003938749e+01,-2.846125436680532772e+01,-3.117712428952216897e+00,-4.982148738289698997e+01,-3.163550426853196740e+01,-1.875243673122346522e+01,1.257926723791254986e+01,-1.880408283918090362e+01,-3.289035573568508397e+00,-6.133543092996845303e+00,-3.122007679958667481e+01,-1.583401261570547902e+01,-2.795170751587495062e+00,-6.440034940945210451e+00
-9.991146927253916488e+01,-2.201585866152509752e+01,-9.418563422305512134e+00,-6.296636261715253369e+00,-3.119424000328223645e+00,-3.130178640272013091e+00,-1.979613881263020403e-02,-3.152965072518237211e+00,-3.139716484016314979e+00,-3.136932158372376822e+00,-3.119419313544427474e+00,-3.070928963353125596e-02,1.048776738943635323e-02,-3.449290125002146823e-02,2.870657448482463042e-02,-8.378871174534063826e-02,-3.164657575047889360e+00,-3.178814042541286078e+00,-3.143122673975549564e+00,-3.128209579690781617e+00,-3.165590805416617748e+00,-3.226237449485806597e+00,-3.146467280777037967e+00,-3.141921270429311797e+00,-3.145828193659510497e+00,-3.136745174781454093e+00,-3.151129923172461655e+00,-3.140546471088617952e+00,4.718631256929545215e-02,1.662304794678853836e-04
-9.942966984968833799e+01,-5.345947113828256647e+01,-1.565983705363032996e+01,-1.888714906409247973e+01,-3.263469626330714135e+00,-9.378419575055968238e+00,-2.212962837563145513e+01,-1.877393367614371300e+01,-1.867814334480885208e+01,-3.350769402489149673e+00,6.512144161841813883e+00,-9.378653355221167942e+00,-9.445183979055389756e+00,-1.882281640383388321e+01,-2.178008423712950403e+01,-1.285348023486119118e+01,-1.250297224169985455e+01,-1.250436517443651496e+01,-2.180566716118242709e+01,9.210149824368766502e+00,-2.954469294730092344e+00,-9.512002203319184446e+00,-1.241217288246739514e+01,3.244502317000204528e+00,-1.869041628106087671e+01,-3.157986581201303267e+00,-3.149818796627457829e+01,-6.227659298502178586e+00,-1.237758573758779690e+01,-9.391462346800619088e+00
-7.840996919414166655e+01,-5.327391566498490505e+01,-2.828123039935843863e+01,-2.810306833638042434e+01,-3.449845921940254101e+01,-1.884165554199054426e+01,-9.274171133182903759e+00,-6.365027643576745220e+00,-3.392428560897323919e+00,1.173706928702932251e-01,-9.193781684676217481e+00,-9.346575201909681496e+00,-9.198180240395387841e+00,-1.255816364653696127e+01,-9.458450351894995833e+00,3.245385854183240326e+00,3.102665740218128576e+00,-1.243193509858164347e+01,-6.540572418596392268e+00,-1.895837283313300503e+01,-1.552336596230769139e+01,-2.824439330746987054e+01,-6.615442261211921959e+01,-2.858836779220547442e+01,-1.268098545831382395e+01,-1.247728356676314476e+01,3.362911521744972987e+00,-1.229797803161833158e+01,-9.445179127635654481e+00,9.208642585162273519e+00
-9.796412152487735625e+01,-2.825783446821982636e+01,-3.204454042634994337e+00,3.214421838872974391e+00,-1.864441071455260968e+01,-1.883849408814317172e+01,-9.502418254140248877e+00,-3.123202688540943850e+00,-9.268927193967758882e+00,-1.280821395387834194e+01,-1.572321451558395289e+01,-5.966853132926562608e+00,-9.443330712609032673e+00,-1.287831408764298402e+01,-5.320365659499920241e+01,-1.559482510849902681e+01,-1.270129348564215377e+01,1.982951849860725702e-01,-1.877841646236189277e+01,-1.237246814652496596e+01,-6.017224408654563206e+00,-1.271927257039643067e+01,-2.803261583839159243e+01,-1.904248088492886026e+01,-3.308077630699660432e+00,-1.599979626906977614e+01,-1.577106688891412034e+01,-1.565586962933099002e+01,-1.901655416903383866e+01,2.865055082400962405e-01
-9.999949501312875100e+01,-1.884898165860884589e+01,-6.270540944764276148e+00,-6.272553769573310234e+00,-3.146604951449564869e+00,-3.143058482061375614e+00,-3.120854135591015321e+00,-2.328438534804755378e-02,-1.526424318141561542e-02,-3.138345106965907405e+00,-3.162021467954837739e+00,-2.299563017664585374e-02,-3.090798668880312405e-02,5.740829860745901014e-02,1.952929794316071374e-02,9.628054373499023849e-03,1.928990430455801430e-03,-3.138380236633421916e+00,-3.139988936509136241e+00,-3.143099971997264319e+00,-3.128234386195900996e+00,-3.169477495276311618e+00,-3.168723073526265921e+00,-3.143149015756538933e+00,-3.133380258687472608e+00,-3.282547808227898045e-02,-5.619454051852201815e-02,-1.461129119716453317e-02,2.089638232056912834e-02,2.102170567555399373e-03
-9.992848411043152623e+01,-1.258888929658047573e+01,-6.278883559403810821e+00,-6.260949466521235962e+00,-6.285392898980382448e+00,-6.277794375945793703e+00,-3.207965525536715212e+00,-3.142766801539362831e+00,-3.132405626699237278e+00,5.098777974543988734e-02,-1.708812337391663050e-02,-2.568155734682171093e-02,6.342860729705179779e-02,-8.525725622370305956e-02,-1.313851708507352001e-02,-3.114959385101047307e+00,-3.238716615356515671e+00,-3.203280269974412953e+00,-3.144213784821336954e+00,-3.137115474016778816e+00,-6.618267045384759045e-03,-3.453992476736560124e-02,1.325287151282428591e-02,-1.643261378245608473e-03,-3.250597345910570535e-02,-3.557238240063206186e-03,-2.614702296160396552e-02,7.195665452421453993e-03,-5.277319843186088592e-03,-2.520128585593651993e-02
-9.999547107279676084e+01,-2.196714674389900068e+01,-6.283486442330243449e+00,-3.124259107756985454e+00,-3.060925966761793404e+00,-3.178052881802661656e+00,-3.136024372934421045e+00,-6.275240760774710047e+00,-3.107743987621501613e+00,1.157549823548364998e-02,8.541606075912255847e-03,-5.310800772117874047e-02,1.599223632792516614e-02,-3.160510770607872111e+00,-3.140631253469475137e+00,-3.132553421680174033e+00,1.419714328643983947e-02,-3.659649514958121519e-02,6.416749632563688299e-04,-1.211065537327803745e-04,-3.046276385802432207e-03,-3.205312775850196694e+00,-3.134872881189195937e+00,-7.106446987242587277e-02,4.837265856468592543e-03,9.826191876926682056e-03,-6.987847188817575272e-02,-3.125715141404751485e+00,-3.105134081263800194e+00,4.337525729552604153e-03
-9.997814330157984841e+01,-2.199067111346050751e+01,-9.421754946728482238e+00,-3.150023565017602500e+00,-3.139426566206712010e+00,-1.536721218193299113e-02,-1.307379585173065566e-02,-3.166078960838793588e+00,-2.091633331467512846e-02,4.345123437874350708e-03,-3.114090121239595277e+00,-3.140249779674559871e+00,-3.137549172057330527e+00,-3.136410670409485402e+00,-3.148435851365473326e+00,-3.200515783045775997e+00,-3.161183903531854078e+00,-4.297799573350089344e-03,-8.381973314601744857e-03,-2.914098515532944408e-03,1.817421028343257916e-02,-5.110666484598477485e-03,-3.145233621794185197e+00,-3.138695701034778462e+00,-3.116609311862721388e+00,-3.191428885709622243e+00,-3.134114859384325769e+00,-3.138800996937063825e+00,4.546552507601374707e-03,-6.623134011205434506e-04
-9.999739292970568272e+01,-2.198937641845146018e+01,-6.286745462890545255e+00,-3.124382005578899335e+00,-5.976963972659374118e-03,-3.140533676817935937e+00,-3.137610204219108745e+00,-3.159119413480498739e+00,-3.093251705588339728e+00,-3.138444277847296515e+00,-3.143852957852351970e+00,-3.119951020153513888e+00,2.163743671606996669e-03,1.200846308610995904e-03,-7.086753422615703346e-02,-3.137526608041597331e+00,-3.141131006613122612e+00,-3.131411663363068865e+00,-3.146373594673350649e+00,-3.139690184734987177e+00,-3.138991981255352393e+00,-9.906099783296961822e-03,-2.593277790234924975e-03,-1.846364148254271351e-02,-5.149095135140088590e-03,-1.791618912479834777e-03,4.916309300725769590e-04,-4.959068460989655806e-03,1.918377953588297057e-03,-4.640104576114254756e-04
-9.992584913932871871e+01,-1.580702317930224510e+01,-3.069655224149423489e+00,-9.433556079131196981e+00,-9.195296568438786622e+00,2.611399258533886325e-01,-9.663990987387045095e+00,3.090905301812821193e+00,9.540807791326145093e+00,-3.472754016419911949e+01,-1.890104821325977724e+01,-1.561435520168562974e+01,-3.442833253747651412e+01,-3.755791654575447325e+01,-1.562582114502202479e+01,-1.869207308992354655e+01,-9.478930038305627193e+00,-6.410366585762639069e+00,3.101594831201154534e+00,6.154182834613557418e+00,-2.217912265563006002e+01,1.521641659841321825e-01,-1.873493707675023856e+01,-1.223351123538842344e+01,-2.527478588600233778e+01,-1.591741326374864585e+01,-2.184202083710695419e+01,-9.658379226921249838e+00,-1.249021743347782909e+01,-1.590063117974471574e+01
-9.895245565901436180e+01,-4.095410594355166722e+01,-2.821298781068539085e+01,-3.215505184694402274e+00,-6.329432759905079919e+00,6.335351467115295065e+00,-1.595307475360434069e+01,-9.375540321565573265e+00,-1.561352394672524113e+01,-9.345433929736538303e+00,-6.273511185850249916e+00,-6.157145571880123569e+00,-3.332554035002946335e+00,-6.436080884306822014e+00,1.182233130730585557e-01,-3.168165273012846228e+00,-1.568102238921434122e+01,-6.322668686346389677e+00,-9.459218041147471112e+00,-2.525177429987048683e+01,-3.138194520626652917e+01,-3.133185496813755577e+01,-9.454299918886064802e+00,-1.560591936327925566e+01,-1.260796098565916878e+01,-1.878561387614847078e+01,-5.951161793277917411e+01,-9.251336792698531042e+00,-3.200551004370467467e+00,-3.066174274052736237e+00
-9.877642688034970320e+01,-9.453279172195564684e+00,-1.565270555623368054e+01,-1.546352514931334099e+01,-6.291470843503950583e+00,-9.562730351008955409e+00,-3.167661272100191994e+00,3.302831230314776434e+00,-2.143837325221453760e-02,-4.943179875230185871e-03,-6.325496885342074549e+00,-1.002777016545710609e-01,-1.891512817233275712e+01,-9.487440881815775384e+00,-9.460590163791135154e+00,-2.499997482347144384e+01,-2.825394033896997570e+01,9.335177591840924549e+00,-1.585306623297707951e+01,-1.265005303651923896e+01,-1.563093158784313630e+01,3.357653663155302226e+00,3.076802977759347968e+00,-1.582613362973532922e+01,-6.265388472057647817e+00,-6.471909451119071122e+00,-1.243288552742998121e+01,-9.174251170654578402e+00,-6.276368130051650951e+00,6.522784028676058554e+00
-9.585865946752058164e+01,-2.194915484396030791e+01,-1.259151684064056198e+01,-6.500427035522086783e+00,-2.582346303087366124e-01,-1.194208136050534108e-02,-1.571300855183923773e+01,-6.172394552963689662e+00,-1.571610274356780934e+01,-1.887021046789717360e+01,-1.256693321413329301e+01,-1.259014169873554501e+01,-1.893349833304912266e+01,-9.420020648493618864e+00,-2.191588464537647241e+01,-1.873133701063339274e+01,3.985922759610218691e-01,-2.193527577671027018e+01,-9.238105928513361320e+00,-1.591902454450083404e+01,-6.405631864561776467e+00,-6.117926308693501625e+00,-2.840058781965744572e+01,-1.558774879615448050e+01,-3.791263520661860298e+01,-3.145073309347457524e+01,-4.050281199555141143e+01,-1.857304846195193448e+01,-9.367009125643960488e+00,-1.258237030161842540e+01
-8.932353206067166695e+01,3.205144951628057015e+00,-6.419541982669620950e+00,-2.498504980878849935e+01,-6.131956012631622599e+00,-3.254523037261591867e+00,-1.559428951154083620e+01,-3.203457760653883213e+00,-1.538427709475258354e+01,6.223135865259290966e+00,-1.574878321902250633e+01,9.584999719956648789e+00,-3.240316047930676291e+00,-1.922661149014589910e+01,-9.504186593926755577e+00,2.555205527379911246e-02,5.978636146922866601e-02,1.269366046400121917e+01,-1.249573361165550622e+01,2.856976077450106288e+00,-9.552607815975322936e+00,-1.256653955875720108e+01,-1.888162851953882893e+01,-3.219525003569079225e-02,-6.132800012896389319e+00,-1.253506726302406449e+01,1.625749363382205104e-01,-2.215351226545061536e+01,-6.380443606708780635e+00,6.514019616141010438e+00
-9.374002041737740853e+01,-3.766546856442342062e+01,-9.464798729474642514e+00,-9.345989893659993442e+00,-3.178522949183918200e+00,-3.192516661198598449e+00,-6.394282369159821400e+00,-1.254128115979128921e+01,-1.266907817849332218e+01,-2.502127886770354337e+01,-1.268144154540901702e+01,-6.479939973516743557e+00,-6.421445356392144532e+00,-3.010899360947171033e+00,-9.454511728534935600e+00,6.238152058240775233e+00,-9.351273901092771013e+00,-6.188209887542889476e+00,-3.307948961803201637e+00,-9.407532479559197469e+00,-2.505988851868888645e+01,-1.569253910866269841e+01,-9.462071091347375784e+00,-1.266691684365444104e+01,-2.235807003931522274e+01,-2.176001279251919129e+01,-2.182857813477873066e+01,-1.563840841461933096e+01,-6.175312935001326942e+00,6.207249274983496434e+00
-9.980103996261958343e+01,-2.819294174366569905e+01,-6.298794747356502910e+00,-3.197654898492901854e+00,-3.167669307971064718e+00,-3.145717554564631868e+00,-6.329243998929090509e-03,-3.142515472752732908e+00,-3.132199470604684510e+00,2.304083962417635689e-02,1.492840342056922509e-02,-9.539170444704136997e-02,8.206716054154661322e-02,5.915695592423508842e-02,6.877361647534292743e-02,7.625516537652002498e-03,-2.983893537381154815e-02,-2.947301387533673989e-02,1.872060161378835685e-02,-3.415252453426997903e-03,1.936746146762181875e-02,-3.038229131431791075e-02,-1.562293056614870099e-03,-3.107868447834558623e+00,-3.140213521921336515e+00,-3.158491070221328467e+00,-3.100922020388598987e+00,-3.154969301022418904e+00,-2.814045036742207628e-03,1.070079156983079136e-03
-9.149218649296116723e+01,-5.009995330868663643e+01,-1.593149107330842895e+01,-3.355423628416190240e+00,-1.529802741811264966e+01,6.377999130051609455e+00,-9.341113626000886683e+00,-1.914780341298515154e+01,-9.268889829931131530e+00,-9.252463422975630181e+00,-6.374023114206517349e+00,-9.144827054367635100e+00,-2.183281898432970891e+01,-2.235763195916663193e+01,-6.286544594530191432e+00,-9.519941885879573462e+00,-9.714443690625792271e+00,3.197350783819494779e+00,-9.275693521803788144e+00,-2.871459614216858025e+00,-2.550118530402787798e+01,-2.509633284183290769e+01,-2.840176859716351743e+01,-1.258120923248183942e+01,-2.879832176356328155e+00,-4.062207521681669675e+01,-1.273092594602136884e+01,-2.222953752284655593e+01,-2.842910609614856199e+01,-2.189797022649461411e+01
-9.667238555569505820e+01,-4.399311545659310951e+01,-3.768534515138326668e+01,-1.555434735586661077e+01,3.029535414474761268e+00,-2.505549083905542673e+01,-1.242919297112696242e+01,1.216344183824680414e+01,1.321593705236416838e-01,4.422531325460106189e-01,-3.182231077131660868e+00,-1.259220748052629091e+01,-2.216299177031232404e+01,-1.262912225597199445e+01,-2.863486233555529736e+01,-1.575222435935703480e+01,-6.573653747187492513e+00,-6.121321875551394953e+00,-9.361789262965672265e+00,-8.949985944519418979e+00,3.129609661628830253e+00,-3.052848035835022955e+00,-2.182906417369162355e+01,-3.429211394434127413e+01,-9.362142725780298491e+00,-1.575380021207207903e+01,-2.507094358121915079e+01,1.846512519041435851e+01,-2.529015759980641320e+01,-1.266656782468231057e+01
-9.423143231042961077e+01,-1.575593638403480412e+01,-6.226111526758476344e+00,-3.208341740591738045e+00,-5.972095160845483974e+00,-3.152447208096553410e+01,3.334861499171292820e+00,-6.397734969688556816e+00,3.922646500143400772e-02,-9.592106938099927760e+00,-1.550944241843279414e+01,-1.245891177624467261e+01,3.393206225552692246e+00,-6.454371109439518861e+00,-6.309012687998321489e+00,6.815403855208579387e-02,-6.251188182274402649e+00,-1.764416864593840728e-01,-3.222368500108046874e+00,-2.187143498263862540e+01,-1.261889492056257822e+01,-1.254091857479476602e+01,-9.396615443760319764e+00,-1.259204711673375776e+01,3.077296058232064979e+00,-9.588051064752701080e+00,-6.166546344379195688e+00,-6.177402522182116940e+00,2.941373100867789248e+00,3.672745129215160276e-01
-9.998370036739434852e+01,-2.199456633422467533e+01,-9.439432976111799434e+00,-3.139481098665735548e+00,-3.137124119212171269e+00,-3.141244372239844207e+00,-3.138061018276201874e+00,-3.142327582840330535e+00,-3.141394771105042505e+00,-3.148540290392082941e+00,-3.137137766883046908e+00,-6.277660106222125336e+00,-3.141772862286777102e+00,-3.135354511581736503e+00,-3.133786989846240711e+00,-3.135429953408991111e+00,5.161397115625204583e-03,-4.919899285060421595e-02,1.949934093984082017e-02,-3.142490016227556637e+00,-3.142153253383179745e+00,-3.145339000622810577e+00,-3.157431065769257472e+00,-3.139371706606296719e+00,-3.138459435219193683e+00,-3.135430826979740626e+00,-1.040425115940071289e-02,-2.577646769211531554e-03,-6.439211889354412403e-03,3.924543474717771341e-04
-9.024187633251160889e+01,-2.833496206321478894e+01,-6.156309380398724329e+00,-9.205502567681911330e+00,-1.565775040109113370e+01,-1.255228822088323781e+01,-1.242591286071946932e+01,-4.069868632397475494e+01,-1.591143837971015351e+01,-2.817995461882467367e+01,-1.252869596076029168e+01,-1.256378148831434949e+01,-1.238102273145579879e+01,-1.248916955279470820e+01,-9.137313494417025339e+00,-3.261410183558005826e+00,2.984328041436219436e+00,-2.536110693210017075e+01,-9.569503408435817704e+00,-9.226206641137526532e+00,3.163392737092387108e+00,-6.241696085068028310e+00,-6.450084156019070036e+00,-1.274086710910857789e+01,-3.061079163072985665e+00,-1.884159685249682070e+01,-1.572635096599989346e+01,-9.552597842647884363e+00,-1.561720654074867554e+01,1.261804987158623703e+01
-9.728396910306314282e+01,-2.183950713081222261e+01,-2.829092304945532277e+01,-2.802187239243217931e+01,-1.583127857590093868e+01,-9.310819717549009056e+00,1.093429091777500251e-01,-3.186573275143423700e+00,6.213860481453892248e+00,-9.365643672132939912e+00,-6.326793170671759725e+00,2.731522414710978452e+00,-5.962360190820884753e+00,-6.537625364760994984e+00,-9.402791158789078452e+00,-9.326130218427012508e+00,-1.586256185172931765e+01,-9.662280739145643338e+00,-1.868345176221638226e+01,-1.570337474740523120e+01,-2.514594717633496401e+01,-1.882457343422754903e+01,-2.186363206337439280e+01,-3.146919142385169010e+01,-2.513897077582849704e+01,3.184468217066790174e+00,-2.188580380871307085e+01,-6.401190303776060020e+00,1.852427188016818604e-01,-1.543061098561204858e+01
-9.722038710363351299e+01,-9.563477327935737904e+00,-2.169313474279913834e+01,-1.594865172082983307e+01,-1.253058436489460803e+01,-9.145546603490508630e+00,-6.506659447854016065e+00,-6.216738583886579406e+00,-1.250278370452381438e+01,-9.709788610128192943e+00,-3.241383780509631052e+00,-4.244977475358853169e-01,-9.251167818010415544e+00,-3.113319323256682480e+00,-2.517419433888968427e+01,-6.204826350278880298e+00,-2.828347498823226402e+01,-9.365091344853972544e+00,-2.195165435853595426e+01,-1.285257384134827774e+01,-9.361863887734617862e+00,-6.409287229918678719e+00,-9.370412972720966849e+00,-1.575419409578963581e+01,-1.262741116925226059e+01,-2.173416952927744461e+01,-2.203999303968656065e+01,6.453331348733826189e-02,-3.407077540622953649e+00,-1.569278779498916876e+01
-5.956920941711842943e+01,-6.121099051712375783e+00,-9.413254293319774035e+00,-3.134642583844090424e+01,-1.884786729809385264e+01,-1.907609064687425260e+01,-9.418171370365271855e+00,-1.651696593977522554e+01,-6.285686097651293380e+00,-4.410746491947473658e+01,-4.381051292752847814e+01,-3.421541944273629099e+01,-3.756490939692763220e+01,-6.374822170282200773e+00,-1.594836743419337566e+01,-6.564374291803900974e+00,-2.840514024711551144e+01,-6.166022387059612697e+00,-1.237313787982298763e+01,3.212992323242588100e+00,-2.508669598253950994e+01,-9.221478719172420568e+00,1.269937551387434027e+01,-2.195618327616887910e+01,-1.889745490645193726e+01,-2.810049104086930782e+01,-1.868093288902280591e+01,-2.511508890360659763e+01,-9.562393475050127378e+00,1.881707736693060795e+01
-9.996530231687489731e+01,-2.201989522558973178e+01,-9.425558638060774541e+00,-6.282572036877315469e+00,-3.145030095999583164e+00,-3.054077718996351276e+00,-3.136826287415878323e+00,-3.146868807042149996e+00,-3.145657017565767877e+00,-3.141526574432210506e+00,-3.140916972487583170e+00,-3.135809862582718210e+00,-3.137134350351373335e+00,-3.171960364618339412e+00,-3.140439594909984145e+00,-3.140426410244196553e+00,-3.147333732850591925e+00,-3.143545636819661038e+00,-3.144386745771629244e+00,-3.148098088890679325e+00,-3.140329960260079378e+00,-3.139440391557826171e+00,-3.138066424954169875e+00,-3.141803885504566463e+00,-3.133457077507353805e+00,-3.138373489771602021e+00,-4.743687715848008378e-03,-5.385841043421817943e-03,-2.271495516274037087e-03,-1.656553673925471697e-04
