7.444266952283539199e-08,-6.102531799888498029e-06,-2.503412328537600985e-04,-2.152325837593997704e-03,-2.884362286178230803e-02,-1.398765779205773108e-01,-4.558111698610579632e-01,-1.478026017835542660e+00,-4.711705804716408430e+00,-9.659319895230607855e+00,-1.798211522914727922e+01,-3.294419209454515141e+01,-5.033479806992754391e+01,-7.097214738479482321e+01,-9.991266657714989208e+01,1.581729074636938328e-06,-4.035516929848820153e-05,-9.374338990695593558e-04,-1.208471237385180808e-02,-8.007825025131809493e-02,-2.769579911831847596e-01,-7.518397521122446303e-01,-1.772701156983282456e+00,-5.921030609917189658e+00,-2.306378104561919784e+01,-3.962529054405960949e+01,-5.952699134560855043e+01,-8.044434632027360976e+01,-9.987119874635054373e+01,-9.995862036828522434e+01
-1.985087704241110765e-11,-1.266821425158981440e-09,-9.104682074910223065e-08,-1.699499069753678166e-06,-1.088960337952497871e-05,-4.626194895476003032e-05,-1.777138220686447624e-04,-8.729221447453140844e-04,-3.650747634004582534e-03,-1.374416376473313120e-02,-4.096957141692030707e-02,-1.145109282103174558e-01,-3.373593368073127818e-01,-8.813080800344954557e-01,-1.972136074308125320e+00,-4.238515068058838153e+00,-8.243857346636460193e+00,-1.416748499463521860e+01,-2.735866892234434289e+01,-5.014138971447020765e+01,-7.832197015957157760e+01,-9.571106469170321418e+01,-9.818910169020085732e+01,-9.710227570046573931e+01,-9.884907132753841097e+01,-9.595667135477269483e+01,-8.973845568932706840e+01,-9.703390076377226592e+01,-9.799806550829134721e+01,-9.966349080086067147e+01
-1.898477015002024107e-11,-2.369073761612260801e-10,-6.008475927576405248e-09,-1.145770710069427985e-07,-2.018759946114528829e-06,-6.033634074011671804e-05,-2.578132222841288406e-04,-1.101978229314021533e-03,-4.830449712111711293e-03,-1.983108463592520021e-02,-6.365535191461316189e-02,-1.946776085818518465e-01,-5.306327261569164788e-01,-1.419844340187689458e+00,-3.912675730350692049e+00,-1.034880681479984865e+01,-2.543879791912505084e+01,-5.272627089455839666e+01,-9.741386120367323542e+01,-9.645611901965268942e+01,-9.999850064682797779e+01,-9.992681841134702836e+01,-9.223706865065052796e+01,-9.374761791318432813e+01,-7.642987640455436349e+01,-7.950656391155949620e+01,-8.203006230206415239e+01,-8.446193952157742046e+01,-8.855299977195032568e+01,-9.994172578313606436e+01
1.076349920399321509e-10,-6.449672979952911254e-09,-3.305404275576594479e-07,-1.517548765309277532e-05,-9.509011410494505568e-05,-4.033365281401842168e-04,-1.742093728245526496e-03,-7.254400725139900641e-03,-2.676177188593362177e-02,-8.558149833102679516e-02,-2.510473626371727551e-01,-6.950986647285452014e-01,-1.741963615872797133e+00,-4.215098381567550234e+00,-9.015676526902616672e+00,-1.814259915664870704e+01,-3.687794460216807835e+01,-6.627778797594616833e+01,-7.585901497117257009e+01,-9.999792126686001836e+01,2.332608607537839222e-04,-8.041262037908203028e-03,-4.715351280003936968e-02,-1.965524754883833380e-01,-6.207833978487238280e-01,-1.646858508994165637e+00,-4.944412076952660939e+00,-1.355315357070027460e+01,-3.784404353296979906e+01,-9.968668185537278248e+01
6.060274936317721825e-12,-6.396425877469459557e-10,-2.739802249821648986e-08,-2.041177163489951011e-07,-1.788571811183875222e-06,-1.580218071996144182e-05,-1.278157596382937101e-04,-8.592107767713925504e-04,-4.957414400499193102e-03,-2.379965949603361081e-02,-1.115346936709652043e-01,-3.631309752563856019e-01,-1.133753191131061433e+00,-3.191099159623649317e+00,-7.836628957710068732e+00,-1.772072466006076397e+01,-3.603928073603675131e+01,-6.591631332690532474e+01,-8.946805635689747760e+01,-9.568041528720171129e+01,-9.526744062681851233e+01,-9.242992722084436252e+01,-8.823059244473400042e+01,-8.525115348452440855e+01,-8.873892547814722320e+01,-8.946539251792465564e+01,-9.689765208182160450e+01,-9.991132371911292864e+01,-9.999987351272035596e+01,-9.865901742132180630e+01
4.085326512010448995e-10,-3.721992352477572416e-09,-1.979637315414296359e-08,-1.148836672847649012e-07,-8.438990267044457967e-07,-4.097139461320653656e-06,-2.034378589960127452e-05,-9.725763970064913550e-05,-4.454937581893042933e-04,-1.949778557756529866e-03,-7.795428752270785674e-03,-2.800831195661880949e-02,-1.123702521646389174e-01,-5.036941526013173354e-01,-1.858752458332516788e+00,-4.687122458867555075e+00,-1.030909963028804555e+01,-1.986728931074815563e+01,-3.697059845389644295e+01,-5.038407372934944561e+01,-7.078977203588773648e+01,-8.768838749941265576e+01,-8.935672026770546950e+01,-8.413855132366533951e+01,-9.172241344079780845e+01,-9.840715389898016952e+01,-9.992005346597647986e+01,-8.760457313876290186e+01,-8.187579963542351891e+01,-9.987967853827827014e+01
3.734349573673836308e-12,-7.217786437758400318e-10,-2.613742140538783733e-08,-2.736932597102772289e-07,-2.503104374188181285e-06,-1.979988462174096320e-05,-1.462006087858123461e-04,-6.481006056801584580e-04,-2.562026072166641386e-03,-8.849420860482043460e-03,-3.032783185469254197e-02,-8.158571334499983840e-02,-2.143851681171186907e-01,-5.822086715357293052e-01,-1.333525424085270306e+00,-2.294699746473105151e+00,-4.184138857371290321e+00,-7.332456294835033361e+00,-1.338600187148773024e+01,-2.249345992392311899e+01,-3.705868524664945340e+01,-6.178181624790756388e+01,-9.999999973592682068e+01,-9.803161747113280455e+01,-9.716173230014692308e+01,-9.999976829981611104e+01,-9.998536876392266493e+01,-9.314462740285591735e+01,-8.854002726222249464e+01,-9.999975506885411392e+01
-7.994094386934370047e-12,-3.540848725049028480e-09,-2.204148972235252473e-07,-2.455871543752659192e-05,-4.312539522701505233e-04,-2.670997923583378654e-03,-1.532364414900539221e-02,-7.521909578188588907e-02,-5.775389093797750339e-01,-2.143387364376799997e+00,-7.903798593175398679e+00,-1.819151525838764272e+01,-4.332722074871254847e+01,-6.135624474504185599e+01,-7.099119015717940329e+01,-8.135936394353036860e+01,-9.585232787833230361e+01,-9.294924298821155162e+01,-9.999982689384704315e+01,1.173925061469172246e-06,-1.016272318450833787e-05,-7.560185689529003205e-05,-4.743139939234343569e-04,-3.501759626235482429e-03,-2.036788622392386727e-02,-1.381431391198698622e-01,-7.662822904761885656e-01,-4.518516745358563291e+00,-2.336167479214319442e+01,-9.971123743068639556e+01
6.767737519503986285e-04,-1.197924740552185931e-02,-1.740467054722811546e-01,-9.685800062773073371e-01,-5.247798508065535827e+00,-2.266940274652605680e+01,-9.880107289948119842e+01,-6.595462100181188765e-06,-7.451425507137607426e-05,-9.603640715712282285e-04,-1.963399903727861689e-02,-1.347740400963295948e-01,-1.276072508752951196e+00,-4.175671973260882908e+00,-1.515240451333306382e+01,-3.649721807840342080e+01,-7.617157073253247290e+01,-9.992228158145459815e+01,-8.720020334162953483e-07,-1.120115609669260570e-05,-9.530949940049822800e-05,-1.055788933792438117e-03,-1.211223864066138592e-02,-7.954082772639506360e-02,-3.364921761979887127e-01,-1.467624418097754013e+00,-7.318743079734699286e+00,-2.416149023350818226e+01,-5.834976615185131266e+01,-9.999999711103923516e+01
1.150107036772177302e-04,-8.667624415427015779e-04,-4.355884169954992759e-03,-2.673903076185094735e-02,-1.415519254032551744e-01,-4.827390833828600902e-01,-2.020999083870147039e+00,-8.129420835480198448e+00,-2.268667114047019595e+01,-5.584371052905320454e+01,-9.999242862372963714e+01,3.679780881486607007e-09,-6.139394617464713237e-08,-4.690332448121125055e-07,-7.349391095823118543e-06,-7.074345555253133623e-05,-7.874239490313925203e-04,-4.091840817071852252e-03,-2.050422998265718014e-02,-7.416373563042633066e-02,-2.749557657656990783e-01,-8.101416222379630439e-01,-2.397850322561400738e+00,-8.154309691475797095e+00,-1.894578309387847526e+01,-2.636629237152831351e+01,-4.113535770337583131e+01,-6.641644770893665850e+01,-8.916242251168567634e+01,-9.993334773902984125e+01
5.028726306091128409e-08,-6.372127470100947122e-07,-7.784969282912339357e-06,-8.618533496431406019e-05,-4.260368106466224996e-04,-2.115012183759349632e-03,-1.001666088182931284e-02,-3.467945542348713217e-02,-1.322341594451440228e-01,-4.224915929916442936e-01,-1.310663460326981999e+00,-3.509431517245606980e+00,-1.055815268292461617e+01,-1.876461437318486603e+01,-3.406817692928140673e+01,-4.587232930431559907e+01,-6.270449777701607985e+01,-8.448309738713695083e+01,-9.989146779958461764e+01,-9.858885430355984170e+01,7.398121751631439525e-06,-1.050965884287871123e-04,-1.509532769166311216e-03,-2.566085723289375509e-02,-1.722776688400775580e-01,-6.348038770163419997e-01,-2.826116665263748384e+00,-1.239476395658136809e+01,-3.833656090398599758e+01,-9.974796331123405935e+01
4.619595357793602802e-12,-3.353091520162224384e-10,-3.300157881605730752e-08,-7.062714846591884827e-07,-1.052216242462412849e-05,-1.116483337306098915e-04,-1.198856601894532142e-03,-1.148392448786136888e-02,-8.854101456232892076e-02,-4.410320648162424639e-01,-1.822938248881486700e+00,-7.037394637318680424e+00,-1.347105858274864509e+01,-2.473660144831097796e+01,-3.757219535328273707e+01,-5.955687562850482664e+01,-7.037299144446305377e+01,-8.401993512422427557e+01,-9.980335718871691597e+01,-2.727285312683351241e-06,-2.020763696280255964e-04,-1.716502076648347783e-03,-5.120176815018150779e-02,-3.036138058290168695e-01,-9.468562456792714022e-01,-2.832956492656752978e+00,-7.102300154326600889e+00,-1.718066165543530843e+01,-4.029827279446227095e+01,-9.615254880543226079e+01
2.482139347415978417e-10,-1.816879988918568834e-08,-1.692918715594307583e-07,-2.057241132459338020e-06,-2.483969372221774956e-05,-1.316151706243583847e-04,-4.988941937531508365e-04,-1.904974390892609764e-03,-7.019059785313722273e-03,-2.411479082252087833e-02,-6.592640869302640594e-02,-1.619042006334960593e-01,-3.978371109686389961e-01,-9.281360262719714482e-01,-2.061444120755808740e+00,-3.818389149439586294e+00,-6.675228017389941648e+00,-1.269251198650904300e+01,-2.135199517206239506e+01,-3.073749057026846287e+01,-4.390163144282227847e+01,-5.183067011574865290e+01,-6.034317570731828084e+01,-7.355299399312464459e+01,-8.480465243514665019e+01,-9.174348410110241048e+01,-9.760295866636099049e+01,-8.781780717093877797e+01,-8.626725275189485842e+01,-9.998545957547356977e+01
-6.129762077356321144e-11,-1.403096225152920963e-09,-2.686344809979180787e-08,-2.862546161987313214e-07,-1.639757472289272606e-06,-1.184981649066678765e-05,-4.809883530313122151e-05,-2.160849868692108215e-04,-1.076956829069806738e-03,-3.724368590419122917e-03,-1.215258761233115048e-02,-4.570312109651432364e-02,-1.192710144669501121e-01,-3.694380632180078172e-01,-9.597989097622919852e-01,-2.547719821980949373e+00,-6.662166239559562442e+00,-1.423037747672985098e+01,-2.493729097492352054e+01,-4.554512523737935936e+01,-7.007527082139276331e+01,-8.803304878918457632e+01,-9.387760060390101557e+01,-9.943755503040280530e+01,-9.877296298132047525e+01,-8.236735698561945185e+01,-8.354932823544588416e+01,-9.972966419222082379e+01,-8.817834045525627573e+01,-9.995827858734217841e+01
-1.254646860043201603e-10,-2.052513043450063086e-09,-3.834712209791099845e-08,-4.122502958523429045e-07,-4.344879265385672061e-06,-5.012822394900920398e-05,-3.704473101378182986e-04,-1.841873099747624821e-03,-7.856787693980040593e-03,-3.120462922170519349e-02,-1.173211765612361401e-01,-3.622273940523044189e-01,-1.239052791496491279e+00,-4.057461652472520441e+00,-9.290898481320859048e+00,-1.947983246613862107e+01,-4.085367774214552838e+01,-7.999477662607064588e+01,-9.992337216825112023e+01,-9.967296900857614617e+01,-9.816220382341064976e+01,-9.264055097289386254e+01,-9.796997125153296793e+01,2.622047808056471199e-04,-3.172098999500781724e-02,-2.779913336850446393e-01,-1.796833173045029541e+00,-8.350836788296977176e+00,-3.427912651556767543e+01,-9.972023759827142442e+01
3.348643836091329058e-11,-8.658765561294741501e-10,-1.763584995989262770e-08,-4.450186999253143453e-07,-2.764301568461989683e-06,-1.512875407534186700e-05,-8.135287722121074035e-05,-3.744476127181414976e-04,-1.598531373549123315e-03,-6.400258894587272998e-03,-2.368904229821118881e-02,-7.155099249910082393e-02,-1.937006586980504763e-01,-5.431079557307681993e-01,-1.514939372687697849e+00,-3.902700530226599351e+00,-9.931734059290754146e+00,-2.442648834794388080e+01,-3.792680970019448239e+01,-5.002625001626621071e+01,-6.724079983156448748e+01,-8.181719433311832290e+01,-8.844755920107584757e+01,-9.991398134939029774e+01,-9.741245085203649978e+01,-8.952055946249379303e+01,-9.614755166766616412e+01,-9.576248250094039349e+01,-9.534969543204702802e+01,-9.999990631648094563e+01
1.532775808011858476e-09,-6.689745598035833152e-08,-4.644431910299767903e-07,-2.632053502291097972e-06,-1.445913572066539198e-05,-5.630961334126887916e-05,-2.101487435974271306e-04,-6.153710434755838921e-04,-2.162623170151668599e-03,-6.313296224935225319e-03,-1.819495497278440094e-02,-5.180942661849850805e-02,-1.515319738517280357e-01,-4.273486091617747507e-01,-1.064142312902780718e+00,-2.715922533956093066e+00,-5.992180981707988074e+00,-1.747020589980412097e+01,-3.648419306895970493e+01,-4.992155965399005169e+01,-6.541080163487872312e+01,-7.270124499988729383e+01,-6.361044445017018489e+01,-6.764994572119057636e+01,-7.396278202687079784e+01,-7.777123302284378781e+01,-8.022730428554444870e+01,-8.391317152733054741e+01,-8.623621041960518596e+01,-9.984894974007036694e+01
-1.580595220376299287e-07,-1.959721333071178130e-06,-1.861213294893464130e-05,-2.350317869968254216e-04,-3.729876437830692733e-03,-2.142885231453009812e-02,-1.339185582400443109e-01,-5.098210482466989379e-01,-1.675896931457086625e+00,-5.052928219220231831e+00,-1.358187960503206249e+01,-3.534685471634495002e+01,-9.999939060523739442e+01,1.492838263897549639e-07,-4.863661603242691990e-05,-1.631899337478221823e-03,-2.456472039368795893e-02,-1.392329193729506809e-01,-5.226701450260330395e-01,-1.780649014130151420e+00,-5.808610355761739008e+00,-1.895496994253939604e+01,-4.817789021472133726e+01,-9.999907763196195276e+01,5.959363413186599212e-05,-6.963879883265107831e-03,-4.835175782994203253e-01,-4.723978466329507242e+00,-2.647027968880281534e+01,-9.811704474086772620e+01
-4.852906049795986555e-11,-9.413487168081781741e-10,-1.427937776346298700e-08,-1.431886969663279376e-07,-1.531017653542641298e-06,-1.311595189612081259e-05,-8.626956227411417411e-05,-5.938599111367411088e-04,-3.480187943564504345e-03,-1.297542999864643130e-02,-4.949567942160969930e-02,-1.839057248951611045e-01,-6.757471812972239977e-01,-2.374367028655818501e+00,-7.386208022219861391e+00,-1.784102718655533337e+01,-2.505747228058531206e+01,-3.570955479995246407e+01,-4.936017406802650953e+01,-6.459417011621516735e+01,-9.365672409158665346e+01,-8.676549988746930353e+01,-8.784728151182851263e+01,-8.282396405666051464e+01,-8.300098860121991606e+01,-8.873654055267839169e+01,-9.178250065815531400e+01,-9.999977020571527930e+01,-9.999075329895309494e+01,-9.998241637263602399e+01
-3.042523996202919203e-09,-2.876396673985067636e-08,-5.612141614225109797e-07,-4.157404468412243212e-06,-2.012827426560614459e-05,-1.320079835182461320e-04,-6.323896627130047186e-04,-2.238536300931309123e-03,-6.594457970142635246e-03,-2.166848267239911488e-02,-6.244551901015481243e-02,-1.710716576695053281e-01,-4.181739879091261880e-01,-9.016902814809918398e-01,-1.862301476004968537e+00,-3.766642867042938381e+00,-6.967111109619412268e+00,-1.140911354549646362e+01,-1.823471311180346177e+01,-2.788405323463182839e+01,-4.197090394030371385e+01,-6.264291961498036443e+01,-7.876159232124065568e+01,-9.928027746819157073e+01,-9.715146603492600264e+01,-8.110197500833484696e+01,-8.189863861203339468e+01,-8.138794571362818431e+01,-8.719869051441095564e+01,-9.999986107041327443e+01
5.876437512500762376e-06,-1.342735557832771143e-04,-9.688168116963749923e-04,-3.464645509463720480e-03,-1.092766159971712142e-02,-3.878082122023814721e-02,-1.266803087488654334e-01,-3.486066462809678801e-01,-9.445399581028774971e-01,-2.459004298573200131e+00,-5.480195649880010400e+00,-1.143722979033997866e+01,-2.413790425233962011e+01,-4.533686840980183774e+01,-9.994689840331660946e+01,4.356105728678573893e-07,-6.756815665337447564e-06,-1.080915165181990943e-04,-6.153059473012039695e-04,-3.331390077099719016e-03,-1.597286372834861440e-02,-6.361180139336586326e-02,-1.933096920062565838e-01,-5.506285878115112498e-01,-1.213141140485224367e+00,-2.802727878606964040e+00,-6.379405199227916157e+00,-1.542377691021475172e+01,-3.741627853863221276e+01,-9.999121506509698065e+01
9.522812077381835512e-11,-3.009144118433348005e-09,-1.048773390604941192e-07,-6.489246408649779359e-07,-4.372685155037492341e-06,-2.379879879647823753e-05,-1.150500633271696847e-04,-6.722485916218567210e-04,-3.287934031862339325e-03,-1.542279464220857287e-02,-3.986869486607982904e-02,-1.036401636229405260e-01,-2.456638085227924040e-01,-5.321946473730114757e-01,-1.144724349338753333e+00,-2.551723160807882085e+00,-4.669561505667000567e+00,-8.225098653514603342e+00,-1.345796887545818876e+01,-2.184432967427536099e+01,-3.730052651664418306e+01,-5.057352089005041762e+01,-7.051860616572575680e+01,-8.010189333174658088e+01,-7.767026480668229738e+01,-8.652256035508398213e+01,-9.217218108342383687e+01,-9.973344595710408100e+01,-9.860954893531064158e+01,-9.997110855375989047e+01
-6.244890361749612191e-09,-1.787594245622756068e-07,-1.076703734185814033e-06,-4.005453964780964692e-06,-1.714453601161155461e-05,-6.771871914946211242e-05,-2.484484878578530911e-04,-8.596439270049578175e-04,-2.472092255580079188e-03,-8.493512635555292359e-03,-2.021306203740379226e-02,-5.062643136988693310e-02,-1.267762689983411017e-01,-3.052585272245353365e-01,-7.445641303837964298e-01,-1.801834714752196254e+00,-3.463199332026184685e+00,-6.561935842134434260e+00,-1.257407116038861794e+01,-2.260059632456372469e+01,-3.796977345997226649e+01,-4.822225855776119374e+01,-6.420060419285238140e+01,-6.867024426932925962e+01,-7.349098195980644732e+01,-8.056739226114552821e+01,-9.214386821907183389e+01,-9.422283412275739067e+01,-9.135645169813879818e+01,-9.998304354843148190e+01
4.295528151327083408e-06,-1.172339808277577517e-04,-1.836504532472692111e-03,-9.063660780659578073e-03,-3.277671762618000750e-02,-1.865077610580653522e-01,-1.032270077782027062e+00,-3.686166029094940289e+00,-1.182116015077870586e+01,-4.169756706585104666e+01,-9.939017444415151203e+01,3.214116111965583383e-11,-5.013191718887681487e-09,-1.373798381049070137e-07,-3.062813327883835562e-06,-5.038511767912994932e-05,-2.286095287380967254e-03,-1.482965680864625248e-02,-4.614953131923736629e-02,-1.447092350358279433e-01,-3.841829414034284018e-01,-8.725329865619420033e-01,-2.119183197973889765e+00,-3.910551136847172149e+00,-7.205504069297873571e+00,-1.349107963608411964e+01,-2.559818671261948353e+01,-3.931683044017505324e+01,-6.834271565165418849e+01,-9.710003521648482661e+01
2.506824577414729995e-14,-1.342523954807724249e-12,-3.826934904873121294e-11,-1.544849391713253453e-09,-3.923666887166755977e-08,-4.661951907262912603e-07,-1.062407330702120156e-05,-1.021365527170666404e-04,-6.841994168180297710e-04,-4.470989698621215432e-03,-3.680806867291412654e-02,-1.460766569671638482e-01,-4.914420333686862485e-01,-1.364289166600213710e+00,-3.691890481333977014e+00,-6.830678833417682227e+00,-1.354429100581494794e+01,-2.299315441661394033e+01,-4.137464159630459903e+01,-6.283463125698132501e+01,-6.682445420548474146e+01,-6.567864945815928479e+01,-7.605865046069932589e+01,-9.963967957048942026e+01,-9.981682960394384452e+01,-9.524395413812906952e+01,-9.886007258176844914e+01,-8.551915904166683902e+01,-9.658617115452497615e+01,-9.999920846427821175e+01
3.152711887617787220e-06,-6.220115206588409159e-05,-1.216506004490464218e-03,-8.169971408807654226e-03,-5.117455661741087541e-02,-3.150285637418338003e-01,-1.114494719653469357e+00,-4.891861605012396197e+00,-1.268834228525213881e+01,-3.352734085578759249e+01,-9.928810049496600243e+01,-4.487480305437218835e-10,-4.966847883731629347e-08,-2.403972614323267747e-06,-3.246973851335129024e-04,-1.913682179822068794e-03,-8.462600913785723114e-03,-2.442820283324645056e-02,-6.409961776446332360e-02,-1.216812905397951922e-01,-2.991027754997573895e-01,-6.300208649678852302e-01,-1.644854511696779431e+00,-3.513843124839276744e+00,-7.334107396349097030e+00,-1.570341251575977637e+01,-3.322904527681610887e+01,-5.848702751898442642e+01,-9.037007682952457799e+01,-9.999896530265604611e+01
-1.523715634467169170e-08,-1.763754336071792613e-07,-1.651448743547097814e-06,-1.000799185956318538e-05,-4.430633248032687905e-05,-1.693028458519107570e-04,-4.947055981950403917e-04,-1.630823423367491016e-03,-5.091513342698797059e-03,-1.243668448489268497e-02,-2.775760299591523844e-02,-6.505168037153287453e-02,-1.501127016754176813e-01,-3.208424855161075562e-01,-6.407374053434204964e-01,-1.338671889489892353e+00,-2.705880707676519670e+00,-5.446261600398619507e+00,-1.154698259708380981e+01,-1.963778314170462025e+01,-3.847547541507574920e+01,-6.617090768298199066e+01,-8.208102726903415203e+01,-7.745638511835851148e+01,-7.005067632660794175e+01,-7.243341818180711300e+01,-8.226169142391354683e+01,-9.755054109052676381e+01,-9.814665976646709566e+01,-9.999708802916211425e+01
2.533317681409616020e-05,-2.864552398396625829e-04,-1.942372970807334630e-03,-2.607958064018408087e-02,-1.647037122444837409e-01,-8.264888907688892061e-01,-5.740147170501151308e+00,-2.473317676984107649e+01,-9.900219575124438620e+01,-2.640184082063715637e-08,-2.271631893021599292e-06,-1.739989354426917556e-04,-2.485369816551855071e-03,-3.120558163758636872e-02,-3.063981189123687332e-01,-1.554984083157756825e+00,-9.186073044353378236e+00,-2.141985948305224596e+01,-3.989650250387403219e+01,-6.513325094488411082e+01,-9.959634190460789682e+01,6.118832642406076285e-07,-1.224740829007922897e-04,-1.063193808066593710e-03,-1.024332452324362014e-02,-8.536252927606842456e-02,-8.561366853513122654e-01,-4.924977202086506800e+00,-2.140382528566380316e+01,-9.980769409407963622e+01
-2.526963325441712745e-09,-5.237681280969083742e-08,-3.644546380540456789e-07,-5.616269632807157891e-06,-3.239620357971553056e-05,-1.136038318523395371e-04,-3.587399738850914491e-04,-1.362711998348589953e-03,-3.984725997452019143e-03,-1.306794320143732542e-02,-4.029518821214039120e-02,-9.665736370179361936e-02,-2.499622173661752156e-01,-6.427080094224318918e-01,-1.751170064445712660e+00,-4.118595825966722579e+00,-1.083079336027494577e+01,-2.338152561095599680e+01,-4.228429043597397907e+01,-5.547160074498700055e+01,-7.501931687031927254e+01,-8.589331327849021136e+01,-7.787023169406978695e+01,-9.982542079510022859e+01,4.049546933063192036e-03,-9.931621210806702849e-02,-8.682057883544789245e-01,-5.006104239769292974e+00,-3.117305229412001211e+01,-9.882682132963093125e+01
2.673665066177373656e-08,-2.750444685724160818e-06,-3.670114199966276051e-05,-7.418396359899959071e-04,-5.043662509915951449e-03,-3.049272300700930569e-02,-1.457555948691029168e-01,-5.919194841897162940e-01,-2.455738208849387760e+00,-7.422227596652892778e+00,-1.886864854971145533e+01,-4.150921946636356097e+01,-9.997622392947312164e+01,-3.669119988056840574e-08,-4.411877554594431687e-07,-5.473846642565827755e-06,-9.041239519348054810e-05,-8.792770762054611354e-04,-6.467906253142640359e-03,-6.124051332100570455e-02,-4.043504312899758868e-01,-2.276181941960967237e+00,-7.832187339221864164e+00,-1.824927563676889974e+01,-2.703257120829893623e+01,-3.900020446554947284e+01,-5.557868863670670834e+01,-7.464816676147174235e+01,-9.770146631460846720e+01,-9.999961069806067826e+01
