-7.547081893875323999e+01,2.102345435648897620e+01,-2.947728212769500189e+01,-9.413521456454173375e+00,1.423944335743208356e+01,-7.662017216392879249e+00,-4.323770815608519769e+01,-3.764835309159718690e+01,1.552590849148415231e+01,3.257678722387981196e+01
8.308466240596419539e+01,-2.979239979451007869e+01,-2.405476352682085484e+00,-3.009795098788685763e+01,-2.451732876278073547e+01,-1.428131610633169757e+01,-5.682206019767445326e+00,3.643117267366648093e+01,-1.361944081489302860e+01,-4.642762080126527025e+01
1.131034781350512830e+00,-1.622822346183771636e+00,-1.077855575381209974e+01,-4.192592789464746517e+01,5.871516972849967431e+00,-1.802409552273633508e+01,-4.235063489879786403e+01,-1.198242274992480105e+01,5.341342006624397243e+01,1.576245271584735264e+00
1.745967669211339057e+01,1.108136299010042691e+01,-9.854065480594593751e+00,7.039977460133885145e+00,4.939561309452926707e+00,-1.390261612308010264e+00,-1.172165202055070665e+01,-3.021704971450074950e+01,-1.817244451025884189e+01,6.228340859690796094e+01
3.964001161423496455e+01,-1.277262451222872741e+01,2.558038402471938255e+01,2.122836674938225698e+01,-1.079242636807173028e+01,-3.095879563821079827e+01,-2.284515372722204063e+01,2.577563536626829688e+00,-1.423669214838302777e+00,-1.182928519221263297e+00
6.303608424639907781e+00,-1.053664568410872704e+01,8.446672744506908970e+00,-3.526376961808882271e+00,-1.054330672848276862e+01,-2.117370604076030816e+01,-5.414810183873157712e+01,-1.285129929027405282e+01,7.523399819382060372e+00,-5.497193440441645862e+01
4.228067123952078177e+00,3.568739850185746576e+00,3.286859741284033021e+00,7.554943878791043232e+00,-2.061425951992586647e+01,6.140673720287423976e-01,-6.728790871793313499e+01,6.830104481032735464e+01,-1.552528652562233447e+01,6.693142421647347362e+01
9.459429511259077117e+01,-4.206872794590797326e+01,6.395834480883423367e+01,-2.430803603806663915e+01,-8.677580360886617328e+00,1.464290779677627086e+01,3.731075385094362673e+01,1.975305970501953112e+00,-2.864464958557168472e+01,-8.338639731277564238e+01
-3.672612539206426163e+00,-4.257742640119730027e+01,-1.013772391675235696e+01,-6.968365439707940823e+01,-4.463758569750805982e+00,6.587979454782018962e+00,-1.183237294758656510e+01,2.234142678206492150e+00,-5.496858898897756518e+01,-7.335191579056305500e+01
-2.567638577247190668e+01,6.310627098345152675e+00,6.621067516554764332e+00,-1.470493251866390239e+00,1.553045992568072364e+01,4.803461557614144084e+01,3.076152460718518711e+01,-2.348352500380862296e+01,-1.229824699824882650e+01,1.478979459117838857e+01
2.661825041536819825e+01,-1.449136240470333803e+01,6.066589571258165670e+00,2.988748428436410975e+00,7.684714907552464780e+00,-2.231322755391692425e+01,2.179496497516023013e+01,7.080044713558244496e+01,3.846532773438221398e+01,-8.307561356629736338e+01
-4.847733634808812297e+01,1.835741408538595820e+01,-1.836551086216486794e+01,6.064363211021007061e+00,-1.207066356857136391e+01,-2.387413837253371085e+01,8.353018505489711032e+00,-4.159880908874598049e+00,2.620524545808009265e+01,4.003575064228177993e+00
-6.067050525765972679e+01,2.071593493240331441e+01,-8.939804950477999057e+00,-3.617134843188383631e+00,-3.610084899965242755e+01,6.333486280087048925e+01,2.823020002638322268e+01,-3.194448111279497127e+01,-5.397515944925890707e+00,-5.013821182198925897e+01
-2.133045719349712499e+01,3.089265286491988505e+01,3.033397902953172220e+01,3.353128273245103941e+01,2.590712295586303782e+01,-6.255750539432794355e+00,1.821918367409834616e+01,2.741875529991325777e+00,-3.575437488516563178e+00,4.120665569389094429e+01
-6.191642956985688784e+00,-5.555677010432239626e+01,-5.538844806906242013e+01,5.596318492292213875e+01,-1.082543010912050363e+01,-4.934714097477381500e+01,-1.035613146102919302e+01,9.656206775051268210e+01,-2.948300187496779401e+01,4.826010032480589018e+01
3.147766808600872679e+01,-3.328206776719092375e+01,1.373985652409286651e+01,2.758963153774259780e+01,-3.470810634388179494e-01,-3.470767930303650672e+01,3.853660671955341854e+01,-1.750465142121372608e+00,3.005867829109437395e+00,2.562927730933244064e+01
1.887373018651786793e+01,3.307666242586638816e+01,6.289697455408740012e+01,-4.747783571508776390e+00,-1.174129898349281831e+00,3.553541502915983585e+00,-2.211045632473585698e+01,1.171688557999850921e+01,2.757899155730534702e+01,-4.966576956486689198e+01
-8.452250655198483287e-01,-4.911590248041730433e+01,5.268561199328189559e+01,1.826463647067792806e+01,-5.563413675680046566e+01,-4.966881143648797092e+01,3.785061964049516092e+01,4.958660061843474409e+01,-6.556939473715587496e+01,5.934580536781083993e+01
-4.205906007671700308e+00,-5.208367458051279542e-01,-4.012915739917080060e+00,-7.173842006297402918e+01,-1.401607454319235613e+00,2.451131840376352233e+00,-8.912221100335706581e-01,7.070333859082435879e+01,6.115297591277067291e+00,5.712626054648045937e+01
-4.754910790224251116e+00,5.847966625651402239e+00,-5.812704177151090335e+00,-1.727259381308813602e+01,3.445527919456164767e+01,2.122867359389654141e+01,-6.959314881102272921e+01,-3.979998391162261839e+00,2.178861650429825403e+01,6.062439324340747504e+01
-9.348378230361115016e+01,8.297611606948213137e+01,7.681601767959952554e+01,-3.536479931733028081e+01,1.206741489096256359e+01,2.233010625115348091e+00,-4.200659326629439505e+01,-4.198892395285865575e+01,-5.764452182744726372e+00,9.589669289924174223e+01
-7.080355715319143428e+00,2.284797818092830113e+00,-5.355643524807724987e+00,-1.709746306962901485e+01,-1.709861608819931433e+01,1.827794327462002766e+00,7.958846113004206302e+00,1.382488854480983065e+01,6.263715527103178715e+01,-1.093761940357957485e+01
-1.462844222687621709e+00,-1.904338597527242882e+00,3.827208673642985559e-01,1.304046143483694387e+01,2.066248250956904897e+01,-3.635393442737301584e+00,-6.792809511311066473e+00,4.251841362106844713e+00,3.895278058325486370e+01,-1.742217578921293253e+01
-3.966792864769096383e+01,3.315464772196563814e+01,3.807224063036867889e+00,7.685453895218842923e+00,-3.064667792645799693e+01,2.603009967212869924e+01,6.114428284079474807e+00,1.855391263040809591e+00,-1.078588055032591342e+01,-2.706347395426807623e+01
-2.027521284247901789e+00,-8.064147107661836955e+00,1.450301792899079700e+01,-1.021357001406895293e+01,3.425095083231301629e+00,-3.088857913872853800e+01,3.344062917699723414e+00,4.499333831956376173e+01,8.323121688838810428e-01,-1.081608481922540932e+01
-2.235266386924033100e+01,-1.273790024909980012e+01,2.973673595750305765e-01,-1.361174556682987813e+00,-1.014379150393303242e+01,1.484168725396884980e+01,-5.148061554129019868e+01,-3.085799921527531353e+00,9.052993611347460501e+01,5.480359951643380612e+01
-3.820326506816704892e+01,7.415411955560566426e+00,-8.451674956220823987e+00,2.380982208545448131e+01,-4.403807925169433446e+01,1.475613008409559690e+01,-4.253557716613723727e+00,1.491138340500054227e+00,3.825597950380829282e+00,6.117876045279704300e+00
3.260460776589482634e+00,-2.883336916101168157e+01,-1.690265033640976355e-01,2.159265514373816330e+01,-1.840164434819996586e+00,-6.454843179602126391e+00,-4.406978886994703970e+00,3.916853216711796648e+00,3.825845973480902984e+01,-5.746620833421013685e+01
1.394241642218590371e+00,4.396180057644065897e+01,-8.611143125329260073e+00,7.355035840446557671e+00,3.744813576312872527e+01,-9.864905788820195198e+00,-5.119993858029635803e+00,-6.195946740580565049e+00,-3.964626084893496483e+01,7.535634072181250254e+00
-5.083754999458598434e+01,-3.542767858191817254e+01,-1.156717066277176187e+01,-1.082610859756432120e+01,1.317333104282202250e+01,-1.947216473055352282e+01,-4.553079634107875862e+00,-4.582561423653200450e+01,3.937903945302228692e+01,8.348553344538339616e+01
