-1.000000000000000000e+02,-1.000000000000000000e+02,-1.000000000000000000e+02,-1.000000000000000000e+02,-1.000000000000000000e+02,-1.000000000000000000e+02,-1.000000000000000000e+02,-1.000000000000000000e+02,-1.000000000000000000e+02,-1.000000000000000000e+02,-1.000000000000000000e+02,-9.999999999999991473e+01,-1.000000000000000000e+02,-1.000000000000000000e+02,-1.000000000000000000e+02,-1.000000000000000000e+02,-9.999999999999974420e+01,-1.000000000000000000e+02,-1.000000000000000000e+02,-9.999999999999987210e+01,-1.000000000000000000e+02,-1.000000000000000000e+02,-1.000000000000000000e+02,-9.999999999999994316e+01,-1.000000000000000000e+02,-9.999999999999980105e+01,-1.000000000000000000e+02,-1.000000000000000000e+02,-9.999999999999998579e+01,-1.000000000000000000e+02
-1.000000000000000000e+02,-1.000000000000000000e+02,-1.000000000000000000e+02,-1.000000000000000000e+02,-1.000000000000000000e+02,-9.999999999999997158e+01,-1.000000000000000000e+02,-1.000000000000000000e+02,-1.000000000000000000e+02,-1.000000000000000000e+02,-1.000000000000000000e+02,-1.000000000000000000e+02,-1.000000000000000000e+02,-9.999999999999991473e+01,-1.000000000000000000e+02,-1.000000000000000000e+02,-1.000000000000000000e+02,-9.999999999999987210e+01,-1.000000000000000000e+02,-1.000000000000000000e+02,-9.999999999999992895e+01,-1.000000000000000000e+02,-9.999999999999994316e+01,-1.000000000000000000e+02,-1.000000000000000000e+02,-1.000000000000000000e+02,-1.000000000000000000e+02,-9.999999999999982947e+01,-1.000000000000000000e+02,-1.000000000000000000e+02
-1.000000000000000000e+02,-1.000000000000000000e+02,-1.000000000000000000e+02,-1.000000000000000000e+02,-1.000000000000000000e+02,-1.000000000000000000e+02,-1.000000000000000000e+02,-1.000000000000000000e+02,-1.000000000000000000e+02,-1.000000000000000000e+02,-1.000000000000000000e+02,-1.000000000000000000e+02,-1.000000000000000000e+02,-1.000000000000000000e+02,-1.000000000000000000e+02,-1.000000000000000000e+02,-9.999999999999975842e+01,-1.000000000000000000e+02,-1.000000000000000000e+02,-1.000000000000000000e+02,-1.000000000000000000e+02,-1.000000000000000000e+02,-1.000000000000000000e+02,-1.000000000000000000e+02,-1.000000000000000000e+02,-1.000000000000000000e+02,-1.000000000000000000e+02,-9.999999999999980105e+01,-1.000000000000000000e+02,-1.000000000000000000e+02
-1.000000000000000000e+02,-1.000000000000000000e+02,-1.000000000000000000e+02,-1.000000000000000000e+02,-1.000000000000000000e+02,-1.000000000000000000e+02,-1.000000000000000000e+02,-1.000000000000000000e+02,-1.000000000000000000e+02,-9.999999999999995737e+01,-1.000000000000000000e+02,-1.000000000000000000e+02,-9.999999999999991473e+01,-1.000000000000000000e+02,-1.000000000000000000e+02,-1.000000000000000000e+02,-1.000000000000000000e+02,-9.999999999999994316e+01,-1.000000000000000000e+02,-1.000000000000000000e+02,-9.999999999999982947e+01,-1.000000000000000000e+02,-1.000000000000000000e+02,-9.999999999999992895e+01,-1.000000000000000000e+02,-1.000000000000000000e+02,-1.000000000000000000e+02,-1.000000000000000000e+02,-9.999999999999994316e+01,-9.999999999999977263e+01
-1.000000000000000000e+02,-1.000000000000000000e+02,-1.000000000000000000e+02,-1.000000000000000000e+02,-1.000000000000000000e+02,-1.000000000000000000e+02,-1.000000000000000000e+02,-1.000000000000000000e+02,-1.000000000000000000e+02,-1.000000000000000000e+02,-1.000000000000000000e+02,-9.999999999999988631e+01,-1.000000000000000000e+02,-9.999999999999992895e+01,-1.000000000000000000e+02,-9.999999999999997158e+01,-1.000000000000000000e+02,-9.999999999999991473e+01,-1.000000000000000000e+02,-9.999999999999987210e+01,-1.000000000000000000e+02,-9.999999999999997158e+01,-9.999999999999997158e+01,-9.999999999999985789e+01,-9.999999999999981526e+01,-9.999999999999995737e+01,-1.000000000000000000e+02,-9.999999999999997158e+01,-9.999999999999997158e+01,9.999999999999988631e+01
-9.999999999999994316e+01,-1.000000000000000000e+02,-9.999999999999997158e+01,-1.000000000000000000e+02,-9.999999999999988631e+01,-9.999999999999997158e+01,-1.000000000000000000e+02,-9.999999999999997158e+01,-1.000000000000000000e+02,-1.000000000000000000e+02,-1.000000000000000000e+02,-1.000000000000000000e+02,-1.000000000000000000e+02,-9.999999999999994316e+01,-9.999999999999987210e+01,-1.000000000000000000e+02,-9.999999999999997158e+01,-1.000000000000000000e+02,-9.999999999999995737e+01,-1.000000000000000000e+02,-9.999999999999992895e+01,-1.000000000000000000e+02,-9.999999999999988631e+01,-9.999999999999994316e+01,-9.999999999999990052e+01,-9.999999999999995737e+01,-9.999999999999987210e+01,-9.999999999999997158e+01,-9.999999999999984368e+01,-9.999999999999994316e+01
-1.000000000000000000e+02,-1.000000000000000000e+02,-1.000000000000000000e+02,-1.000000000000000000e+02,-1.000000000000000000e+02,-1.000000000000000000e+02,-1.000000000000000000e+02,-1.000000000000000000e+02,-1.000000000000000000e+02,-1.000000000000000000e+02,-1.000000000000000000e+02,-1.000000000000000000e+02,-9.999999999999995737e+01,-9.999999999999980105e+01,-1.000000000000000000e+02,-1.000000000000000000e+02,-1.000000000000000000e+02,-9.999999999999981526e+01,-1.000000000000000000e+02,-1.000000000000000000e+02,-9.999999999999991473e+01,-1.000000000000000000e+02,-1.000000000000000000e+02,-1.000000000000000000e+02,-9.999999999999980105e+01,-1.000000000000000000e+02,-1.000000000000000000e+02,-1.000000000000000000e+02,-1.000000000000000000e+02,-1.000000000000000000e+02
-1.000000000000000000e+02,-1.000000000000000000e+02,-1.000000000000000000e+02,-1.000000000000000000e+02,-1.000000000000000000e+02,-1.000000000000000000e+02,-1.000000000000000000e+02,-1.000000000000000000e+02,-1.000000000000000000e+02,-9.999999999999995737e+01,-1.000000000000000000e+02,-1.000000000000000000e+02,-9.999999999999994316e+01,-1.000000000000000000e+02,-9.999999999999995737e+01,-9.999999999999990052e+01,-1.000000000000000000e+02,-9.999999999999977263e+01,-1.000000000000000000e+02,-1.000000000000000000e+02,-9.999999999999995737e+01,-9.999999999999987210e+01,-1.000000000000000000e+02,-9.999999999999984368e+01,-9.999999999999998579e+01,-9.999999999999987210e+01,-9.999999999999994316e+01,-9.999999999999998579e+01,-9.999999999999994316e+01,-1.000000000000000000e+02
-1.000000000000000000e+02,-1.000000000000000000e+02,-1.000000000000000000e+02,-1.000000000000000000e+02,-1.000000000000000000e+02,-1.000000000000000000e+02,-1.000000000000000000e+02,-1.000000000000000000e+02,-9.999999999999998579e+01,-1.000000000000000000e+02,-1.000000000000000000e+02,-9.999999999999990052e+01,-9.999999999999997158e+01,-1.000000000000000000e+02,-1.000000000000000000e+02,-9.999999999999995737e+01,-9.999999999999997158e+01,-9.999999999999994316e+01,-1.000000000000000000e+02,-1.000000000000000000e+02,-1.000000000000000000e+02,-1.000000000000000000e+02,-1.000000000000000000e+02,-9.999999999999997158e+01,-9.999999999999980105e+01,-1.000000000000000000e+02,-9.999999999999998579e+01,-9.999999999999984368e+01,-9.999999999999991473e+01,-1.000000000000000000e+02
-1.000000000000000000e+02,-1.000000000000000000e+02,-1.000000000000000000e+02,-1.000000000000000000e+02,-9.999999999999998579e+01,-1.000000000000000000e+02,-1.000000000000000000e+02,-1.000000000000000000e+02,-1.000000000000000000e+02,-9.999999999999998579e+01,-1.000000000000000000e+02,-9.999999999999988631e+01,-1.000000000000000000e+02,-9.999999999999990052e+01,-9.999999999999992895e+01,-1.000000000000000000e+02,-9.999999999999995737e+01,-9.999999999999998579e+01,-1.000000000000000000e+02,-9.999999999999988631e+01,-9.999999999999997158e+01,-1.000000000000000000e+02,-9.999999999999994316e+01,-1.000000000000000000e+02,-1.000000000000000000e+02,-9.999999999999991473e+01,-9.999999999999992895e+01,-9.999999999999987210e+01,-9.999999999999997158e+01,9.999999999999987210e+01
-1.000000000000000000e+02,-1.000000000000000000e+02,-1.000000000000000000e+02,-1.000000000000000000e+02,-1.000000000000000000e+02,-9.999999999999997158e+01,-1.000000000000000000e+02,-9.999999999999997158e+01,-1.000000000000000000e+02,-1.000000000000000000e+02,-9.999999999999992895e+01,-9.999999999999998579e+01,-1.000000000000000000e+02,-1.000000000000000000e+02,-1.000000000000000000e+02,-1.000000000000000000e+02,-1.000000000000000000e+02,-1.000000000000000000e+02,-1.000000000000000000e+02,-1.000000000000000000e+02,-9.999999999999988631e+01,-1.000000000000000000e+02,-9.999999999999997158e+01,-9.999999999999995737e+01,-1.000000000000000000e+02,-1.000000000000000000e+02,-1.000000000000000000e+02,-1.000000000000000000e+02,-9.999999999999994316e+01,1.000000000000000000e+02
-1.000000000000000000e+02,-1.000000000000000000e+02,-1.000000000000000000e+02,-1.000000000000000000e+02,-1.000000000000000000e+02,-1.000000000000000000e+02,-9.999999999999998579e+01,-1.000000000000000000e+02,-1.000000000000000000e+02,-1.000000000000000000e+02,-1.000000000000000000e+02,-1.000000000000000000e+02,-1.000000000000000000e+02,-1.000000000000000000e+02,-1.000000000000000000e+02,-9.999999999999974420e+01,-1.000000000000000000e+02,-1.000000000000000000e+02,-1.000000000000000000e+02,-1.000000000000000000e+02,-1.000000000000000000e+02,-1.000000000000000000e+02,-1.000000000000000000e+02,-9.999999999999987210e+01,-9.999999999999984368e+01,-1.000000000000000000e+02,-9.999999999999981526e+01,-1.000000000000000000e+02,-1.000000000000000000e+02,9.999999999999960210e+01
-1.000000000000000000e+02,-9.999999999999992895e+01,-1.000000000000000000e+02,-9.999999999999991473e+01,-1.000000000000000000e+02,-1.000000000000000000e+02,-1.000000000000000000e+02,-1.000000000000000000e+02,-1.000000000000000000e+02,-9.999999999999998579e+01,-9.999999999999998579e+01,-1.000000000000000000e+02,-9.999999999999988631e+01,-1.000000000000000000e+02,-1.000000000000000000e+02,-1.000000000000000000e+02,-9.999999999999994316e+01,-1.000000000000000000e+02,-1.000000000000000000e+02,-1.000000000000000000e+02,-9.999999999999991473e+01,-9.999999999999998579e+01,-1.000000000000000000e+02,-9.999999999999995737e+01,-9.999999999999987210e+01,-9.999999999999997158e+01,-9.999999999999998579e+01,-9.999999999999991473e+01,-9.999999999999998579e+01,1.000000000000000000e+02
-1.000000000000000000e+02,-1.000000000000000000e+02,-1.000000000000000000e+02,-1.000000000000000000e+02,-1.000000000000000000e+02,-1.000000000000000000e+02,-1.000000000000000000e+02,-9.999999999999997158e+01,-1.000000000000000000e+02,-1.000000000000000000e+02,-9.999999999999997158e+01,-9.999999999999995737e+01,-1.000000000000000000e+02,-1.000000000000000000e+02,-1.000000000000000000e+02,-1.000000000000000000e+02,-1.000000000000000000e+02,-9.999999999999988631e+01,-1.000000000000000000e+02,-9.999999999999984368e+01,-1.000000000000000000e+02,-1.000000000000000000e+02,-1.000000000000000000e+02,-9.999999999999987210e+01,-1.000000000000000000e+02,-9.999999999999995737e+01,-1.000000000000000000e+02,-1.000000000000000000e+02,-1.000000000000000000e+02,9.999999999999994316e+01
-1.000000000000000000e+02,-1.000000000000000000e+02,-1.000000000000000000e+02,-1.000000000000000000e+02,-1.000000000000000000e+02,-1.000000000000000000e+02,-1.000000000000000000e+02,-1.000000000000000000e+02,-1.000000000000000000e+02,-9.999999999999997158e+01,-1.000000000000000000e+02,-9.999999999999987210e+01,-1.000000000000000000e+02,-1.000000000000000000e+02,-9.999999999999985789e+01,-1.000000000000000000e+02,-9.999999999999991473e+01,-9.999999999999997158e+01,-1.000000000000000000e+02,-1.000000000000000000e+02,-9.999999999999992895e+01,-9.999999999999995737e+01,-9.999999999999987210e+01,-9.999999999999995737e+01,-9.999999999999992895e+01,-9.999999999999987210e+01,-9.999999999999994316e+01,-9.999999999999985789e+01,-9.999999999999991473e+01,9.999999999999984368e+01
-1.000000000000000000e+02,-1.000000000000000000e+02,-1.000000000000000000e+02,-1.000000000000000000e+02,-1.000000000000000000e+02,-9.999999999999997158e+01,-9.999999999999998579e+01,-1.000000000000000000e+02,-1.000000000000000000e+02,-1.000000000000000000e+02,-1.000000000000000000e+02,-1.000000000000000000e+02,-1.000000000000000000e+02,-9.999999999999994316e+01,-1.000000000000000000e+02,-1.000000000000000000e+02,-1.000000000000000000e+02,-9.999999999999997158e+01,-9.999999999999987210e+01,-9.999999999999992895e+01,-9.999999999999994316e+01,-9.999999999999985789e+01,-1.000000000000000000e+02,-1.000000000000000000e+02,-1.000000000000000000e+02,-9.999999999999988631e+01,-1.000000000000000000e+02,-1.000000000000000000e+02,-1.000000000000000000e+02,-1.000000000000000000e+02
-1.000000000000000000e+02,-1.000000000000000000e+02,-1.000000000000000000e+02,-1.000000000000000000e+02,-1.000000000000000000e+02,-1.000000000000000000e+02,-1.000000000000000000e+02,-1.000000000000000000e+02,-1.000000000000000000e+02,-1.000000000000000000e+02,-1.000000000000000000e+02,-9.999999999999987210e+01,-1.000000000000000000e+02,-9.999999999999994316e+01,-1.000000000000000000e+02,-1.000000000000000000e+02,-9.999999999999992895e+01,-1.000000000000000000e+02,-1.000000000000000000e+02,-9.999999999999995737e+01,-1.000000000000000000e+02,-1.000000000000000000e+02,-9.999999999999994316e+01,-1.000000000000000000e+02,-9.999999999999998579e+01,-1.000000000000000000e+02,-1.000000000000000000e+02,-1.000000000000000000e+02,-9.999999999999998579e+01,-1.000000000000000000e+02
-1.000000000000000000e+02,-1.000000000000000000e+02,-1.000000000000000000e+02,-1.000000000000000000e+02,-1.000000000000000000e+02,-1.000000000000000000e+02,-1.000000000000000000e+02,-9.999999999999997158e+01,-1.000000000000000000e+02,-1.000000000000000000e+02,-1.000000000000000000e+02,-1.000000000000000000e+02,-1.000000000000000000e+02,-1.000000000000000000e+02,-9.999999999999984368e+01,-1.000000000000000000e+02,-1.000000000000000000e+02,-1.000000000000000000e+02,-9.999999999999997158e+01,-9.999999999999988631e+01,-9.999999999999982947e+01,-1.000000000000000000e+02,-1.000000000000000000e+02,-9.999999999999998579e+01,-9.999999999999998579e+01,-9.999999999999992895e+01,-1.000000000000000000e+02,-1.000000000000000000e+02,-9.999999999999990052e+01,-1.000000000000000000e+02
-1.000000000000000000e+02,-1.000000000000000000e+02,-1.000000000000000000e+02,-1.000000000000000000e+02,-1.000000000000000000e+02,-1.000000000000000000e+02,-1.000000000000000000e+02,-1.000000000000000000e+02,-1.000000000000000000e+02,-1.000000000000000000e+02,-1.000000000000000000e+02,-1.000000000000000000e+02,-1.000000000000000000e+02,-1.000000000000000000e+02,-1.000000000000000000e+02,-1.000000000000000000e+02,-1.000000000000000000e+02,-9.999999999999978684e+01,-1.000000000000000000e+02,-9.999999999999984368e+01,-1.000000000000000000e+02,-1.000000000000000000e+02,-1.000000000000000000e+02,-1.000000000000000000e+02,-9.999999999999991473e+01,-1.000000000000000000e+02,-1.000000000000000000e+02,-1.000000000000000000e+02,-1.000000000000000000e+02,-9.999999999999998579e+01
-9.999999999999994316e+01,-1.000000000000000000e+02,-1.000000000000000000e+02,-9.999999999999995737e+01,-1.000000000000000000e+02,-1.000000000000000000e+02,-1.000000000000000000e+02,-1.000000000000000000e+02,-1.000000000000000000e+02,-1.000000000000000000e+02,-9.999999999999994316e+01,-1.000000000000000000e+02,-9.999999999999991473e+01,-1.000000000000000000e+02,-1.000000000000000000e+02,-9.999999999999994316e+01,-1.000000000000000000e+02,-9.999999999999994316e+01,-1.000000000000000000e+02,-9.999999999999997158e+01,-1.000000000000000000e+02,-1.000000000000000000e+02,-9.999999999999985789e+01,-9.999999999999990052e+01,-9.999999999999994316e+01,-1.000000000000000000e+02,-9.999999999999990052e+01,-1.000000000000000000e+02,-9.999999999999985789e+01,-1.000000000000000000e+02
-1.000000000000000000e+02,-1.000000000000000000e+02,-1.000000000000000000e+02,-1.000000000000000000e+02,-1.000000000000000000e+02,-1.000000000000000000e+02,-1.000000000000000000e+02,-1.000000000000000000e+02,-1.000000000000000000e+02,-1.000000000000000000e+02,-1.000000000000000000e+02,-1.000000000000000000e+02,-1.000000000000000000e+02,-1.000000000000000000e+02,-1.000000000000000000e+02,-1.000000000000000000e+02,-1.000000000000000000e+02,-1.000000000000000000e+02,-1.000000000000000000e+02,-1.000000000000000000e+02,-9.999999999999982947e+01,-1.000000000000000000e+02,-1.000000000000000000e+02,-1.000000000000000000e+02,-1.000000000000000000e+02,-1.000000000000000000e+02,-1.000000000000000000e+02,-1.000000000000000000e+02,-1.000000000000000000e+02,1.000000000000000000e+02
-1.000000000000000000e+02,-1.000000000000000000e+02,-1.000000000000000000e+02,-1.000000000000000000e+02,-1.000000000000000000e+02,-1.000000000000000000e+02,-1.000000000000000000e+02,-1.000000000000000000e+02,-1.000000000000000000e+02,-9.999999999999995737e+01,-1.000000000000000000e+02,-9.999999999999998579e+01,-9.999999999999998579e+01,-9.999999999999987210e+01,-1.000000000000000000e+02,-1.000000000000000000e+02,-1.000000000000000000e+02,-1.000000000000000000e+02,-1.000000000000000000e+02,-9.999999999999981526e+01,-1.000000000000000000e+02,-1.000000000000000000e+02,-1.000000000000000000e+02,-9.999999999999991473e+01,-9.999999999999990052e+01,-9.999999999999991473e+01,-1.000000000000000000e+02,-9.999999999999995737e+01,-1.000000000000000000e+02,-1.000000000000000000e+02
-1.000000000000000000e+02,-1.000000000000000000e+02,-1.000000000000000000e+02,-1.000000000000000000e+02,-1.000000000000000000e+02,-1.000000000000000000e+02,-1.000000000000000000e+02,-1.000000000000000000e+02,-1.000000000000000000e+02,-1.000000000000000000e+02,-1.000000000000000000e+02,-1.000000000000000000e+02,-1.000000000000000000e+02,-1.000000000000000000e+02,-1.000000000000000000e+02,-1.000000000000000000e+02,-1.000000000000000000e+02,-1.000000000000000000e+02,-1.000000000000000000e+02,-1.000000000000000000e+02,-1.000000000000000000e+02,-1.000000000000000000e+02,-1.000000000000000000e+02,-1.000000000000000000e+02,-9.999999999999988631e+01,-1.000000000000000000e+02,-9.999999999999998579e+01,-1.000000000000000000e+02,-1.000000000000000000e+02,-1.000000000000000000e+02
-1.000000000000000000e+02,-1.000000000000000000e+02,-1.000000000000000000e+02,-1.000000000000000000e+02,-1.000000000000000000e+02,-1.000000000000000000e+02,-1.000000000000000000e+02,-1.000000000000000000e+02,-1.000000000000000000e+02,-9.999999999999995737e+01,-1.000000000000000000e+02,-9.999999999999998579e+01,-9.999999999999987210e+01,-1.000000000000000000e+02,-1.000000000000000000e+02,-9.999999999999982947e+01,-1.000000000000000000e+02,-1.000000000000000000e+02,-9.999999999999988631e+01,-1.000000000000000000e+02,-9.999999999999985789e+01,-1.000000000000000000e+02,-9.999999999999995737e+01,-1.000000000000000000e+02,-1.000000000000000000e+02,-1.000000000000000000e+02,-9.999999999999992895e+01,-9.999999999999992895e+01,-9.999999999999995737e+01,-9.999999999999957367e+01
-1.000000000000000000e+02,-1.000000000000000000e+02,-1.000000000000000000e+02,-1.000000000000000000e+02,-1.000000000000000000e+02,-1.000000000000000000e+02,-1.000000000000000000e+02,-1.000000000000000000e+02,-1.000000000000000000e+02,-1.000000000000000000e+02,-9.999999999999988631e+01,-1.000000000000000000e+02,-1.000000000000000000e+02,-9.999999999999994316e+01,-9.999999999999975842e+01,-1.000000000000000000e+02,-1.000000000000000000e+02,-1.000000000000000000e+02,-1.000000000000000000e+02,-1.000000000000000000e+02,-9.999999999999987210e+01,-1.000000000000000000e+02,-9.999999999999992895e+01,-1.000000000000000000e+02,-1.000000000000000000e+02,-1.000000000000000000e+02,-1.000000000000000000e+02,-1.000000000000000000e+02,-1.000000000000000000e+02,-1.000000000000000000e+02
-1.000000000000000000e+02,-1.000000000000000000e+02,-1.000000000000000000e+02,-1.000000000000000000e+02,-1.000000000000000000e+02,-1.000000000000000000e+02,-1.000000000000000000e+02,-1.000000000000000000e+02,-1.000000000000000000e+02,-1.000000000000000000e+02,-1.000000000000000000e+02,-1.000000000000000000e+02,-1.000000000000000000e+02,-1.000000000000000000e+02,-1.000000000000000000e+02,-1.000000000000000000e+02,-9.999999999999978684e+01,-1.000000000000000000e+02,-1.000000000000000000e+02,-9.999999999999988631e+01,-1.000000000000000000e+02,-1.000000000000000000e+02,-1.000000000000000000e+02,-1.000000000000000000e+02,-1.000000000000000000e+02,-1.000000000000000000e+02,-1.000000000000000000e+02,-1.000000000000000000e+02,-9.999999999999998579e+01,1.000000000000000000e+02
-1.000000000000000000e+02,-1.000000000000000000e+02,-1.000000000000000000e+02,-1.000000000000000000e+02,-1.000000000000000000e+02,-1.000000000000000000e+02,-9.999999999999998579e+01,-1.000000000000000000e+02,-9.999999999999998579e+01,-1.000000000000000000e+02,-9.999999999999995737e+01,-1.000000000000000000e+02,-9.999999999999994316e+01,-9.999999999999998579e+01,-1.000000000000000000e+02,-1.000000000000000000e+02,-9.999999999999990052e+01,-9.999999999999987210e+01,-1.000000000000000000e+02,-1.000000000000000000e+02,-1.000000000000000000e+02,-9.999999999999995737e+01,-9.999999999999994316e+01,-9.999999999999994316e+01,-9.999999999999987210e+01,-9.999999999999992895e+01,-1.000000000000000000e+02,-9.999999999999995737e+01,-9.999999999999998579e+01,9.999999999999951683e+01
-1.000000000000000000e+02,-1.000000000000000000e+02,-1.000000000000000000e+02,-1.000000000000000000e+02,-1.000000000000000000e+02,-1.000000000000000000e+02,-1.000000000000000000e+02,-1.000000000000000000e+02,-1.000000000000000000e+02,-1.000000000000000000e+02,-1.000000000000000000e+02,-9.999999999999990052e+01,-1.000000000000000000e+02,-1.000000000000000000e+02,-9.999999999999995737e+01,-9.999999999999988631e+01,-1.000000000000000000e+02,-1.000000000000000000e+02,-1.000000000000000000e+02,-1.000000000000000000e+02,-9.999999999999992895e+01,-9.999999999999982947e+01,-1.000000000000000000e+02,-9.999999999999984368e+01,-1.000000000000000000e+02,-1.000000000000000000e+02,-9.999999999999994316e+01,-9.999999999999994316e+01,-9.999999999999980105e+01,-1.000000000000000000e+02
-1.000000000000000000e+02,-1.000000000000000000e+02,-1.000000000000000000e+02,-1.000000000000000000e+02,-1.000000000000000000e+02,-1.000000000000000000e+02,-1.000000000000000000e+02,-1.000000000000000000e+02,-1.000000000000000000e+02,-1.000000000000000000e+02,-9.999999999999987210e+01,-1.000000000000000000e+02,-1.000000000000000000e+02,-1.000000000000000000e+02,-9.999999999999992895e+01,-9.999999999999995737e+01,-9.999999999999988631e+01,-1.000000000000000000e+02,-1.000000000000000000e+02,-1.000000000000000000e+02,-1.000000000000000000e+02,-1.000000000000000000e+02,-9.999999999999998579e+01,-1.000000000000000000e+02,-1.000000000000000000e+02,-1.000000000000000000e+02,-1.000000000000000000e+02,-9.999999999999987210e+01,-9.999999999999995737e+01,1.000000000000000000e+02
-1.000000000000000000e+02,-1.000000000000000000e+02,-1.000000000000000000e+02,-1.000000000000000000e+02,-1.000000000000000000e+02,-1.000000000000000000e+02,-1.000000000000000000e+02,-1.000000000000000000e+02,-1.000000000000000000e+02,-1.000000000000000000e+02,-1.000000000000000000e+02,-1.000000000000000000e+02,-1.000000000000000000e+02,-1.000000000000000000e+02,-9.999999999999982947e+01,-1.000000000000000000e+02,-9.999999999999987210e+01,-1.000000000000000000e+02,-1.000000000000000000e+02,-1.000000000000000000e+02,-9.999999999999984368e+01,-9.999999999999998579e+01,-1.000000000000000000e+02,-9.999999999999990052e+01,-9.999999999999984368e+01,-1.000000000000000000e+02,-1.000000000000000000e+02,-1.000000000000000000e+02,-1.000000000000000000e+02,9.999999999999963052e+01
