-3.250766131042111340e+01,2.276929412392916796e-01,1.000000000000000000e+02,-1.000000000000000000e+02,-8.680734857598959309e+01,2.341201586185294303e+01,3.359979141768380373e+01,1.000000000000000000e+02,-1.000000000000000000e+02,-1.000000000000000000e+02
2.029509448442670205e+01,4.082366810752342445e+01,1.000000000000000000e+02,-1.000000000000000000e+02,-1.000000000000000000e+02,5.965181026583103119e+01,-7.179379494156310493e+00,1.000000000000000000e+02,9.331293693390861677e+01,9.041961554148147684e+01
6.450827447048688157e+01,-7.073170685371704280e+01,-8.110672217843321619e+01,1.149475016284177542e+01,9.920609936484990499e+01,1.000000000000000000e+02,-1.000000000000000000e+02,-1.000000000000000000e+02,-1.000000000000000000e+02,-1.000000000000000000e+02
1.000000000000000000e+02,5.321095298388436845e+01,-9.415492125459071815e+01,-1.000000000000000000e+02,-1.000000000000000000e+02,-3.707899697883102164e+01,-1.000000000000000000e+02,-1.000000000000000000e+02,7.944165970678230337e+01,-8.532579817552908708e+01
-1.000000000000000000e+02,-1.000000000000000000e+02,-1.000000000000000000e+02,-1.801555046631408530e+01,1.098768301033356920e+01,-1.000000000000000000e+02,-1.000000000000000000e+02,-1.000000000000000000e+02,-9.350405137099693320e+01,-7.311672978086207308e+01
3.397932210717748802e+01,1.000000000000000000e+02,-1.000000000000000000e+02,5.636524118159385921e+01,1.368364070699513135e+01,-1.000000000000000000e+02,-1.000000000000000000e+02,-1.000000000000000000e+02,8.062108221111121509e+01,9.161825644091706522e+01
-1.000000000000000000e+02,-1.000000000000000000e+02,-1.000000000000000000e+02,-1.000000000000000000e+02,-1.000000000000000000e+02,9.987869203799144202e+01,8.494474527870995995e-02,-1.832824062862068359e+01,-1.000000000000000000e+02,-1.000000000000000000e+02
-5.230155387668412814e+00,-1.000000000000000000e+02,-1.000000000000000000e+02,-1.000000000000000000e+02,-1.000000000000000000e+02,-1.000000000000000000e+02,-9.997780800272531110e+01,-1.000000000000000000e+02,-1.000000000000000000e+02,-1.000000000000000000e+02
-1.000000000000000000e+02,-5.842181966863165599e+01,-1.000000000000000000e+02,-1.000000000000000000e+02,-2.752340508080263248e+01,1.000000000000000000e+02,-1.000000000000000000e+02,-1.000000000000000000e+02,-1.000000000000000000e+02,-1.000000000000000000e+02
-9.919807418959629786e+01,-3.740961211781768014e+01,-1.000000000000000000e+02,-7.624907287770325581e+01,1.000000000000000000e+02,-1.000000000000000000e+02,-1.000000000000000000e+02,1.151037342109666817e+01,4.376786691916916539e+01,-5.954273469526273033e+01
-1.000000000000000000e+02,-9.992794386987907274e+01,-1.000000000000000000e+02,-6.162104159943237391e+01,-1.000000000000000000e+02,-1.000000000000000000e+02,-1.000000000000000000e+02,-1.000000000000000000e+02,-1.000000000000000000e+02,-1.000000000000000000e+02
2.028266812340834946e+01,-2.202648035014469485e+01,7.155526444270886799e+00,-1.000000000000000000e+02,-1.059827961941399010e+01,4.350274011772418703e+01,-4.166379341192546093e+01,-1.000000000000000000e+02,-1.000000000000000000e+02,4.106535753799672506e+01
-1.759216011514991607e+01,1.000000000000000000e+02,-1.000000000000000000e+02,-1.000000000000000000e+02,-1.000000000000000000e+02,-1.000000000000000000e+02,-1.000000000000000000e+02,-1.000000000000000000e+02,-3.403698636340281691e+00,9.461008024951328821e+01
5.944459272484860435e+01,-2.075111094254289057e+01,-8.874170256193879425e+01,-4.707805367008634789e+01,-1.000000000000000000e+02,-1.000000000000000000e+02,-9.161443823745744908e+01,-1.189348606431029332e+01,-5.495615664626818386e+01,1.386774761651155785e+01
-4.738651229052564418e+01,-1.000000000000000000e+02,-1.000000000000000000e+02,-4.302055702643760782e+01,1.000000000000000000e+02,-1.000000000000000000e+02,-1.000000000000000000e+02,-1.000000000000000000e+02,-8.478955839489861646e+00,-1.425921232496368773e+01
-1.000000000000000000e+02,-7.313427930178055192e+01,-4.907284591907648519e+01,1.000000000000000000e+02,-1.000000000000000000e+02,3.643715039909955067e+01,-8.078543412200582452e+01,5.116962968463560912e+00,-1.968264463774292494e+01,4.033471233885586571e+01
-1.000000000000000000e+02,-1.000000000000000000e+02,-1.000000000000000000e+02,4.504957921891318762e+01,-1.000000000000000000e+02,-8.120374834169639655e+01,9.820407247871992240e+01,-1.000000000000000000e+02,-1.000000000000000000e+02,1.552884353864306632e+01
-4.774403781911821909e+00,-1.000000000000000000e+02,-4.177492730504464902e+01,-4.559114011482791540e+01,-6.419656974543839567e+01,8.148932476158020677e+01,-1.000000000000000000e+02,-1.000000000000000000e+02,-1.000000000000000000e+02,9.613080515313200181e+01
-1.000000000000000000e+02,5.750770233898736450e+01,-1.000000000000000000e+02,2.870303364758853348e+01,-5.519096213064210055e+00,-2.631931203671570785e+01,1.999720459831324959e+00,-1.000000000000000000e+02,-1.000000000000000000e+02,-4.515362962877279784e+01
-1.000000000000000000e+02,-1.000000000000000000e+02,-1.000000000000000000e+02,-5.041231106408097418e+01,-3.834787144356060651e+01,-8.054745222222366863e+01,6.638321666546254107e+01,-9.947174483695535230e+01,8.823844837300032395e+01,-1.000000000000000000e+02
-1.000000000000000000e+02,-1.000000000000000000e+02,-1.000000000000000000e+02,-5.701379537303746048e+01,-1.000000000000000000e+02,-1.000000000000000000e+02,-1.000000000000000000e+02,7.579540094301237652e+00,-5.060629096200821664e+01,-4.758383131557042844e+01
-1.000000000000000000e+02,-1.000000000000000000e+02,-1.000000000000000000e+02,-1.000000000000000000e+02,-4.821687483483664494e+01,1.000000000000000000e+02,-8.156961419634168919e+01,-5.628815409151404481e+01,-3.817999157265997923e+00,-9.094906366262377162e+01
-9.184130315439927017e+01,-1.000000000000000000e+02,-1.000000000000000000e+02,-1.000000000000000000e+02,-1.000000000000000000e+02,-1.000000000000000000e+02,-1.000000000000000000e+02,-9.931397375527235738e+01,-9.322789904502576519e+01,6.522957583572339679e+00
-1.780820521037195192e+01,-1.000000000000000000e+02,1.772297034278183858e+01,6.869454877077909316e+01,8.303623661667076306e+01,-7.453882833625404203e+01,-1.912804751619533405e+01,3.441446774345697435e+01,-8.328096776592461481e+01,-1.000000000000000000e+02
-6.131082920892327337e+01,-5.868440501435240009e+01,-9.983900581608195068e+01,-3.821344091328883508e+01,1.674306240554941638e+01,-7.974790065241789350e+00,1.495020855219300415e+01,-1.000000000000000000e+02,-1.000000000000000000e+02,1.057598919988503283e+01
-3.173711461631347763e-01,1.000000000000000000e+02,-1.000000000000000000e+02,-1.000000000000000000e+02,-1.000000000000000000e+02,-1.000000000000000000e+02,-1.000000000000000000e+02,-2.757342243641272717e+01,-1.000000000000000000e+02,-1.000000000000000000e+02
-1.000000000000000000e+02,-1.000000000000000000e+02,-9.839550960490416287e+01,4.039507177200111698e+01,-7.098376853181392221e+01,-7.994481905231178587e+01,-6.570391456202335689e+01,8.965620777322355650e+01,-8.131228788877824343e+01,-1.210031695790228667e+01
-5.358321956624265425e+01,1.000000000000000000e+02,-1.000000000000000000e+02,-1.000000000000000000e+02,-1.000000000000000000e+02,-3.622504575748363465e+01,6.483533633423181186e+01,-1.000000000000000000e+02,-8.860833764046218164e+01,-1.000000000000000000e+02
-9.105019275094105069e+01,-1.000000000000000000e+02,-1.000000000000000000e+02,-1.000000000000000000e+02,8.331282765001516566e+01,1.000000000000000000e+02,-1.000000000000000000e+02,-1.000000000000000000e+02,-1.000000000000000000e+02,-1.000000000000000000e+02
-2.667948842794371700e+01,1.343082364091582548e+01,2.831110346878425332e+01,1.140889839941629091e+01,-7.236213857233413194e+01,-6.352464417392592111e+01,1.000000000000000000e+02,3.503793757561051336e+01,2.952334540058485146e+01,-5.227450629855132291e+01
