1.000000000000000000e+02,1.000000000000000000e+02,1.000000000000000000e+02,1.000000000000000000e+02,1.000000000000000000e+02,1.000000000000000000e+02,-1.000000000000000000e+02,6.686057710565992807e+01,1.000000000000000000e+02,1.000000000000000000e+02,1.000000000000000000e+02,-1.000000000000000000e+02,6.686057676490003132e+01,1.000000000000000000e+02,1.000000000000000000e+02,-1.000000000000000000e+02,-1.000000000000000000e+02,6.686057631851215888e+01,1.000000000000000000e+02,-1.000000000000000000e+02,2.567574164367984224e+01,-1.000000000000000000e+02,-1.000000000000000000e+02,2.567574623598154560e+01,-1.000000000000000000e+02,6.686057636457600495e+01,1.000000000000000000e+02,-1.000000000000000000e+02,2.567574275248012938e+01,-1.000000000000000000e+02
1.000000000000000000e+02,-1.000000000000000000e+02,-1.000000000000000000e+02,-1.000000000000000000e+02,-1.000000000000000000e+02,-1.000000000000000000e+02,-1.000000000000000000e+02,-1.000000000000000000e+02,-1.000000000000000000e+02,6.686057557724195988e+01,1.000000000000000000e+02,1.000000000000000000e+02,1.000000000000000000e+02,1.000000000000000000e+02,1.000000000000000000e+02,-1.000000000000000000e+02,-1.000000000000000000e+02,2.567574690216679656e+01,-1.000000000000000000e+02,6.686057703139938724e+01,1.000000000000000000e+02,1.000000000000000000e+02,-1.000000000000000000e+02,6.686057561089978662e+01,1.000000000000000000e+02,1.000000000000000000e+02,1.000000000000000000e+02,1.000000000000000000e+02,1.000000000000000000e+02,1.000000000000000000e+02
1.000000000000000000e+02,1.000000000000000000e+02,-1.000000000000000000e+02,-1.000000000000000000e+02,-1.000000000000000000e+02,-1.000000000000000000e+02,6.686057614625208601e+01,1.000000000000000000e+02,1.000000000000000000e+02,1.000000000000000000e+02,1.000000000000000000e+02,-1.000000000000000000e+02,-1.000000000000000000e+02,6.686057649688306981e+01,1.000000000000000000e+02,1.000000000000000000e+02,1.000000000000000000e+02,-1.000000000000000000e+02,2.567574530577135761e+01,-1.000000000000000000e+02,2.567574687695325864e+01,-1.000000000000000000e+02,2.567574583416097056e+01,-1.000000000000000000e+02,2.567574173625194334e+01,-1.000000000000000000e+02,-1.000000000000000000e+02,2.567574307245497067e+01,-1.000000000000000000e+02,-7.907757060914379910e-01
-1.000000000000000000e+02,-1.000000000000000000e+02,6.686057602194487970e+01,1.000000000000000000e+02,1.000000000000000000e+02,1.000000000000000000e+02,1.000000000000000000e+02,1.000000000000000000e+02,-1.000000000000000000e+02,2.567574515313628325e+01,-1.000000000000000000e+02,2.567574668777330160e+01,-1.000000000000000000e+02,6.686057657798612297e+01,1.000000000000000000e+02,1.000000000000000000e+02,-1.000000000000000000e+02,-1.000000000000000000e+02,2.567574455174749559e+01,-1.000000000000000000e+02,6.686057642057711803e+01,1.000000000000000000e+02,-1.000000000000000000e+02,-1.000000000000000000e+02,-1.000000000000000000e+02,6.686057596634351796e+01,1.000000000000000000e+02,-1.000000000000000000e+02,6.686057626287077937e+01,1.000000000000000000e+02
1.000000000000000000e+02,1.000000000000000000e+02,1.000000000000000000e+02,1.000000000000000000e+02,-1.000000000000000000e+02,2.567574474779150506e+01,-1.000000000000000000e+02,-1.000000000000000000e+02,6.686057642170634097e+01,1.000000000000000000e+02,-1.000000000000000000e+02,2.567573694300732612e+01,-1.000000000000000000e+02,-1.000000000000000000e+02,-1.000000000000000000e+02,6.686057509647766040e+01,1.000000000000000000e+02,1.000000000000000000e+02,1.000000000000000000e+02,1.000000000000000000e+02,1.000000000000000000e+02,1.000000000000000000e+02,1.000000000000000000e+02,-1.000000000000000000e+02,1.000000000000000000e+02,1.000000000000000000e+02,1.000000000000000000e+02,1.000000000000000000e+02,1.000000000000000000e+02,-1.000000000000000000e+02
1.000000000000000000e+02,1.000000000000000000e+02,1.000000000000000000e+02,1.000000000000000000e+02,1.000000000000000000e+02,-1.000000000000000000e+02,-1.000000000000000000e+02,6.686057575501776284e+01,1.000000000000000000e+02,1.000000000000000000e+02,1.000000000000000000e+02,1.000000000000000000e+02,1.000000000000000000e+02,1.000000000000000000e+02,1.000000000000000000e+02,-1.000000000000000000e+02,2.567574116524995631e+01,-1.000000000000000000e+02,-1.000000000000000000e+02,6.686057600683227520e+01,1.000000000000000000e+02,1.000000000000000000e+02,1.000000000000000000e+02,-1.000000000000000000e+02,2.567574376187372920e+01,-1.000000000000000000e+02,-1.000000000000000000e+02,1.000000000000000000e+02,1.000000000000000000e+02,1.000000000000000000e+02
-1.000000000000000000e+02,6.686057615112660812e+01,1.000000000000000000e+02,1.000000000000000000e+02,1.000000000000000000e+02,1.000000000000000000e+02,1.000000000000000000e+02,1.000000000000000000e+02,1.000000000000000000e+02,-1.000000000000000000e+02,-1.000000000000000000e+02,-1.000000000000000000e+02,6.686057625159197926e+01,1.000000000000000000e+02,1.000000000000000000e+02,1.000000000000000000e+02,-1.000000000000000000e+02,2.567574348758767755e+01,-1.000000000000000000e+02,2.567574271367841376e+01,-1.000000000000000000e+02,2.567574296234813147e+01,-1.000000000000000000e+02,6.686057611037857384e+01,1.000000000000000000e+02,-1.000000000000000000e+02,2.567574844503589659e+01,-1.000000000000000000e+02,2.567574400865672857e+01,-1.000000000000000000e+02
-1.000000000000000000e+02,-1.000000000000000000e+02,6.686057556832540172e+01,1.000000000000000000e+02,1.000000000000000000e+02,1.000000000000000000e+02,1.000000000000000000e+02,-1.000000000000000000e+02,-1.000000000000000000e+02,-1.000000000000000000e+02,6.686057508226711832e+01,1.000000000000000000e+02,1.000000000000000000e+02,1.000000000000000000e+02,-1.000000000000000000e+02,-1.000000000000000000e+02,6.686057654569280828e+01,1.000000000000000000e+02,1.000000000000000000e+02,-1.000000000000000000e+02,6.686057620322674211e+01,1.000000000000000000e+02,1.000000000000000000e+02,-1.000000000000000000e+02,6.686057639147499287e+01,1.000000000000000000e+02,1.000000000000000000e+02,1.000000000000000000e+02,-1.000000000000000000e+02,-1.000000000000000000e+02
1.000000000000000000e+02,1.000000000000000000e+02,1.000000000000000000e+02,-1.000000000000000000e+02,-1.000000000000000000e+02,6.686057575368403150e+01,1.000000000000000000e+02,1.000000000000000000e+02,1.000000000000000000e+02,1.000000000000000000e+02,-1.000000000000000000e+02,-1.000000000000000000e+02,-1.000000000000000000e+02,-1.000000000000000000e+02,6.686057665556663210e+01,1.000000000000000000e+02,1.000000000000000000e+02,1.000000000000000000e+02,-1.000000000000000000e+02,6.686057592405524019e+01,1.000000000000000000e+02,1.000000000000000000e+02,1.000000000000000000e+02,1.000000000000000000e+02,1.000000000000000000e+02,1.000000000000000000e+02,1.000000000000000000e+02,1.000000000000000000e+02,1.000000000000000000e+02,-1.000000000000000000e+02
-1.000000000000000000e+02,6.686057627798915348e+01,1.000000000000000000e+02,1.000000000000000000e+02,-1.000000000000000000e+02,-1.000000000000000000e+02,-1.000000000000000000e+02,2.567574724800561725e+01,-1.000000000000000000e+02,-1.000000000000000000e+02,6.686057596456299734e+01,1.000000000000000000e+02,1.000000000000000000e+02,1.000000000000000000e+02,1.000000000000000000e+02,1.000000000000000000e+02,1.000000000000000000e+02,-1.000000000000000000e+02,-1.000000000000000000e+02,2.567574328389102689e+01,-1.000000000000000000e+02,2.567574391462213867e+01,-1.000000000000000000e+02,-1.000000000000000000e+02,6.686057556761164733e+01,1.000000000000000000e+02,1.000000000000000000e+02,-1.000000000000000000e+02,6.686057526077580349e+01,1.000000000000000000e+02
1.000000000000000000e+02,1.000000000000000000e+02,1.000000000000000000e+02,1.000000000000000000e+02,1.000000000000000000e+02,1.000000000000000000e+02,1.000000000000000000e+02,1.000000000000000000e+02,1.000000000000000000e+02,-1.000000000000000000e+02,-1.000000000000000000e+02,-1.000000000000000000e+02,2.567574414515581083e+01,-1.000000000000000000e+02,2.567574197890929000e+01,-1.000000000000000000e+02,6.686057601521939375e+01,1.000000000000000000e+02,-1.000000000000000000e+02,6.686057744865723862e+01,1.000000000000000000e+02,1.000000000000000000e+02,1.000000000000000000e+02,-1.000000000000000000e+02,6.686057613240302544e+01,1.000000000000000000e+02,1.000000000000000000e+02,-1.000000000000000000e+02,-1.000000000000000000e+02,-1.000000000000000000e+02
1.000000000000000000e+02,1.000000000000000000e+02,1.000000000000000000e+02,1.000000000000000000e+02,-1.000000000000000000e+02,2.567574311389318353e+01,-1.000000000000000000e+02,2.567574827536677873e+01,-1.000000000000000000e+02,-1.000000000000000000e+02,6.686057730911693398e+01,1.000000000000000000e+02,1.000000000000000000e+02,1.000000000000000000e+02,1.000000000000000000e+02,1.000000000000000000e+02,-1.000000000000000000e+02,6.686057525768406151e+01,1.000000000000000000e+02,1.000000000000000000e+02,-1.000000000000000000e+02,6.686057595060418635e+01,1.000000000000000000e+02,-1.000000000000000000e+02,6.686057610122588812e+01,1.000000000000000000e+02,1.000000000000000000e+02,-1.000000000000000000e+02,2.567574411877760454e+01,-1.000000000000000000e+02
1.000000000000000000e+02,-1.000000000000000000e+02,6.686057585590179997e+01,1.000000000000000000e+02,1.000000000000000000e+02,1.000000000000000000e+02,-1.000000000000000000e+02,6.686057665755645019e+01,1.000000000000000000e+02,1.000000000000000000e+02,1.000000000000000000e+02,-1.000000000000000000e+02,6.686057599178761279e+01,1.000000000000000000e+02,-1.000000000000000000e+02,2.567574596330872438e+01,-1.000000000000000000e+02,1.000000000000000000e+02,1.000000000000000000e+02,1.000000000000000000e+02,1.000000000000000000e+02,1.000000000000000000e+02,1.000000000000000000e+02,1.000000000000000000e+02,1.000000000000000000e+02,1.000000000000000000e+02,1.000000000000000000e+02,1.000000000000000000e+02,-1.000000000000000000e+02,-1.000000000000000000e+02
-1.000000000000000000e+02,6.686057666187738846e+01,1.000000000000000000e+02,1.000000000000000000e+02,1.000000000000000000e+02,1.000000000000000000e+02,1.000000000000000000e+02,1.000000000000000000e+02,-1.000000000000000000e+02,-1.000000000000000000e+02,2.567574910864777138e+01,-1.000000000000000000e+02,-1.000000000000000000e+02,6.686057640329507024e+01,1.000000000000000000e+02,1.000000000000000000e+02,1.000000000000000000e+02,1.000000000000000000e+02,-1.000000000000000000e+02,6.686057641453237466e+01,1.000000000000000000e+02,1.000000000000000000e+02,-1.000000000000000000e+02,6.686057575292193178e+01,1.000000000000000000e+02,-1.000000000000000000e+02,6.686057655944298972e+01,1.000000000000000000e+02,1.000000000000000000e+02,-1.000000000000000000e+02
1.000000000000000000e+02,1.000000000000000000e+02,1.000000000000000000e+02,1.000000000000000000e+02,1.000000000000000000e+02,1.000000000000000000e+02,-1.000000000000000000e+02,6.686057804685421502e+01,1.000000000000000000e+02,1.000000000000000000e+02,1.000000000000000000e+02,1.000000000000000000e+02,-1.000000000000000000e+02,2.567574520651116998e+01,-1.000000000000000000e+02,-1.000000000000000000e+02,-1.000000000000000000e+02,6.686057735816024206e+01,1.000000000000000000e+02,1.000000000000000000e+02,-1.000000000000000000e+02,-1.000000000000000000e+02,2.567574179446926408e+01,-1.000000000000000000e+02,2.567574411492557118e+01,-1.000000000000000000e+02,6.686057582879544725e+01,1.000000000000000000e+02,1.000000000000000000e+02,-1.000000000000000000e+02
-1.000000000000000000e+02,2.567574395410471766e+01,-1.000000000000000000e+02,-1.000000000000000000e+02,2.567574311940828835e+01,-1.000000000000000000e+02,-1.000000000000000000e+02,-1.000000000000000000e+02,2.567573576183108131e+01,-1.000000000000000000e+02,2.567574538943442874e+01,-1.000000000000000000e+02,-1.000000000000000000e+02,6.686057502460043622e+01,1.000000000000000000e+02,1.000000000000000000e+02,1.000000000000000000e+02,1.000000000000000000e+02,1.000000000000000000e+02,1.000000000000000000e+02,1.000000000000000000e+02,1.000000000000000000e+02,1.000000000000000000e+02,1.000000000000000000e+02,1.000000000000000000e+02,1.000000000000000000e+02,-1.000000000000000000e+02,-1.000000000000000000e+02,6.686057633466904804e+01,1.000000000000000000e+02
1.000000000000000000e+02,1.000000000000000000e+02,1.000000000000000000e+02,1.000000000000000000e+02,1.000000000000000000e+02,1.000000000000000000e+02,1.000000000000000000e+02,1.000000000000000000e+02,-1.000000000000000000e+02,-1.000000000000000000e+02,2.567574334991250851e+01,-1.000000000000000000e+02,2.567575014657802868e+01,-1.000000000000000000e+02,6.686057771290253982e+01,1.000000000000000000e+02,1.000000000000000000e+02,1.000000000000000000e+02,1.000000000000000000e+02,1.000000000000000000e+02,1.000000000000000000e+02,1.000000000000000000e+02,-1.000000000000000000e+02,-1.000000000000000000e+02,6.686057574110522239e+01,1.000000000000000000e+02,1.000000000000000000e+02,-1.000000000000000000e+02,-1.000000000000000000e+02,-7.911273678281703914e-01
1.000000000000000000e+02,1.000000000000000000e+02,-1.000000000000000000e+02,1.000000000000000000e+02,1.000000000000000000e+02,1.000000000000000000e+02,1.000000000000000000e+02,1.000000000000000000e+02,1.000000000000000000e+02,-1.000000000000000000e+02,6.686057373993286035e+01,1.000000000000000000e+02,1.000000000000000000e+02,-1.000000000000000000e+02,2.567574477103098474e+01,-1.000000000000000000e+02,-1.000000000000000000e+02,-1.000000000000000000e+02,-1.000000000000000000e+02,6.686057623520595428e+01,1.000000000000000000e+02,-1.000000000000000000e+02,-1.000000000000000000e+02,-1.000000000000000000e+02,-1.000000000000000000e+02,-1.000000000000000000e+02,1.000000000000000000e+02,1.000000000000000000e+02,1.000000000000000000e+02,1.000000000000000000e+02
1.000000000000000000e+02,1.000000000000000000e+02,1.000000000000000000e+02,-1.000000000000000000e+02,6.686057629539158143e+01,1.000000000000000000e+02,-1.000000000000000000e+02,6.686057575297056133e+01,1.000000000000000000e+02,1.000000000000000000e+02,1.000000000000000000e+02,1.000000000000000000e+02,1.000000000000000000e+02,1.000000000000000000e+02,-1.000000000000000000e+02,2.567574559747209406e+01,-1.000000000000000000e+02,1.000000000000000000e+02,1.000000000000000000e+02,1.000000000000000000e+02,1.000000000000000000e+02,1.000000000000000000e+02,-1.000000000000000000e+02,1.000000000000000000e+02,-1.000000000000000000e+02,-1.000000000000000000e+02,6.686057571112264952e+01,1.000000000000000000e+02,1.000000000000000000e+02,1.000000000000000000e+02
1.000000000000000000e+02,1.000000000000000000e+02,1.000000000000000000e+02,1.000000000000000000e+02,-1.000000000000000000e+02,-1.000000000000000000e+02,6.686057622845473247e+01,1.000000000000000000e+02,-1.000000000000000000e+02,6.686057604034846236e+01,1.000000000000000000e+02,1.000000000000000000e+02,1.000000000000000000e+02,-1.000000000000000000e+02,1.000000000000000000e+02,1.000000000000000000e+02,1.000000000000000000e+02,-1.000000000000000000e+02,6.686057637540676524e+01,1.000000000000000000e+02,1.000000000000000000e+02,1.000000000000000000e+02,1.000000000000000000e+02,-1.000000000000000000e+02,6.686057702821548787e+01,1.000000000000000000e+02,-1.000000000000000000e+02,2.567574511323279296e+01,-1.000000000000000000e+02,-1.000000000000000000e+02
1.000000000000000000e+02,1.000000000000000000e+02,1.000000000000000000e+02,1.000000000000000000e+02,-1.000000000000000000e+02,-1.000000000000000000e+02,6.686057589583411698e+01,1.000000000000000000e+02,1.000000000000000000e+02,1.000000000000000000e+02,1.000000000000000000e+02,1.000000000000000000e+02,-1.000000000000000000e+02,2.567574628787168223e+01,-1.000000000000000000e+02,2.567574409115886525e+01,-1.000000000000000000e+02,6.686057740077231415e+01,1.000000000000000000e+02,-1.000000000000000000e+02,-1.000000000000000000e+02,-1.000000000000000000e+02,2.567574606090140321e+01,-1.000000000000000000e+02,2.567574462572445526e+01,-1.000000000000000000e+02,-1.000000000000000000e+02,6.686057630610181945e+01,1.000000000000000000e+02,-1.000000000000000000e+02
-1.000000000000000000e+02,1.000000000000000000e+02,1.000000000000000000e+02,1.000000000000000000e+02,1.000000000000000000e+02,-1.000000000000000000e+02,6.686057613059128357e+01,1.000000000000000000e+02,1.000000000000000000e+02,-1.000000000000000000e+02,1.000000000000000000e+02,1.000000000000000000e+02,1.000000000000000000e+02,1.000000000000000000e+02,-1.000000000000000000e+02,2.567574160544479156e+01,-1.000000000000000000e+02,1.000000000000000000e+02,1.000000000000000000e+02,1.000000000000000000e+02,1.000000000000000000e+02,1.000000000000000000e+02,1.000000000000000000e+02,-1.000000000000000000e+02,1.000000000000000000e+02,1.000000000000000000e+02,1.000000000000000000e+02,1.000000000000000000e+02,1.000000000000000000e+02,1.000000000000000000e+02
1.000000000000000000e+02,1.000000000000000000e+02,1.000000000000000000e+02,1.000000000000000000e+02,1.000000000000000000e+02,1.000000000000000000e+02,1.000000000000000000e+02,-1.000000000000000000e+02,-1.000000000000000000e+02,6.686057648297008882e+01,1.000000000000000000e+02,1.000000000000000000e+02,1.000000000000000000e+02,1.000000000000000000e+02,-1.000000000000000000e+02,6.686057532597807551e+01,1.000000000000000000e+02,1.000000000000000000e+02,1.000000000000000000e+02,-1.000000000000000000e+02,2.567574481330636260e+01,-1.000000000000000000e+02,-1.000000000000000000e+02,6.686057587387099943e+01,1.000000000000000000e+02,-1.000000000000000000e+02,-1.000000000000000000e+02,6.686057423669154787e+01,1.000000000000000000e+02,-1.000000000000000000e+02
1.000000000000000000e+02,1.000000000000000000e+02,1.000000000000000000e+02,1.000000000000000000e+02,1.000000000000000000e+02,-1.000000000000000000e+02,2.567574579840993820e+01,-1.000000000000000000e+02,-1.000000000000000000e+02,6.686057593270315635e+01,1.000000000000000000e+02,-1.000000000000000000e+02,2.567574208200462849e+01,-1.000000000000000000e+02,2.567574070018772758e+01,-1.000000000000000000e+02,2.567574374447480068e+01,-1.000000000000000000e+02,-1.000000000000000000e+02,2.567574380442667348e+01,-1.000000000000000000e+02,-1.000000000000000000e+02,-1.000000000000000000e+02,6.686057590358245761e+01,1.000000000000000000e+02,-1.000000000000000000e+02,6.686057599213066283e+01,1.000000000000000000e+02,-1.000000000000000000e+02,-7.909003292667492468e-01
1.000000000000000000e+02,-1.000000000000000000e+02,6.686057601620403545e+01,1.000000000000000000e+02,1.000000000000000000e+02,-1.000000000000000000e+02,1.000000000000000000e+02,1.000000000000000000e+02,-1.000000000000000000e+02,6.686057601690747276e+01,1.000000000000000000e+02,1.000000000000000000e+02,1.000000000000000000e+02,1.000000000000000000e+02,1.000000000000000000e+02,1.000000000000000000e+02,-1.000000000000000000e+02,-1.000000000000000000e+02,-1.000000000000000000e+02,-1.000000000000000000e+02,6.686057575285438759e+01,1.000000000000000000e+02,1.000000000000000000e+02,1.000000000000000000e+02,1.000000000000000000e+02,1.000000000000000000e+02,-1.000000000000000000e+02,-1.000000000000000000e+02,-1.000000000000000000e+02,-1.000000000000000000e+02
1.000000000000000000e+02,1.000000000000000000e+02,-1.000000000000000000e+02,-1.000000000000000000e+02,6.686057584115157226e+01,1.000000000000000000e+02,1.000000000000000000e+02,1.000000000000000000e+02,1.000000000000000000e+02,-1.000000000000000000e+02,6.686057678655090797e+01,1.000000000000000000e+02,-1.000000000000000000e+02,-1.000000000000000000e+02,-1.000000000000000000e+02,2.567574655577623233e+01,-1.000000000000000000e+02,-1.000000000000000000e+02,6.686057642022356617e+01,1.000000000000000000e+02,1.000000000000000000e+02,1.000000000000000000e+02,1.000000000000000000e+02,1.000000000000000000e+02,1.000000000000000000e+02,1.000000000000000000e+02,-1.000000000000000000e+02,1.000000000000000000e+02,1.000000000000000000e+02,1.000000000000000000e+02
-1.000000000000000000e+02,6.686057645865629695e+01,1.000000000000000000e+02,1.000000000000000000e+02,1.000000000000000000e+02,-1.000000000000000000e+02,1.000000000000000000e+02,1.000000000000000000e+02,1.000000000000000000e+02,-1.000000000000000000e+02,6.686057563166203010e+01,1.000000000000000000e+02,1.000000000000000000e+02,1.000000000000000000e+02,1.000000000000000000e+02,1.000000000000000000e+02,1.000000000000000000e+02,-1.000000000000000000e+02,1.000000000000000000e+02,1.000000000000000000e+02,1.000000000000000000e+02,1.000000000000000000e+02,1.000000000000000000e+02,-1.000000000000000000e+02,-1.000000000000000000e+02,-1.000000000000000000e+02,6.686057559148341056e+01,1.000000000000000000e+02,1.000000000000000000e+02,1.000000000000000000e+02
-1.000000000000000000e+02,-1.000000000000000000e+02,2.567574318865581873e+01,-1.000000000000000000e+02,6.686057670478321313e+01,1.000000000000000000e+02,1.000000000000000000e+02,-1.000000000000000000e+02,-1.000000000000000000e+02,2.567574322766693129e+01,-1.000000000000000000e+02,-1.000000000000000000e+02,-1.000000000000000000e+02,2.567574348645431570e+01,-1.000000000000000000e+02,-1.000000000000000000e+02,-1.000000000000000000e+02,6.686057623273680406e+01,1.000000000000000000e+02,-1.000000000000000000e+02,6.686057670568142441e+01,1.000000000000000000e+02,1.000000000000000000e+02,1.000000000000000000e+02,1.000000000000000000e+02,1.000000000000000000e+02,1.000000000000000000e+02,-1.000000000000000000e+02,-1.000000000000000000e+02,-7.914050056873570549e-01
1.000000000000000000e+02,1.000000000000000000e+02,1.000000000000000000e+02,-1.000000000000000000e+02,2.567574185425852562e+01,-1.000000000000000000e+02,6.686057653876690665e+01,1.000000000000000000e+02,-1.000000000000000000e+02,2.567574465065594680e+01,-1.000000000000000000e+02,-1.000000000000000000e+02,-1.000000000000000000e+02,6.686057632711049337e+01,1.000000000000000000e+02,-1.000000000000000000e+02,-1.000000000000000000e+02,-1.000000000000000000e+02,6.686057654678057816e+01,1.000000000000000000e+02,-1.000000000000000000e+02,6.686057654468582712e+01,1.000000000000000000e+02,1.000000000000000000e+02,1.000000000000000000e+02,1.000000000000000000e+02,1.000000000000000000e+02,1.000000000000000000e+02,1.000000000000000000e+02,-1.000000000000000000e+02
1.000000000000000000e+02,1.000000000000000000e+02,1.000000000000000000e+02,1.000000000000000000e+02,-1.000000000000000000e+02,6.686057625355479672e+01,1.000000000000000000e+02,1.000000000000000000e+02,1.000000000000000000e+02,1.000000000000000000e+02,-1.000000000000000000e+02,-1.000000000000000000e+02,-1.000000000000000000e+02,-1.000000000000000000e+02,2.567574484238989285e+01,-1.000000000000000000e+02,2.567574297645940717e+01,-1.000000000000000000e+02,2.567574681791945679e+01,-1.000000000000000000e+02,6.686057664473784712e+01,1.000000000000000000e+02,1.000000000000000000e+02,-1.000000000000000000e+02,-1.000000000000000000e+02,1.000000000000000000e+02,1.000000000000000000e+02,1.000000000000000000e+02,1.000000000000000000e+02,-1.000000000000000000e+02
