1.000000000000000000e+02,6.094428893770604816e+01,-2.711368148485125928e+01,-2.067502384410325789e+01,-2.059367493969516261e+01,-1.441124550404526516e+01,-6.441219763023009648e+01,6.738807554513040543e+01,9.885589122293693265e+01,6.725813100896930052e+01
-7.009690906348612138e+00,-2.122578586868660633e+00,-7.068605300648457046e+01,-2.097912955239651112e+01,-2.682175732447166894e+01,1.000000000000000000e+02,-5.844926552093016170e+01,4.215069075380874608e+01,-5.196177645956116464e+01,-2.087731805210600200e+01
-1.000000000000000000e+02,-8.973413878453885673e+01,-9.597456676902767470e+01,-4.594990617809299494e+01,6.744897087803036584e+01,-3.959772497231279687e+01,1.684092602619553247e+01,6.124251651001390684e+01,-2.093199847191005958e+01,-9.583015647459340869e+01
-1.000000000000000000e+02,-5.220436914597438971e+01,4.218323881453522972e+01,8.633986743842305600e+01,1.000000000000000000e+02,-5.220109731469758430e+01,-3.328656382220822252e+01,-6.446314965403865926e+01,9.887194359268296751e+01,-9.599968054796866568e+01
-1.000000000000000000e+02,1.655962783846116793e+01,1.069864435316215179e+01,1.000000000000000000e+02,2.928389450615447842e+01,-7.072537214172263020e+01,9.885720299701338831e+01,8.618690769905394689e+01,6.099336134793028918e+01,-9.590328932283547658e+01
4.662665640991010463e+01,-3.948483081961437335e+01,-7.702720135068175011e+01,3.572058822397271882e+01,3.595848041932181616e+01,-2.075385318942401014e+01,-1.441021417960751982e+01,-1.000000000000000000e+02,-8.973459330061017170e+01,-8.678284498779142098e+00
-1.000000000000000000e+02,1.000000000000000000e+02,6.726066286519352388e+01,-8.964658175522330907e+01,-7.717933640137707130e+01,7.364424878439180588e+01,-4.586144792489156430e+01,-2.703002554723847339e+01,-8.396412204779974076e+00,5.497209130056833004e+01
-1.000000000000000000e+02,-3.350451047112076708e+01,9.893302375538098659e+01,-2.521122671211052602e+00,-2.670574160166021116e+01,9.894260244418785533e+01,-5.219994122282890459e+01,-1.471040347041393659e+01,-8.954203922891079515e+01,2.295986355344302865e+01
-9.826429419731698545e+01,-7.081137128243284451e+01,-1.486621835741079778e+01,-2.029172938715298002e+01,-8.953063772867837145e+01,-7.108719362224464078e+01,1.005841141427688790e+01,-8.077630583277654708e+00,4.270771084261882677e+00,2.333922008852281493e+01
1.000000000000000000e+02,-8.347085682846631016e+01,-6.464331951882128635e+01,-2.094946905030332829e+01,-2.059532883786177138e+01,7.380890604752651996e+01,3.573521559574785300e+01,-5.819879499290313873e+01,5.478980119268322113e+01,-3.330262715499770820e+01
-8.902007111075266721e+01,-3.969114653040380603e+01,-8.507439939120947869e+00,-2.045935382746681697e+01,1.000000000000000000e+02,1.017904226795014644e+01,1.000000000000000000e+02,9.878560850671595972e+01,-5.219762485042455324e+01,1.000000000000000000e+02
3.938854895581493309e+01,-2.421576050342403974e+00,-8.314838120053866533e+01,3.796889648460520128e+00,-8.950740356285358246e+01,-5.844014274995976166e+01,1.671162457638514809e+01,-7.700425723372426035e+01,-5.837406106734889022e+01,3.870364650620024882e+00
-1.000000000000000000e+02,-8.665180599234385994e+00,1.085355514969049651e+01,-9.585086464457390321e+01,-8.669262462055517204e+00,-7.692231521668334437e+01,-2.095699668871079879e+01,-1.437807236024143975e+01,-3.303322788372283014e+01,4.223268803536874572e+01
5.376219667245034373e+01,-2.088730391041756818e+01,1.000000000000000000e+02,4.830010009571558527e+01,-9.587466608838757054e+01,-3.971752668031923861e+01,4.225305580369694525e+01,1.681703338707378137e+01,-7.069976534859657136e+01,-3.961344748890763157e+01
1.000000000000000000e+02,4.825280461949236610e+01,-3.361891319264469757e+01,2.912891017616399481e+01,-8.386163335540302910e+01,5.434596169925885079e+01,-8.970204122921340684e+01,-9.530687808698980135e+00,-1.406571975878169134e+01,-8.917957722811020460e+01
-6.319801898864914591e+01,1.668572800386104049e+01,-2.678559150619579654e+01,-3.936457205733793785e+01,-9.585756507820686068e+01,-5.843502017506272495e+01,-6.455122374669372221e+01,3.824128586485758152e+00,9.895988167703507088e+01,-2.728352312828898718e+01
2.633600551369035969e+01,1.055181078585963661e+01,-7.867409750818668890e+00,1.094949885294311542e+01,-8.948432543768456071e+01,-6.482914471999043826e+01,7.372223337242402863e+01,2.300667775451148955e+01,-7.076726209346574592e+01,3.839506022759997084e+00
-2.987526667058332919e+01,-9.635129992766187002e+01,-3.990576424128709476e+01,-3.323197856030338215e+01,-7.699200383760867794e+01,-5.846196298773041633e+01,-8.961039348644672486e+01,-8.334232859887245581e+01,-7.071302521379934092e+01,-3.332062631184712131e+01
-1.000000000000000000e+02,-5.220355605428432710e+01,3.585124329051308223e+01,9.264222759456023937e+01,9.880372196075073532e+01,-2.521065864160443759e+00,-9.581876705851570364e+01,3.788445645082794577e+00,2.355551889269235843e+01,6.122658900693130590e+01
1.000000000000000000e+02,-3.350638829001348995e+01,-2.073142614208443035e+01,-6.442646910745327204e+01,-6.457058473229290030e+01,-5.206489048428840505e+01,-5.826533527739282192e+01,9.888431983164618089e+01,-4.595954427633731854e+01,1.035490386536943852e+01
-1.000000000000000000e+02,-5.844870940752087307e+01,-8.599841215659619564e+00,9.895829038154167279e+01,2.293027560120002661e+01,-3.308448139183447267e+01,-8.956735351302873482e+01,-5.216669811452154448e+01,-3.328718886037420077e+01,-7.701181820180417503e+01
1.000000000000000000e+02,6.726340522483876327e+01,-4.583436434130774728e+01,3.869895720179831855e+00,-3.927398282462651480e+01,-8.503461015996407468e+00,-1.000000000000000000e+02,-8.695532746144568392e+00,-9.582039202786462795e+01,-2.520206596193998561e+00
-8.281112838246784236e+01,4.203472823867897290e+01,-8.330884524997895824e+01,-7.089924441791087872e+01,-7.712099074554951983e+01,9.884200522260884725e+01,-9.599737601964952205e+01,7.358384207308613156e+01,4.840403677277225114e+01,-4.573871403181301787e+01
-9.406922450788802337e+01,-8.685707330521116987e+00,-9.582062315529381635e+01,8.619533498834844920e+01,-9.596528791094478095e+01,8.619505540664476939e+01,3.796448244627820046e+00,-1.000000000000000000e+02,-4.596399453990692052e+01,-2.468902197647899754e+00
-9.303786258291655997e+01,3.596682240901478878e+01,-3.934161364835006225e+01,-8.980840954979841229e+01,4.202745039994651677e+01,-7.074667935712031408e+01,-1.435036436128899595e+01,-5.109084525986057201e+01,-3.961068070744722291e+01,-1.455361817864442031e+01
-6.395686107799335218e+01,-2.094554631020234936e+01,-9.583017534502538126e+01,-5.843458148496099369e+01,-4.579003067122288684e+01,1.679076976324930115e+01,-8.242129162302338941e+00,-8.953747984887955624e+01,-2.516265724954413141e+00,-9.581875346669933435e+01
9.831281460575013398e+01,9.878976789055207064e+01,-2.107510734709885014e+01,9.894907746474852672e+01,-3.350108606031513858e+01,-5.819090746341202447e+01,-8.962310559669572285e+01,-9.597406078065318979e+01,9.879553212793005912e+01,-1.487793985169855659e+01
2.638515747241396880e+01,1.697934309438495504e+01,4.215393700344341354e+00,7.398241172422625311e+01,-4.549494703720397837e+01,4.228916422042323120e+01,2.947221644585865974e+01,1.636021189070015680e+01,-7.721587855759302954e+01,-8.533244644518395816e+00
-9.330329131775215501e+01,-3.353978562122732399e+01,4.887376231979522601e+01,-9.592306981921423414e+01,-2.714232532972134138e+01,-7.698714414079441326e+01,9.898785500329553599e+01,-5.843889728481786960e+01,-3.975560195954631126e+01,1.675581554586999999e+01
1.000000000000000000e+02,-2.523756727863889715e+00,-5.183681374070057046e+01,-8.573620782103390070e+00,-9.581974716549024151e+01,-8.345972687713195626e+01,-7.715852020523931287e+01,-3.964348644447347425e+01,-7.702897734537435781e+01,1.023054642450384222e+01
