-7.765494570393521111e-28,1.503942337486557501e-24,6.465902236854529037e-26,3.967752405957246554e-25,-3.636744437705969321e-25,2.654551313636428814e-25,-1.006289898540037733e-26,5.621544815164277880e-25,-1.773722191649256741e-25,2.497907218593008253e-25,-5.902856229908499626e-25,-4.054250098177887637e-26,-3.516762199686649310e-25,4.094841279597780260e-25,1.886107009083469318e-25,-1.821627391293485099e-25,-8.659860981306311689e-26,-1.229141311647905049e-24,-7.155248176112140723e-26,-1.764149906991189400e-24,6.833553148010642510e-25,4.639269201354888862e-25,-4.793238264584101913e-25,-7.048373139839780173e-25,-7.614250477037587724e-26,-2.222198047436382127e-25,-4.073267421869862125e-25,1.255312200091494498e-25,1.474217863146384465e-25,-5.638874857188658663e-25
2.650406071291503554e-23,-2.361220790159604035e-24,2.845197150758452784e-24,4.333626707871376968e-24,5.756212072811477500e-25,-2.114080827235335716e-25,1.856741477140293708e-23,-3.067816966770704573e-25,-7.244190175105904933e-24,-1.115829932607113694e-23,5.341487727793534853e-24,-2.195372420168351827e-25,3.295257406843977722e-24,1.071886478603725864e-23,4.679053024441701740e-24,5.176129062860111495e-25,-2.183785446130878258e-25,-1.148205557537625938e-23,9.190410382975777926e-25,4.170349468542359078e-24,2.138940049608430818e-24,2.379054957426354803e-24,-5.518201998602030939e-24,4.004947617563647700e-24,-6.744909125763192658e-24,1.486728077896242619e-24,-7.446469268922201471e-27,-1.317010138889090293e-23,4.204836942479668800e-28,4.472794257246192209e-22
-3.828369839390214758e-25,-8.153742628146300579e-26,1.377673245519937274e-24,4.669074109835510294e-25,-1.326815896557113534e-25,7.333137417162145517e-25,-4.003116605074709781e-25,8.160078431586689615e-26,-1.072798930885340679e-24,-5.346010788189035673e-25,-6.082862557470612591e-25,2.170460681452479178e-25,7.482939936826866140e-25,-1.796796129383865379e-24,2.497659470543272693e-25,-1.379344777122099027e-25,-1.868763317544032628e-24,-1.499730861269901287e-25,-1.070187400975431230e-24,-2.379859841818298381e-25,-2.319854888588311474e-25,7.486402527514146076e-26,-1.048786179410939281e-24,-5.834571036702021211e-25,6.238932795772890579e-25,-3.262083553273281993e-25,-5.509128524576410401e-25,-2.753226246636637225e-25,1.340691387067444190e-26,-7.508427026017190828e-24
-2.726622436480129996e-27,7.454025756831823689e-26,1.011303355138780327e-25,2.041593546983056042e-26,1.861725925060571025e-27,-6.828125643385486518e-26,-4.466019965762479255e-26,-3.466991208449406608e-26,-8.781027787317985725e-27,9.002371477706670552e-26,7.770964795678173294e-27,6.230695834172932242e-26,3.100549227332715110e-27,8.662422841811664754e-26,4.313007344498534425e-26,2.005499961015376725e-26,1.045454430706656607e-26,8.484285768948750160e-27,-2.138194793838006218e-26,2.571262844987345899e-26,4.334238088740908925e-26,-2.658503081999579194e-26,1.173090759929777576e-25,-5.996841272829853981e-26,-6.471408599703511703e-27,-1.948550411456185635e-25,-7.965578512280636430e-26,5.855963476239724707e-26,4.408537603567238221e-29,3.984164456431570626e-25
-4.538270024837134651e-26,1.183947485933523201e-27,-3.042464853316710012e-25,-4.814936732100630960e-26,-8.227559712586708441e-26,-1.535798743400988323e-25,1.064261882533932221e-25,-5.277480666396096861e-26,1.089267182759824302e-25,-7.671205255863152926e-26,7.136558516705677348e-27,-1.334012869957387919e-26,2.285518741135472098e-26,-1.370600519934332987e-26,2.735120112485043980e-26,-9.322545121264909518e-26,3.796273207349689283e-27,1.679465519311382011e-25,-1.404880335334878797e-25,-7.694513982679024591e-26,-6.863703977108812659e-27,6.441157881544116810e-26,2.260545810280295578e-25,-5.809093605806111148e-26,8.656755975059970503e-28,-4.336394650253173489e-25,9.677104651313303092e-26,1.700038973297569992e-25,1.448654470326815712e-25,-6.055623448147747500e-26
-2.886786141812866101e-24,1.006255240395709985e-24,9.163085469911178550e-24,-1.092511559580841850e-23,3.377941134917499902e-23,2.647950503866303879e-24,-1.954056347257217187e-24,-1.447875086656155927e-24,-4.553816348126104100e-24,5.300889351778038817e-24,-1.056890416151315241e-23,-9.744029797511037996e-25,7.746718453625367110e-25,-8.303293325909983542e-24,2.275158459206471750e-24,-1.106516068652699129e-23,-4.367808478928098997e-24,8.338609436658705194e-24,9.251184141683447362e-24,-1.144404107550967840e-24,-2.306033625309246076e-23,3.180525851992042496e-24,-6.314817282911201089e-24,6.082224577906597113e-24,-2.864711972072366536e-24,3.942818707508580088e-26,8.471869167782928328e-24,-1.582468231487916754e-24,-4.052324875417941451e-23,1.366565430652760396e-23
1.095754668060486397e-24,8.195688435223751990e-26,-1.270300974531496432e-24,-4.102159450862687143e-25,6.102758767270692828e-25,-1.461768880482220245e-25,-3.214238915372879995e-24,1.587847666676755253e-25,2.150153182603652978e-25,2.673822224458021101e-25,2.242385595853962551e-25,-4.000087600214208490e-25,-6.026534358427058362e-26,-4.011483590880704598e-25,-7.303408795811107688e-25,-1.043316809785531857e-24,-5.354174253906172667e-26,-2.013805510718882792e-24,2.113924859916144906e-25,1.385415107485860918e-24,-5.656776828479270255e-25,1.816114899534040753e-24,5.712972516724100151e-25,-1.325269451629301480e-24,6.491691807871041839e-26,-4.001326339507779310e-24,3.394223158524709949e-25,-4.322286232669960543e-25,-6.039734785851351126e-29,-2.865391178168162999e-23
3.871155049610080784e-24,8.759471297389089397e-24,-5.323123234289499791e-24,-5.552387230176323729e-24,-2.182930751262439561e-25,6.686386525291266393e-24,1.741100256895968728e-24,4.446603898507887823e-24,-5.009237260516151707e-25,-6.435078448249981250e-25,1.230528153662405306e-23,4.363474135296609697e-25,5.361438579912619516e-25,3.086682082280138257e-24,1.939818080388559329e-24,5.533260938473318284e-24,3.844832514210177224e-26,-2.153555683748997342e-26,-4.563400649066228554e-25,-8.280141844992299401e-24,2.165107941328097301e-25,1.053223098073502840e-23,-6.786791897332395629e-25,-9.749175824150824485e-24,1.414347017215466893e-24,2.826025155029391417e-24,-3.758565415856530283e-24,4.227311851090642232e-24,-3.366808287517140018e-28,-1.054219172548685591e-21
2.357603604196045188e-24,-6.650814998602831925e-25,7.644478262144274243e-25,-2.074920948219105325e-25,-5.473300204547486401e-25,-8.072833336739235104e-25,-3.622724950437664523e-26,-1.433576846707448481e-24,-1.877429668381381215e-25,-1.471445040643551825e-24,3.632533613773045950e-25,2.898974696836451179e-24,5.666413145460274518e-25,-1.395962413958932392e-25,-1.343239242342979407e-23,4.881918855720820581e-25,-8.883736053280798040e-25,-4.646968328978205125e-25,-2.646474261390232267e-24,-4.413141860479979782e-24,1.055090554579918052e-24,-1.028286236965304402e-25,-9.983693486839893986e-26,2.257184942688202118e-24,4.276555379535120503e-25,-1.871298575875146627e-24,1.094392295302761270e-24,-1.004439596240761244e-24,2.956831166221057908e-28,-4.000681122872189839e-23
2.976330346323113696e-25,2.003471224552595052e-27,-6.714874221706645612e-25,-8.831687489734251446e-26,1.333403763286715538e-25,1.367864665221944553e-25,9.495588966289230993e-26,-1.297528172330129443e-25,-2.071902998109565734e-25,4.050476174598842982e-26,-8.150652860469011981e-27,-9.817952905695905681e-25,5.244334172131682670e-26,-3.387914745274935232e-25,-1.033222683570489828e-26,2.095137699002642633e-25,-2.243609876514097100e-26,1.509179275093727669e-25,-2.190722754895568123e-27,-1.416170700576163726e-24,2.246781828670675429e-25,2.104705444559885622e-25,-3.821211729114011150e-25,-2.334558249005388277e-25,3.584615339274431010e-26,-3.314146898887958548e-25,-1.382957998146929271e-25,6.587617788471480510e-26,-7.135588198980855051e-28,-1.279091418238773655e-24
2.696276273493685470e-25,-6.818301323177180319e-25,-4.613160667179269594e-25,-2.185028739772756535e-25,5.545402398170301855e-25,-1.884523261758473088e-24,1.672061618990592584e-25,-3.148429690380698602e-25,-1.404628194092370501e-24,-1.804003900787946504e-25,2.798501846941802857e-25,-2.501900114726928033e-25,6.442630118286816514e-26,4.346961019101786627e-24,9.297171922113247709e-25,-1.616700475009940270e-24,-1.807237277299074049e-25,1.769621258717216240e-24,-8.136999635297397065e-26,-3.437127396902892961e-26,-9.878570855841995453e-25,-1.893225473071046079e-26,4.343348072835388124e-24,-2.072558676934625880e-25,1.880689324272761888e-25,1.872132684189626072e-24,3.313522362655622615e-24,-6.000431399547656902e-26,-3.844912771036548153e-25,-1.089730521276330436e-24
3.625937786284372565e-25,1.976463846405794716e-24,-4.256981037822592051e-25,-5.526052808915353234e-25,-6.234388560866274336e-25,-2.921250067476266483e-25,-7.021754477087474132e-26,-3.103583520165122219e-25,-8.320578808092347452e-25,7.808241876957930134e-25,-3.007675175255459742e-25,1.637691711973006351e-26,1.831360044415103396e-24,-3.071720165240006518e-25,-3.230010561982224230e-25,-3.020015090278051995e-26,-2.664832035726512066e-24,2.198154919111549771e-25,2.126725322130107749e-24,9.968611168028146654e-25,-1.593901350762339483e-25,3.002521552854285677e-25,2.258580184187189792e-25,1.912880076967409679e-25,1.619991177869992097e-24,-9.638417554473455520e-26,-1.345306017788224715e-24,1.586706936021608088e-24,-2.400469019466781228e-24,-3.971806234715487524e-25
-1.896603814534832165e-25,-2.527603919781860254e-25,-7.704432424342199772e-26,2.574932166190522608e-25,7.181314951274356421e-25,-5.230304540627095836e-27,7.130595915924199562e-25,4.733160398758130836e-25,1.074812109426751598e-24,2.077392899049956042e-25,1.190714920245202754e-25,-2.069298437141067047e-25,5.882819460932898363e-25,-4.405979524086227699e-25,-3.935796841618709509e-25,-2.219134100414870569e-25,-6.941205221651229911e-25,-4.879015905160479797e-27,-4.360708775557975155e-26,-2.514113061066286507e-25,8.635835441516069048e-25,-5.577042421613551036e-25,1.132183804011100518e-24,2.119490032494611346e-25,-2.372685387829750509e-25,-1.203090319267946735e-25,-2.717227701041145311e-25,-2.211656267206592629e-25,2.253291954721398898e-29,-3.417135321240615941e-23
-9.207948088152891619e-26,1.995109484778478941e-26,-5.161557305241301525e-25,-1.049001356686586251e-24,-1.679827177929228230e-26,6.219527686679980770e-25,-2.551751823253243005e-25,-1.125766974395589110e-26,1.774196607564000776e-25,4.360035787577316210e-26,4.849051057933310902e-26,4.608901107291153337e-25,5.135897040743057154e-27,-3.846871510530688668e-26,2.344828324264704367e-25,1.919564798392115991e-25,4.865998983441469673e-27,-8.901395332178995532e-25,-7.758412922664670564e-25,8.664330936864721425e-27,-1.080578515254533113e-25,2.033222988435081479e-27,-1.732812993328447233e-24,-1.568174500480320780e-26,2.234939827592275820e-25,-2.341834199560504567e-25,3.526629230022255056e-25,-1.186604913180110629e-25,-7.437078196739587133e-26,-7.988081381789312741e-26
-8.991689731142074374e-26,-2.635042292364215768e-24,-2.952498578302643725e-24,-2.720756183884931259e-24,-2.945078973604631874e-25,-2.093306647461294740e-24,1.148204292888789966e-25,1.654979052368626514e-24,9.603073673321661871e-26,-2.963069108709592412e-25,1.290081546969459699e-25,2.658361221933669863e-24,5.772226993521956092e-25,-1.692594404393074298e-25,9.014289450527746784e-25,3.453785684967144540e-27,5.940004584002554677e-24,-8.211207537539730011e-25,1.464568610097630278e-24,-1.745822497715987761e-24,2.210847205950373935e-24,-1.189183308084069882e-24,1.452607232275680485e-26,-6.488484196554367098e-25,-7.316980470783218599e-25,-8.954431495454638817e-26,-1.632917378665498357e-24,1.405600695671557750e-24,-6.437956822835153536e-25,-5.214326321740841264e-25
-5.511945452430951452e-25,6.894013595790396172e-25,1.673202533785594930e-24,1.248116403276093610e-24,4.912050197889915711e-25,5.410812786564598821e-25,5.675110446287464998e-24,2.327709166177318540e-25,-8.083888435627072776e-25,7.939453066784758226e-25,9.201404452303161581e-25,-2.745999137937162433e-25,3.198005648871107764e-25,-2.012173609025975220e-24,-4.201655750781673576e-25,-4.073753815313482596e-25,1.926388370336075295e-25,-2.895011836840360242e-24,-1.701036423148238102e-24,-4.808523351176864851e-25,-5.900069829006963609e-25,1.958061650142593526e-24,2.084778400646838310e-25,2.096200933786993705e-24,5.777078415830490388e-26,2.923244685896641954e-24,1.762147644636341430e-25,2.563536799484983403e-24,-1.476558479449614350e-28,7.142406516464731285e-23
-4.154773954954685840e-25,5.054561136954045785e-25,-8.375926734717562968e-26,1.409357060553143999e-25,-2.720188884449112707e-25,-5.534499608669145570e-26,-8.290011682224623889e-26,-1.038522394579466966e-24,2.800804730432343654e-25,-6.279293942876262826e-25,5.031443109521943171e-25,9.676023204768703199e-25,6.702533977601852229e-25,2.241632557453503778e-26,1.717742319449516825e-24,2.329918206136061206e-26,-2.015556048086427069e-25,-1.158528515846088807e-25,-4.883201707296164402e-25,5.408117177286238158e-26,-1.368039322438654795e-24,-6.734239662640221077e-25,1.257601769790989236e-25,1.956317134140608349e-25,-2.018167768783599489e-25,-6.269311114261948356e-25,-1.888986970863295735e-25,7.456401758734566292e-25,-1.716894749321027739e-24,5.090246552256644020e-26
1.026601764887115501e-24,-4.718660862050189492e-26,5.375692077346211090e-25,-3.959401337066536064e-25,9.860382134451752820e-26,-5.272779069299050919e-25,3.795698271965289418e-25,-6.501490348325483478e-25,3.459354117396437447e-27,-3.791292792339641518e-24,2.209803162863281797e-25,-3.981748317227762374e-25,-3.813899310750642547e-26,8.631453845902999739e-25,2.795791514487809026e-25,1.864401503729611673e-25,1.633616598629199259e-25,-1.722037706937158421e-26,7.133243036593000733e-25,-2.731523398848544544e-26,-7.198591982561408633e-26,2.131284538094487512e-24,1.392949663527143823e-25,8.916504597417551119e-26,2.666747602795078511e-25,-2.855798252602220178e-25,1.693739149524662478e-25,5.878546873370930350e-25,8.167978341585338070e-29,1.100598110765386611e-22
-3.407305095125071328e-25,-2.724002086183073539e-25,-2.029942950681480753e-25,-3.665143947666861216e-24,-1.705181100448163681e-26,-3.015853967100325789e-25,2.280551022332619480e-24,1.661602369783778236e-24,4.864984210124606793e-25,-2.500361144071188440e-24,1.224938567269692368e-26,5.693123408161834453e-25,5.120980641348107521e-24,6.060772170188051752e-25,4.567900963988296428e-24,-6.239508424931994965e-25,-7.657682063051447591e-26,1.211551760700791084e-24,-5.724902470316662480e-25,8.422729442980029014e-25,5.616333145573492912e-25,6.246048456553817519e-25,-9.668950081375604455e-25,5.652254907866230497e-25,4.022857870258514727e-25,-4.539625866602449044e-25,3.087569942762470260e-24,-2.142453461374181453e-24,-1.093144564181219259e-27,1.180640040962070967e-23
-1.020286307048461751e-25,2.925404873780726946e-24,3.580683052379878176e-25,-4.538540829420274734e-25,4.898565831005465797e-25,6.450896753307476093e-26,3.549152185330674731e-24,7.597063257088677972e-25,-6.918247500942773366e-25,3.458886040896140532e-25,-2.778781794077461637e-25,4.680029047137211712e-25,-1.545509066400209466e-25,-2.082973397049161479e-25,-3.332961792134394116e-26,-1.736694976876015731e-24,-6.168400133970797457e-25,-2.198808971380518494e-25,3.675202703901595305e-25,-1.715978766558033752e-24,-4.822516383567146069e-25,7.632003979520056094e-26,-6.166434789844678271e-25,1.264996473594113135e-24,-9.969301761977897507e-25,-3.903710165910613560e-25,-1.204638240723522012e-25,7.521693715575797930e-25,-8.448311073420212379e-27,-5.807380972797227583e-24
3.751802393288766638e-26,-1.398967793944506992e-24,4.109057060435144623e-27,-1.607624817789007271e-24,3.566138120242831714e-25,-7.878342364147562834e-26,1.374666618059509206e-25,-2.830301028825634585e-25,-1.168337237283255142e-25,9.382558175171305121e-27,-1.001429494983294983e-24,6.267711488170159213e-25,3.740675300936697493e-26,5.100667291354408124e-26,-7.668137382683138446e-26,1.409070595636075741e-24,-4.753761387077845191e-26,-4.685038108957001140e-25,-1.308225910866061861e-26,2.874975821346822662e-25,1.910527474763715920e-25,-7.315079386648201530e-26,1.182971359946386183e-24,-1.307908150260068420e-26,4.538928022776275309e-25,-1.230513348008642861e-25,5.890483158027531476e-25,-2.811822214071526654e-25,9.005465904452390701e-25,-1.351493905533487788e-25
1.334578979858346737e-24,-2.654789695423650735e-25,1.544663739484462991e-25,-1.964616328710867600e-24,-1.924683294628946924e-26,2.946952849171288738e-24,-4.335001666080023368e-26,5.953637636247754580e-25,-1.764862203730378623e-24,1.529450649501877784e-25,7.344163145018425089e-25,-1.584026505621322187e-24,2.538241732687925441e-24,-2.550073373560972307e-25,1.705867047976375073e-24,3.826138867155669553e-25,-1.483176757061320881e-24,-8.701200632848581945e-25,-3.619819994915337472e-25,-6.195618529162384744e-25,-1.225861536952975392e-24,9.143803558142510685e-25,1.559376021089212732e-24,-1.684957908519056429e-24,-4.785216875009737424e-25,4.624384001384263107e-27,2.922722703791946183e-24,-5.484200058569217887e-25,-1.276130662618495784e-24,1.253500792636998700e-25
-7.906897531416050054e-26,-6.919071502299847128e-24,8.676052452554809541e-25,-6.776353370054324170e-25,-2.016249025405642738e-25,3.972022274226559734e-25,9.062603524841953858e-25,-2.505265453439131842e-25,-1.171780861452665781e-24,-7.935098143508731020e-25,1.038801041747602019e-25,1.342266343464600025e-24,7.574653052479616205e-25,-2.111521794171795588e-24,1.315830029183883943e-24,1.058383665248415364e-25,1.082243253404606665e-23,1.512484747146842480e-24,-4.227497851037555491e-25,3.746851177358193266e-24,8.681540601411107951e-27,1.257729893626339028e-23,-4.540767359167763370e-25,6.402428309480256421e-25,-5.503708338260528022e-25,-6.707245360979834338e-26,-5.554036290914504374e-25,7.348400093773763783e-25,2.563747798068369558e-29,2.649391667228858603e-22
-4.807477333460149898e-25,1.043709038168758278e-25,-8.892237315107394164e-24,-1.925682950124696596e-24,1.808507297326352932e-26,-5.258409584401440470e-24,-8.874229524023930837e-26,1.142314485081123050e-23,2.397981538873570472e-25,3.673717960331888862e-26,-2.985615764521664503e-24,1.436730209511561425e-24,-2.471656911481312498e-24,-1.675736602326396582e-24,2.081180420866223423e-24,-4.061743790992747504e-26,4.263010151791219710e-23,1.215593216893243610e-26,4.238668665592420361e-23,-3.780741469528618654e-24,-4.188963540245413727e-24,-1.027149357081393396e-24,-2.343249140463927573e-24,3.110299421594534316e-24,1.925005038024105084e-24,-8.840685046286142543e-24,-4.388650024003105087e-24,1.256463007567653942e-23,6.989771922074593152e-24,1.227465903537903686e-23
-3.554501412849173763e-25,1.014614347508211561e-25,2.093766043842630400e-25,-1.685742003464842130e-25,-4.462872833941541167e-26,-6.168089522230085750e-25,-1.337085293488083766e-25,3.153326652459525549e-25,9.673084561919383274e-25,1.712937251557471417e-25,2.259955199074455070e-25,1.255757020315761078e-25,1.219213660810633296e-25,4.140672195768051011e-26,-1.454087387864981048e-27,7.875072841297257063e-25,2.055214746647401119e-25,3.303781784159687120e-25,1.217951970515825312e-25,4.973532480063489893e-26,1.677279876282258568e-25,1.787518043335919004e-25,4.813936897670577794e-25,1.601062860463942534e-25,-4.152706896781206894e-25,7.908186835807974539e-26,-3.822004788334538989e-25,-1.686032246745030944e-25,-3.375118303269274973e-31,-6.457297524893121083e-22
2.963203408069968336e-25,-3.230848522609516484e-25,-9.257715706147416180e-25,-6.411166270637010318e-25,8.424155625539978392e-26,1.550334340949359692e-25,-1.383728174971982590e-25,-5.686156157350800020e-27,-6.422547044445857226e-25,1.027340350568341900e-25,-4.655131434920556452e-25,-1.950756279190607710e-25,-1.296690331573596615e-26,9.180121767615707906e-25,-5.570016042625764647e-25,4.233091137315556529e-27,2.100058529260497607e-25,-6.357157914232077300e-26,1.414850244596922778e-25,1.332613200712667799e-26,5.221782041355427621e-25,-9.591824332189660671e-26,1.105734060400435359e-25,-5.638717063740202635e-26,-9.446984690221791966e-25,4.409503675810873374e-25,-3.922072538323427107e-25,1.345569749441924734e-25,6.939348265817839450e-25,-1.026947218400956266e-25
-3.941825513289302852e-26,1.112440152263421966e-25,-8.417293537979125412e-26,-7.377968403758385403e-26,-2.009951952678622227e-25,1.573848333660674019e-25,-3.323578878793586050e-25,1.441394435874468967e-25,-1.036202041779930695e-25,2.600672334671171856e-25,2.498295432925439061e-26,5.382757722871928070e-25,-5.522425562462776356e-25,6.602933642392826233e-25,3.064718522611888707e-25,-3.252142078285987964e-25,1.337864594158008136e-24,-2.461828868652364774e-25,1.256331156687132542e-28,2.935268265285678744e-24,3.677412000386953889e-26,3.079146399440850385e-24,-3.224691220534866156e-25,-1.018147881567832674e-24,2.318606689640086229e-25,-4.929703120422258291e-25,1.579362138894509126e-25,1.607219104712398195e-24,-1.414771202980869203e-29,1.278613215672320821e-23
6.156141587293855467e-25,3.635971205392791761e-25,-2.083652888084554676e-25,5.571414374094826793e-25,3.783533319097027605e-26,-9.690621252417322674e-25,-2.256845707740006667e-25,-1.628019162235127501e-25,1.495588361702711303e-27,-1.257295031852488854e-24,7.358319798657481772e-25,1.744343603029148348e-25,4.296022571252408652e-25,-1.451238724166352294e-25,2.597987689278433574e-25,-4.093691101878854047e-25,-1.846847538524212767e-25,1.626548430302003826e-25,-1.186576996574928267e-26,-1.650296883382249804e-25,-1.331009449995537904e-25,-1.319187253973724956e-24,-2.338622364254123848e-25,-2.321268593718783551e-25,1.763011959017868516e-25,1.419648250507773914e-25,-5.180042007778799755e-25,-3.481955060658074735e-25,-3.021572823335966458e-25,1.907782667502720324e-25
2.794630385354999962e-25,1.183496625744324719e-25,-1.057218440837727133e-25,-1.423624852691315308e-25,5.776895224582851669e-26,2.514677337876225649e-25,1.730843585533872218e-25,1.673363410205834644e-25,4.175499696537492650e-26,1.454657274437765456e-25,1.924604327598836915e-26,6.673413977794798358e-25,-9.319302384892628936e-27,-6.283976870917216795e-25,-4.326083795655403317e-25,2.496078626030260413e-26,-2.875991306294552497e-25,-3.479682676275757102e-25,5.589259898680779849e-26,-1.128969879762164273e-25,-4.035159959172741665e-27,5.940107333259089760e-25,6.680424104697223687e-26,6.031085208109699785e-25,-5.720776853791306791e-26,-3.115051365995432802e-25,-3.395585106693673154e-25,-3.720343830062895438e-25,-9.783661758738559166e-26,-4.683457220503373377e-25
-2.425734683930413771e-24,1.093126976241157909e-26,2.539088278620204708e-25,3.098021992223232629e-25,5.989356732656856074e-25,3.821651935728140408e-26,9.645138034547383139e-25,-1.775284747515083616e-25,-1.261016091406212288e-25,7.420774025533556876e-25,1.411019314363722357e-24,-1.462266008605860163e-25,2.810914764862206673e-24,8.510286490129304735e-25,1.154650505114128054e-25,9.992096513018557698e-25,1.101935952630230570e-25,8.722653564229308915e-25,-9.228576600935124665e-28,8.785486591690792985e-24,-1.018902622537531200e-25,-8.318205444965267562e-25,-3.245434856815724870e-25,4.439801209416500211e-25,2.907641227981895920e-25,-1.388675723990012946e-25,1.178790267148579123e-24,-1.682561125936923481e-25,-1.819453901033881552e-25,1.450329428918109054e-24
