-1.000000000000000000e+02,-5.773378027345794550e+01,-1.000000000000000000e+02,-1.000000000000000000e+02,-1.000000000000000000e+02,-1.000000000000000000e+02,-1.000000000000000000e+02,-3.362703144580469431e-03,-9.926361012504771470e-06,-8.163876069983441249e-07,-3.068603305200436225e-07,-5.179072360239617837e-08,-5.009320869928881921e-08,-1.748051938873049645e-08,-1.423609594521625425e-07,-2.413440193636445154e-07,-5.836269871686802270e-07,-9.753759880957642585e-06,-3.161725862978705202e-03,-1.000000000000000000e+02,-5.773466023572681394e+01,-1.000000000000000000e+02,-1.000000000000000000e+02,-5.773343452693318056e+01,-1.000000000000000000e+02,-1.000000000000000000e+02,-2.218287235001056151e-03,-1.651777256428795865e-05,-8.342833544401339570e-07,-2.827641009059703158e-07
-1.000000000000000000e+02,-1.000000000000000000e+02,-1.000000000000000000e+02,-1.000000000000000000e+02,-4.389690327082530708e+00,-1.343431195321947991e+00,-1.344753943936197960e+00,-4.393313535986865581e+00,-1.000000000000000000e+02,-1.000000000000000000e+02,-4.373886898654224531e+00,-1.340922940596745550e+00,-1.339995921757610953e+00,-4.379148819815006810e+00,-1.000000000000000000e+02,-2.364182553657967131e-02,-2.520914929686038949e-04,-3.706547761515119631e-05,-1.895010036250953551e-05,-1.639637369338231299e-05,-3.999252943225951352e-05,-1.799357837908101591e-04,-1.351343235128624892e-02,-1.000000000000000000e+02,-1.833650804879197876e-02,-3.594441901190719574e-04,-1.260440714160922118e-05,-4.242387668339301894e-06,3.642545169815549277e-07,-4.227497631494225255e-07
-1.000000000000000000e+02,-5.773730374496576445e+01,-1.000000000000000000e+02,-1.000000000000000000e+02,-1.000000000000000000e+02,-1.000000000000000000e+02,-6.861336291083855801e-03,-2.784194151351268142e-05,-4.166522198423261618e-06,-7.222995433732821118e-07,-6.843550257212537168e-07,-4.290025186242586949e-08,-1.502441407008439804e-06,-4.170470990275988043e-06,-6.434481106868320921e-05,-1.320175122305202939e-02,-1.000000000000000000e+02,-1.000000000000000000e+02,-3.063406529368434761e+01,-3.063606987632937617e+01,-1.000000000000000000e+02,-3.063262000745235270e+01,-3.063451445115665450e+01,-1.000000000000000000e+02,-1.120105941117006780e-02,-1.348861190160349788e-04,-9.161045031303853185e-06,-3.912707938673526327e-06,-1.194370545009480772e-06,3.182672418260589832e-07
-1.000000000000000000e+02,-1.000000000000000000e+02,-1.000000000000000000e+02,-1.000000000000000000e+02,-5.773506312969240639e+01,-1.000000000000000000e+02,-1.000000000000000000e+02,-1.000000000000000000e+02,-5.773504691196853145e+01,-1.000000000000000000e+02,-3.063278357693019771e+01,-3.063277681179296152e+01,-1.000000000000000000e+02,-5.773491885297593029e+01,-1.000000000000000000e+02,-4.540846761323215700e-03,-4.447002638588941738e-05,-6.117676195443774153e-06,-3.493959805135015055e-06,-6.027542349398553233e-06,-4.501733852122576687e-05,-4.457832496481062973e-03,-1.000000000000000000e+02,-1.000000000000000000e+02,-5.773511344985922022e+01,-1.000000000000000000e+02,-5.773511625298603178e+01,-1.000000000000000000e+02,-2.084547097722740561e-04,5.443484070817532832e-08
-1.000000000000000000e+02,-1.000000000000000000e+02,-1.000000000000000000e+02,-1.000000000000000000e+02,-1.234023800959236361e-01,-6.197678721474825930e-03,-1.893264847323065849e-03,-1.863427866039969738e-03,-6.135164957560282177e-03,-1.172436282078159336e-01,-1.000000000000000000e+02,-1.000000000000000000e+02,-1.597043688515413506e-02,-2.402572550602945136e-04,-3.872348426274222977e-06,-2.744339013068131190e-06,-6.041284846347538418e-07,-1.464187620037745144e-06,-3.578284263497338985e-07,-3.710275791493185178e-06,-2.652136849234156893e-06,-1.063671560720819685e-04,-1.996266656181522672e-02,-1.000000000000000000e+02,-4.392458591452566452e+00,-1.344760443640973024e+00,-1.345450610371932587e+00,-4.390449851136692061e+00,-1.000000000000000000e+02,-3.086154313523389349e-03
-1.000000000000000000e+02,-1.320388909271117371e-02,-1.698274401775703632e-04,-2.330240226946988597e-05,-1.218196949574803638e-05,-1.708583413214053939e-05,-1.485258479882212461e-04,-1.096252826533800073e-02,-1.000000000000000000e+02,-1.351978660702099333e+01,-7.805406412245978309e+00,-1.352009595285298360e+01,-1.000000000000000000e+02,-9.038168037156447676e-01,-1.223562984481813831e-01,-7.070359379948421008e-02,-1.225326447649223022e-01,-9.046567245489895992e-01,-1.000000000000000000e+02,-1.000000000000000000e+02,-1.352014196655821365e+01,-7.803915035104273201e+00,-1.351933609417226911e+01,-1.000000000000000000e+02,-1.352006711893205271e+01,-7.805000107659835429e+00,-1.351978427098085334e+01,-1.000000000000000000e+02,-1.000000000000000000e+02,-1.000000000000000000e+02
-1.000000000000000000e+02,-3.063304398335161238e+01,-3.063373694611174969e+01,-1.000000000000000000e+02,-1.000000000000000000e+02,-5.773513290411541732e+01,-1.000000000000000000e+02,-5.773561722848037903e+01,-1.000000000000000000e+02,-1.022292727364549070e-01,-4.609235187555948791e-03,-1.418033684396851441e-03,-1.424547530546113302e-03,-4.598296935389137655e-03,-1.025762457389446936e-01,-1.000000000000000000e+02,-3.063196405601462047e+01,-3.063226285708977770e+01,-1.000000000000000000e+02,-3.063160863721302007e+01,-3.063264236051158917e+01,-1.000000000000000000e+02,-1.351932430203417823e+01,-7.805412224480588357e+00,-1.351971222708268172e+01,-1.000000000000000000e+02,-3.410080206674172363e-03,-4.510386384363671686e-06,-2.969234103854633825e-07,4.900666952997620704e-09
-1.000000000000000000e+02,-3.458686762934245346e-02,-5.657139741983273915e-04,-4.973865151977883867e-05,-1.863817007778651360e-05,-3.040231468534445789e-05,-6.045174602991652786e-05,-5.214040302435345078e-04,-3.358738752437388786e-02,-1.000000000000000000e+02,-1.000000000000000000e+02,-1.000000000000000000e+02,-1.683172285283912606e-01,-8.404198185409651051e-03,-2.667721444103526591e-03,-2.564156576684513238e-03,-7.314551284704051866e-03,-1.393445028917314754e-01,-1.000000000000000000e+02,-1.000000000000000000e+02,-3.064241918092810124e+01,-3.065077292842982004e+01,-1.000000000000000000e+02,-2.140175317747863154e-02,-4.590191346445746416e-04,-2.620118245377672217e-05,-4.690135848716035717e-06,-7.953788894459721764e-07,-3.262072496560709383e-06,1.594287931229079720e-06
-1.000000000000000000e+02,-9.252489818094233875e-02,-2.919690279916647979e-03,-3.335816902006325446e-04,-6.888738219053007657e-04,-1.781943429267904072e-04,-8.191383372071212379e-05,-1.284607067949832936e-03,-3.874092581580446115e-02,-1.000000000000000000e+02,-2.502518474352437572e-01,-7.316265695566027266e-03,-1.230445970491990740e-03,-3.558819615217184229e-04,-3.004401284607683526e-04,-1.979882842373845674e-04,-1.311290181412320391e-03,-3.934339522667398316e-03,-2.319860249706932054e-01,-1.000000000000000000e+02,-1.565223943457525746e-01,-5.128472643817484806e-03,-1.203604830955135692e-03,-7.141655558609320484e-04,-2.905954599432756234e-04,-1.653640066073783384e-04,-1.169529135964646758e-04,-1.828023800479548061e-04,-1.001244852104819739e-04,6.818612277515777114e-05
-1.000000000000000000e+02,-7.687958646027093224e-02,-2.238256619915636285e-03,-5.442859634887632029e-04,-4.602127690215401779e-04,-5.129439689894005165e-04,-3.316107976103616767e-03,-7.453173878415753073e-02,-1.000000000000000000e+02,-3.062622304014841035e+01,-3.061562693129100055e+01,-1.000000000000000000e+02,-3.061012543662146967e+01,-3.059121384199372784e+01,-1.000000000000000000e+02,-3.064297807057763379e+01,-3.065102339434620760e+01,-1.000000000000000000e+02,-3.731078303067369983e-02,-7.410695529318835637e-04,-5.118998029228430532e-05,-4.112794757070913440e-05,-6.222115923614824324e-06,-1.155933586918907131e-05,-4.404088046193273381e-06,-2.369814089053237719e-05,-5.255337414354306136e-05,-2.702520658594016728e-05,-1.586309720532667406e-05,-6.874688352886704268e-06
-1.000000000000000000e+02,-3.062537948567543822e+01,-3.063464903754120172e+01,-1.000000000000000000e+02,-2.393171697997632796e-02,-4.544591718897316628e-04,-1.467293228414452385e-04,-5.436435999307160391e-05,-3.237768058089530228e-05,-2.229069451698156878e-05,-3.588872056871355583e-05,-6.057945551699038577e-04,-3.303327819490522316e-02,-1.000000000000000000e+02,-4.695625865864229420e-02,-2.131484180684539275e-03,-3.990392796628018266e-04,-2.755266579344054748e-04,-3.902868972534846693e-04,-1.700315450034483190e-03,-5.857055474228799186e-02,-1.000000000000000000e+02,-9.642431249962871709e-01,-1.283902740383071062e-01,-7.514583788806299125e-02,-1.281963377226384704e-01,-9.268782362938486896e-01,-1.000000000000000000e+02,-1.000000000000000000e+02,5.515701822343724824e-03
-1.000000000000000000e+02,-1.000000000000000000e+02,-1.000000000000000000e+02,-3.428293630861607016e-02,-4.308606838487906150e-04,-9.456252597306841038e-05,-1.902229061478142094e-05,-1.142543664496403304e-05,-9.291731717433751256e-06,-1.827056264124708919e-05,-1.663864181482792355e-05,-2.386611278367522626e-05,-3.870823721690510482e-05,-9.656243225798552391e-05,-5.197113788421321018e-04,-4.220645749646207562e-02,-1.000000000000000000e+02,-1.612125477921359795e-01,-7.927944189299951719e-03,-2.699441995245832702e-03,-2.758680555945437589e-03,-7.833515644787555909e-03,-1.534428897611080644e-01,-1.000000000000000000e+02,-1.000000000000000000e+02,-1.000000000000000000e+02,-1.000000000000000000e+02,-2.467194722977998980e-02,-4.511013380800905914e-04,4.594903082867293764e-06
-1.000000000000000000e+02,-1.000000000000000000e+02,-4.391709924830681011e+00,-1.345559326168935366e+00,-1.345921203600170646e+00,-4.391046353854767936e+00,-1.000000000000000000e+02,-1.000000000000000000e+02,-1.000000000000000000e+02,-9.266232279219565049e-01,-1.269836149302626949e-01,-7.406449022982559971e-02,-1.291087992123591821e-01,-9.400914205067496532e-01,-1.000000000000000000e+02,-1.351276159466464066e-01,-7.351357149723937445e-03,-2.319968222894844018e-03,-2.206141298141475922e-03,-6.681737866088520439e-03,-1.488901959313859436e-01,-1.000000000000000000e+02,-3.062181705430158729e+01,-3.063278788019985655e+01,-1.000000000000000000e+02,-1.494975326646316369e-02,-2.030293860947360405e-04,-4.056183281793458999e-06,-9.925514876336336722e-06,8.656586778267295169e-06
-1.000000000000000000e+02,-4.396776329657473781e+00,-1.346654759520538258e+00,-1.348552296554716756e+00,-4.399343290842132603e+00,-1.000000000000000000e+02,-8.988223712858881553e-01,-1.218873048280105648e-01,-7.093219259566188595e-02,-1.233806500791594096e-01,-9.090838414312348847e-01,-1.000000000000000000e+02,-5.773133418789700499e+01,-1.000000000000000000e+02,-3.062619029208584820e+01,-3.062637631451914544e+01,-1.000000000000000000e+02,-1.000000000000000000e+02,-3.063783415587350945e+01,-3.063164273360823486e+01,-1.000000000000000000e+02,-1.243824800216049645e-02,-1.898456619985007044e-04,-1.767249429052265917e-05,-3.552772140838667487e-06,-2.160337116678367777e-06,-1.787666605986883314e-06,-7.789273704684033331e-07,-7.539726812802749489e-07,6.788391101812575962e-09
-1.000000000000000000e+02,-3.064589929361709864e+01,-3.064239453127946433e+01,-1.000000000000000000e+02,-1.000000000000000000e+02,-5.772900403950102088e+01,-1.000000000000000000e+02,-4.394663661803671850e+00,-1.348198656880624791e+00,-1.344378623873655476e+00,-4.390923832975063057e+00,-1.000000000000000000e+02,-1.000000000000000000e+02,-1.151395292960727748e-02,-4.262507383100044758e-04,-7.302342594149748142e-05,-1.685031862702800393e-05,-5.887860206792769319e-06,-3.134172500120987833e-06,-7.756604655688963931e-06,-1.624285805858398184e-05,-4.067688218389917500e-06,-4.332212289353122746e-06,-2.378655262099642744e-06,-3.384380232323805048e-07,-2.006208407408241142e-06,-9.681315999717886757e-07,-2.789373775971235272e-06,1.557244308066463178e-06,-3.788578581204380734e-06
-1.000000000000000000e+02,-1.000000000000000000e+02,-1.351941232040335983e+01,-7.805477434494383360e+00,-1.351941351034311189e+01,-1.000000000000000000e+02,-5.773499822219714162e+01,-1.000000000000000000e+02,-1.000000000000000000e+02,-4.389753410684826385e+00,-1.344694531668798154e+00,-1.344702815572492716e+00,-4.389766674940842606e+00,-1.000000000000000000e+02,-1.000000000000000000e+02,-5.773505980659530223e+01,-1.000000000000000000e+02,-1.000000000000000000e+02,-3.063268600492065374e+01,-3.063270518181271740e+01,-1.000000000000000000e+02,-3.063269849994851057e+01,-3.063263842320156982e+01,-1.000000000000000000e+02,-1.601947432118634490e-04,-1.274586046261108954e-07,-4.191153219682675960e-09,-9.556600318243078762e-10,-5.884246892521803638e-10,-2.399981701217690142e-10
-1.000000000000000000e+02,-6.701400044628078034e-02,-1.144370637693309638e-03,-2.549143160363834975e-04,-1.204512762552153885e-04,-5.846476663845348891e-04,-3.116314871837144382e-03,-8.995857701869944267e-02,-1.000000000000000000e+02,-1.000000000000000000e+02,-1.349022863777920556e+01,-7.809660172079746054e+00,-1.352163766109460141e+01,-1.000000000000000000e+02,-1.000000000000000000e+02,-9.880715347315334185e-01,-1.370387758120949484e-01,-7.647280472796152972e-02,-1.351285547983726576e-01,-9.705160569412220051e-01,-1.000000000000000000e+02,-3.399309258268721351e-02,-1.047816390265805808e-03,-1.564417074451649240e-04,-8.004488925886415801e-05,-4.817354163254151906e-05,-2.032651763719636727e-06,6.847147991494720786e-07,-1.141523418681400260e-05,8.288100608665061454e-06
-1.000000000000000000e+02,-5.773552326752844976e+01,-1.000000000000000000e+02,-1.000000000000000000e+02,-1.000000000000000000e+02,-1.000000000000000000e+02,-1.000000000000000000e+02,-4.389246451809022176e+00,-1.344675724303182607e+00,-1.344621650451314654e+00,-4.389634794441485965e+00,-1.000000000000000000e+02,-1.000000000000000000e+02,-1.351846088089915732e+01,-7.805647298601762429e+00,-1.351927570915501953e+01,-1.000000000000000000e+02,-3.063403405632017851e+01,-3.063385049571234475e+01,-1.000000000000000000e+02,-9.073902343405779516e-03,-1.076507912981503507e-04,-1.605277481201935509e-05,-9.334018659178124191e-06,-1.400252865486341303e-05,-8.626773416503084478e-05,-7.483274664404381167e-03,-1.000000000000000000e+02,-1.001386852399192623e-03,1.515441176097065424e-07
-1.000000000000000000e+02,-5.775501123200972842e+01,-1.000000000000000000e+02,-1.000000000000000000e+02,-1.000000000000000000e+02,-1.094648230350716150e-01,-1.945216778457650600e-03,-4.505448962831644279e-04,-1.357723916021141939e-04,-2.068620325524444766e-05,-6.636173365776523313e-06,-3.659507236862028331e-05,-7.866549345565831291e-06,-1.840079694974582005e-05,-4.293213926923229729e-05,-1.011946233004701096e-04,-1.712552272859127868e-04,-3.636441239782531635e-04,-1.647629905793920402e-03,-8.602197557286316021e-02,-1.000000000000000000e+02,-3.044366593034638496e-02,-9.148910519185245258e-04,-9.786026935688377714e-05,-8.542780421716335715e-05,-1.954380859433693456e-04,-7.277544425172733115e-05,-5.760044101744174038e-07,4.421008708169567035e-06,-8.740509685702518839e-06
-1.000000000000000000e+02,-5.773837432679381720e+01,-1.000000000000000000e+02,-9.132485765729816407e-01,-1.231550129525609966e-01,-7.140049223562258685e-02,-1.239960316156162867e-01,-9.111051744147160569e-01,-1.000000000000000000e+02,-9.120002460282644607e-01,-1.233004319875291716e-01,-7.121413905393242372e-02,-1.229106575339582591e-01,-9.068615061369009744e-01,-1.000000000000000000e+02,-1.134381121281346355e-01,-5.277793313259648497e-03,-1.617216597638995680e-03,-1.622061478189237935e-03,-5.139905277957289298e-03,-1.109912465074496257e-01,-1.000000000000000000e+02,-1.000000000000000000e+02,-1.000000000000000000e+02,-1.000000000000000000e+02,-1.000000000000000000e+02,-1.000000000000000000e+02,-9.108426654369420825e-03,-8.486168483823550439e-05,2.428078601376012618e-06
-1.000000000000000000e+02,-9.633750402485412312e-02,-4.230715800429727183e-03,-1.295876107068480226e-03,-1.295787560071840535e-03,-4.230121456915958943e-03,-9.629985308506965047e-02,-1.000000000000000000e+02,-5.773501667003965565e+01,-1.000000000000000000e+02,-1.000000000000000000e+02,-1.000000000000000000e+02,-1.000000000000000000e+02,-1.000000000000000000e+02,-1.000000000000000000e+02,-1.000000000000000000e+02,-5.773507293028848153e+01,-1.000000000000000000e+02,-1.000000000000000000e+02,-3.063271557926955069e+01,-3.063269604834819049e+01,-1.000000000000000000e+02,-1.000000000000000000e+02,-1.000000000000000000e+02,-3.063271985812988518e+01,-3.063272049891552484e+01,-1.000000000000000000e+02,-4.790560469500770613e-05,-2.080647619305614376e-08,-5.624282707520213663e-10
-1.000000000000000000e+02,-1.000000000000000000e+02,-5.885572985550930475e-02,-4.560256589049928354e-04,-1.391410471222485012e-04,-2.973742411840023378e-05,-4.160997038050170212e-05,-1.329315608393149899e-04,-1.348497475508114371e-03,-5.203731605767483726e-02,-1.000000000000000000e+02,-6.123385899108781810e-02,-6.061497429385718280e-04,-1.973353063984354663e-04,-2.003820224227677240e-07,-4.282648737173214382e-08,-4.510833098579613285e-05,-4.988880007491248406e-05,-6.689559563526435292e-05,-1.360967675765619551e-04,-1.560633091275700829e-03,-3.757537858638257400e-02,-1.000000000000000000e+02,-1.351706430314043317e+01,-7.787793260442343879e+00,-1.351505498275339789e+01,-1.000000000000000000e+02,-1.000000000000000000e+02,-4.008004821685114127e-02,1.514811281349083660e-05
-1.000000000000000000e+02,-1.000000000000000000e+02,-1.352036882505046833e+01,-7.805902044377544868e+00,-1.352089161497281289e+01,-1.000000000000000000e+02,-4.390162278024583031e+00,-1.344970641498292707e+00,-1.344909573369844180e+00,-4.389758354445201682e+00,-1.000000000000000000e+02,-1.000000000000000000e+02,-1.000000000000000000e+02,-1.000000000000000000e+02,-1.806815476326507127e-03,-7.737348849353576198e-06,-6.863826057608723414e-07,-2.080623160685865692e-07,-1.049069573641781666e-07,-1.224530334334850773e-07,-3.990631491554138327e-07,-7.379540291508039317e-06,-9.770933865355280364e-04,-1.000000000000000000e+02,-1.000000000000000000e+02,-4.391310649898524154e+00,-1.345016608941824066e+00,-1.345205362777730507e+00,-4.390784587258329097e+00,-1.000000000000000000e+02
-1.000000000000000000e+02,-2.408674775018032621e-02,-4.542467400422956197e-04,-1.506935116061354691e-04,-1.314956546345973987e-05,-2.860667798261421326e-06,-8.019514205564886070e-06,-1.388388265170035143e-05,-3.600755788698877175e-06,-7.421581424152202264e-06,-2.102550406957724952e-05,-3.244592407164513612e-06,-3.746588998399241478e-05,-7.118915511423869961e-05,-4.964565182571279052e-04,-4.655367584160480937e-02,-1.000000000000000000e+02,-1.000000000000000000e+02,-5.775047037545023443e+01,-1.000000000000000000e+02,-1.000000000000000000e+02,-1.615280225710094553e-01,-1.064318740213241951e-02,-3.042543223368364587e-03,-2.995427157907271619e-03,-9.075871866278730285e-03,-1.700705456086225031e-01,-1.000000000000000000e+02,-2.732897581243601270e-02,-2.343988632828440828e-04
-1.000000000000000000e+02,-1.000000000000000000e+02,-5.773481050759042432e+01,-1.000000000000000000e+02,-4.390244594194470551e+00,-1.344832404407908522e+00,-1.344656717615038355e+00,-4.391103211485535063e+00,-1.000000000000000000e+02,-5.773475038833449702e+01,-1.000000000000000000e+02,-8.664206148444143080e-03,-1.027638461609183294e-04,-1.550455173484072954e-05,-9.324835576710249353e-06,-1.528354986979361463e-05,-9.929863636559827509e-05,-8.670954441431854426e-03,-1.000000000000000000e+02,-3.063228711767978041e+01,-3.063234101744653515e+01,-1.000000000000000000e+02,-4.389825100535182045e+00,-1.344687588962144797e+00,-1.344954658835218808e+00,-4.389243704554232295e+00,-1.000000000000000000e+02,-1.000000000000000000e+02,-6.721690782904652783e-04,-2.729307719799204395e-06
-1.000000000000000000e+02,-1.350043704364804675e+01,-7.793456373979941176e+00,-1.351218971108277245e+01,-1.000000000000000000e+02,-3.066697925870597530e+01,-3.081618464632110488e+01,-1.000000000000000000e+02,-3.504261647275450087e-01,-3.946685975064632979e-02,-1.232207222607740495e-02,-5.002351733737472189e-03,-1.411734268628025849e-03,-1.004858939979050292e-03,-4.752066588515934872e-03,-6.463440936539961018e-03,-9.866996914399059349e-04,-1.229362879005429371e-02,-2.989181737352003543e-01,-1.000000000000000000e+02,-1.000000000000000000e+02,-2.690304674560899389e-01,-1.244100254649135873e-02,-4.496021553522235210e-03,-4.977623118164305194e-03,6.722026477980804762e-05,-5.517608491203081266e-04,-2.302375818544677086e-03,-1.794675774333265609e-03,6.954031730014057725e-05
-1.000000000000000000e+02,-1.000000000000000000e+02,-3.063646026001472933e+01,-3.063102920040857668e+01,-1.000000000000000000e+02,-3.063460233059574733e+01,-3.063077966189270995e+01,-1.000000000000000000e+02,-1.000000000000000000e+02,-1.000000000000000000e+02,-9.378483507051928181e-03,-1.200584749455689792e-04,-9.255313490804896180e-06,-3.165786698136139437e-06,-8.633007248572663100e-07,-4.222565558666923910e-07,-1.289421007973502339e-06,-1.007760494721422154e-06,-2.773496022515076469e-06,-1.412087769373736765e-05,-1.405821763953432006e-04,-1.104686912608213861e-02,-1.000000000000000000e+02,-1.000000000000000000e+02,-1.000000000000000000e+02,-8.739022269116309902e-03,-6.499835682570974382e-05,-3.372752403109141841e-06,-5.477982366539969198e-07,3.178603523725317822e-07
-1.000000000000000000e+02,-1.000000000000000000e+02,-5.773547172351073442e+01,-1.000000000000000000e+02,-1.000000000000000000e+02,-1.000000000000000000e+02,-5.773519575533450165e+01,-1.000000000000000000e+02,-1.000000000000000000e+02,-3.303340084206490834e-03,-1.385501901069501980e-05,-1.110022939441395066e-06,-4.047939897629281124e-07,-3.217283470617382154e-07,-4.140121915747238122e-07,-6.259587522644947206e-07,-9.429727537013826065e-06,-3.615021126476238283e-03,-1.000000000000000000e+02,-1.351921182823936718e+01,-7.805091311553677969e+00,-1.351950107806305468e+01,-1.000000000000000000e+02,-1.000000000000000000e+02,-1.430523963200014924e-03,-8.766645536503104604e-06,-5.335744396896188504e-07,-1.045350707080481997e-07,-1.738120553555401035e-07,-3.171249099871218635e-08
-1.000000000000000000e+02,-1.000000000000000000e+02,-5.773532250294717727e+01,-1.000000000000000000e+02,-1.000000000000000000e+02,-1.000000000000000000e+02,-5.539604300770844050e-03,-1.646481139499020855e-05,-2.071123986457316410e-06,-4.422467224841608035e-07,-7.118492770324252512e-08,-6.053042690969362254e-08,-1.950975270469725521e-07,-2.274945059265970565e-06,-2.264741804544861525e-05,-5.283387105639976433e-03,-1.000000000000000000e+02,-9.085193422526904872e-01,-1.230814964807975392e-01,-7.124986396680491052e-02,-1.234558833934214506e-01,-9.089922120312637910e-01,-1.000000000000000000e+02,-3.063300095532745360e+01,-3.063602863210369520e+01,-1.000000000000000000e+02,-1.000000000000000000e+02,-1.000000000000000000e+02,-2.203052537634864628e-03,1.281809772813238146e-05
-1.000000000000000000e+02,-5.444368881619003273e-03,-3.339097590059485638e-05,-5.093160455491636574e-07,3.707485314795524407e-08,-2.291085911704595199e-07,-1.736124390617902436e-07,-1.237831334861036502e-06,-7.083876641834608800e-07,-3.061582151660680819e-06,-4.155038090789410065e-05,-5.821713645021866709e-03,-1.000000000000000000e+02,-1.000000000000000000e+02,-1.000000000000000000e+02,-4.383312531011839042e+00,-1.340857675462818532e+00,-1.340076584862590181e+00,-4.375783423014063089e+00,-1.000000000000000000e+02,-1.000000000000000000e+02,-1.352488406163455892e+01,-7.807186853140847482e+00,-1.352366514444603496e+01,-1.000000000000000000e+02,-1.000000000000000000e+02,-1.260106038488643769e-02,-6.618697600727405745e-05,-7.635941225819957499e-06,4.736984345422222090e-07
