9.999999999999990052e+01,1.000000000000000000e+02,1.000000000000000000e+02,1.000000000000000000e+02,1.000000000000000000e+02,1.000000000000000000e+02,1.000000000000000000e+02,1.000000000000000000e+02,1.000000000000000000e+02,9.999999999999992895e+01,9.999999999999995737e+01,1.000000000000000000e+02,1.000000000000000000e+02,1.000000000000000000e+02,1.000000000000000000e+02,1.000000000000000000e+02,1.000000000000000000e+02,1.000000000000000000e+02,9.999999999999994316e+01,1.000000000000000000e+02,1.000000000000000000e+02,1.000000000000000000e+02,1.000000000000000000e+02,9.999999999999988631e+01,9.999999999999988631e+01,1.000000000000000000e+02,9.999999999999995737e+01,9.999999999999998579e+01,9.999999999999998579e+01,9.999999999999967315e+01
9.999999999999997158e+01,1.000000000000000000e+02,1.000000000000000000e+02,1.000000000000000000e+02,1.000000000000000000e+02,1.000000000000000000e+02,1.000000000000000000e+02,1.000000000000000000e+02,1.000000000000000000e+02,1.000000000000000000e+02,1.000000000000000000e+02,1.000000000000000000e+02,9.999999999999998579e+01,1.000000000000000000e+02,9.999999999999995737e+01,1.000000000000000000e+02,1.000000000000000000e+02,9.999999999999997158e+01,9.999999999999987210e+01,1.000000000000000000e+02,1.000000000000000000e+02,1.000000000000000000e+02,9.999999999999997158e+01,1.000000000000000000e+02,1.000000000000000000e+02,9.999999999999987210e+01,9.999999999999994316e+01,1.000000000000000000e+02,9.999999999999995737e+01,9.999999999999982947e+01
1.000000000000000000e+02,1.000000000000000000e+02,1.000000000000000000e+02,1.000000000000000000e+02,1.000000000000000000e+02,1.000000000000000000e+02,1.000000000000000000e+02,1.000000000000000000e+02,1.000000000000000000e+02,1.000000000000000000e+02,1.000000000000000000e+02,1.000000000000000000e+02,1.000000000000000000e+02,1.000000000000000000e+02,9.999999999999991473e+01,1.000000000000000000e+02,1.000000000000000000e+02,1.000000000000000000e+02,1.000000000000000000e+02,1.000000000000000000e+02,9.999999999999998579e+01,1.000000000000000000e+02,9.999999999999997158e+01,9.999999999999987210e+01,9.999999999999997158e+01,1.000000000000000000e+02,1.000000000000000000e+02,9.999999999999985789e+01,1.000000000000000000e+02,-9.999999999999992895e+01
1.000000000000000000e+02,1.000000000000000000e+02,1.000000000000000000e+02,1.000000000000000000e+02,1.000000000000000000e+02,1.000000000000000000e+02,1.000000000000000000e+02,1.000000000000000000e+02,1.000000000000000000e+02,9.999999999999992895e+01,9.999999999999995737e+01,1.000000000000000000e+02,9.999999999999997158e+01,1.000000000000000000e+02,1.000000000000000000e+02,1.000000000000000000e+02,9.999999999999994316e+01,1.000000000000000000e+02,1.000000000000000000e+02,9.999999999999998579e+01,1.000000000000000000e+02,1.000000000000000000e+02,1.000000000000000000e+02,1.000000000000000000e+02,1.000000000000000000e+02,1.000000000000000000e+02,9.999999999999985789e+01,1.000000000000000000e+02,9.999999999999990052e+01,9.999999999999988631e+01
1.000000000000000000e+02,1.000000000000000000e+02,1.000000000000000000e+02,1.000000000000000000e+02,1.000000000000000000e+02,1.000000000000000000e+02,1.000000000000000000e+02,1.000000000000000000e+02,9.999999999999995737e+01,9.999999999999992895e+01,9.999999999999994316e+01,9.999999999999991473e+01,1.000000000000000000e+02,1.000000000000000000e+02,1.000000000000000000e+02,1.000000000000000000e+02,1.000000000000000000e+02,9.999999999999997158e+01,1.000000000000000000e+02,9.999999999999994316e+01,1.000000000000000000e+02,1.000000000000000000e+02,9.999999999999998579e+01,9.999999999999987210e+01,1.000000000000000000e+02,1.000000000000000000e+02,1.000000000000000000e+02,1.000000000000000000e+02,1.000000000000000000e+02,-9.999999999999958789e+01
9.999999999999995737e+01,9.999999999999995737e+01,1.000000000000000000e+02,1.000000000000000000e+02,1.000000000000000000e+02,1.000000000000000000e+02,1.000000000000000000e+02,1.000000000000000000e+02,1.000000000000000000e+02,1.000000000000000000e+02,9.999999999999994316e+01,9.999999999999994316e+01,9.999999999999995737e+01,1.000000000000000000e+02,1.000000000000000000e+02,1.000000000000000000e+02,9.999999999999985789e+01,1.000000000000000000e+02,9.999999999999985789e+01,1.000000000000000000e+02,9.999999999999998579e+01,9.999999999999988631e+01,9.999999999999998579e+01,9.999999999999997158e+01,9.999999999999995737e+01,9.999999999999997158e+01,9.999999999999995737e+01,1.000000000000000000e+02,9.999999999999987210e+01,-1.000000000000000000e+02
1.000000000000000000e+02,1.000000000000000000e+02,1.000000000000000000e+02,1.000000000000000000e+02,1.000000000000000000e+02,1.000000000000000000e+02,1.000000000000000000e+02,1.000000000000000000e+02,1.000000000000000000e+02,1.000000000000000000e+02,1.000000000000000000e+02,1.000000000000000000e+02,1.000000000000000000e+02,1.000000000000000000e+02,1.000000000000000000e+02,1.000000000000000000e+02,1.000000000000000000e+02,1.000000000000000000e+02,1.000000000000000000e+02,1.000000000000000000e+02,1.000000000000000000e+02,9.999999999999987210e+01,1.000000000000000000e+02,1.000000000000000000e+02,1.000000000000000000e+02,1.000000000000000000e+02,1.000000000000000000e+02,1.000000000000000000e+02,1.000000000000000000e+02,-1.000000000000000000e+02
1.000000000000000000e+02,1.000000000000000000e+02,1.000000000000000000e+02,1.000000000000000000e+02,1.000000000000000000e+02,1.000000000000000000e+02,1.000000000000000000e+02,1.000000000000000000e+02,1.000000000000000000e+02,1.000000000000000000e+02,1.000000000000000000e+02,1.000000000000000000e+02,1.000000000000000000e+02,1.000000000000000000e+02,1.000000000000000000e+02,1.000000000000000000e+02,1.000000000000000000e+02,1.000000000000000000e+02,1.000000000000000000e+02,1.000000000000000000e+02,1.000000000000000000e+02,1.000000000000000000e+02,1.000000000000000000e+02,1.000000000000000000e+02,1.000000000000000000e+02,1.000000000000000000e+02,1.000000000000000000e+02,1.000000000000000000e+02,1.000000000000000000e+02,-9.999999999999951683e+01
1.000000000000000000e+02,1.000000000000000000e+02,9.999999999999998579e+01,1.000000000000000000e+02,1.000000000000000000e+02,1.000000000000000000e+02,1.000000000000000000e+02,1.000000000000000000e+02,1.000000000000000000e+02,1.000000000000000000e+02,9.999999999999995737e+01,9.999999999999995737e+01,9.999999999999992895e+01,1.000000000000000000e+02,1.000000000000000000e+02,1.000000000000000000e+02,1.000000000000000000e+02,9.999999999999997158e+01,1.000000000000000000e+02,1.000000000000000000e+02,9.999999999999988631e+01,1.000000000000000000e+02,1.000000000000000000e+02,9.999999999999997158e+01,9.999999999999994316e+01,1.000000000000000000e+02,9.999999999999991473e+01,9.999999999999984368e+01,1.000000000000000000e+02,9.999999999999977263e+01
1.000000000000000000e+02,1.000000000000000000e+02,9.999999999999995737e+01,1.000000000000000000e+02,1.000000000000000000e+02,1.000000000000000000e+02,1.000000000000000000e+02,1.000000000000000000e+02,1.000000000000000000e+02,1.000000000000000000e+02,9.999999999999997158e+01,1.000000000000000000e+02,1.000000000000000000e+02,1.000000000000000000e+02,1.000000000000000000e+02,1.000000000000000000e+02,1.000000000000000000e+02,1.000000000000000000e+02,1.000000000000000000e+02,9.999999999999987210e+01,1.000000000000000000e+02,1.000000000000000000e+02,1.000000000000000000e+02,9.999999999999987210e+01,1.000000000000000000e+02,1.000000000000000000e+02,1.000000000000000000e+02,1.000000000000000000e+02,1.000000000000000000e+02,9.999999999999967315e+01
1.000000000000000000e+02,1.000000000000000000e+02,1.000000000000000000e+02,1.000000000000000000e+02,1.000000000000000000e+02,1.000000000000000000e+02,1.000000000000000000e+02,1.000000000000000000e+02,1.000000000000000000e+02,1.000000000000000000e+02,1.000000000000000000e+02,1.000000000000000000e+02,1.000000000000000000e+02,1.000000000000000000e+02,1.000000000000000000e+02,1.000000000000000000e+02,1.000000000000000000e+02,9.999999999999985789e+01,1.000000000000000000e+02,1.000000000000000000e+02,1.000000000000000000e+02,1.000000000000000000e+02,1.000000000000000000e+02,1.000000000000000000e+02,1.000000000000000000e+02,9.999999999999992895e+01,1.000000000000000000e+02,1.000000000000000000e+02,1.000000000000000000e+02,-9.999999999999988631e+01
9.999999999999998579e+01,1.000000000000000000e+02,9.999999999999995737e+01,1.000000000000000000e+02,1.000000000000000000e+02,1.000000000000000000e+02,1.000000000000000000e+02,1.000000000000000000e+02,1.000000000000000000e+02,9.999999999999998579e+01,1.000000000000000000e+02,1.000000000000000000e+02,1.000000000000000000e+02,1.000000000000000000e+02,9.999999999999994316e+01,1.000000000000000000e+02,1.000000000000000000e+02,1.000000000000000000e+02,9.999999999999995737e+01,9.999999999999984368e+01,1.000000000000000000e+02,1.000000000000000000e+02,9.999999999999998579e+01,9.999999999999984368e+01,1.000000000000000000e+02,1.000000000000000000e+02,9.999999999999985789e+01,1.000000000000000000e+02,9.999999999999995737e+01,9.999999999999988631e+01
1.000000000000000000e+02,9.999999999999994316e+01,1.000000000000000000e+02,1.000000000000000000e+02,1.000000000000000000e+02,1.000000000000000000e+02,1.000000000000000000e+02,1.000000000000000000e+02,1.000000000000000000e+02,1.000000000000000000e+02,1.000000000000000000e+02,1.000000000000000000e+02,1.000000000000000000e+02,1.000000000000000000e+02,1.000000000000000000e+02,1.000000000000000000e+02,1.000000000000000000e+02,9.999999999999987210e+01,9.999999999999990052e+01,1.000000000000000000e+02,1.000000000000000000e+02,1.000000000000000000e+02,1.000000000000000000e+02,1.000000000000000000e+02,1.000000000000000000e+02,1.000000000000000000e+02,1.000000000000000000e+02,1.000000000000000000e+02,1.000000000000000000e+02,-9.999999999999997158e+01
1.000000000000000000e+02,1.000000000000000000e+02,1.000000000000000000e+02,1.000000000000000000e+02,1.000000000000000000e+02,1.000000000000000000e+02,1.000000000000000000e+02,1.000000000000000000e+02,1.000000000000000000e+02,9.999999999999997158e+01,1.000000000000000000e+02,1.000000000000000000e+02,9.999999999999991473e+01,1.000000000000000000e+02,9.999999999999992895e+01,1.000000000000000000e+02,1.000000000000000000e+02,9.999999999999994316e+01,1.000000000000000000e+02,1.000000000000000000e+02,1.000000000000000000e+02,9.999999999999997158e+01,1.000000000000000000e+02,9.999999999999995737e+01,1.000000000000000000e+02,1.000000000000000000e+02,1.000000000000000000e+02,1.000000000000000000e+02,1.000000000000000000e+02,9.999999999999957367e+01
1.000000000000000000e+02,1.000000000000000000e+02,1.000000000000000000e+02,1.000000000000000000e+02,1.000000000000000000e+02,1.000000000000000000e+02,1.000000000000000000e+02,1.000000000000000000e+02,1.000000000000000000e+02,9.999999999999998579e+01,1.000000000000000000e+02,1.000000000000000000e+02,9.999999999999997158e+01,9.999999999999994316e+01,9.999999999999998579e+01,1.000000000000000000e+02,9.999999999999988631e+01,1.000000000000000000e+02,1.000000000000000000e+02,9.999999999999995737e+01,9.999999999999995737e+01,9.999999999999990052e+01,9.999999999999987210e+01,1.000000000000000000e+02,1.000000000000000000e+02,9.999999999999988631e+01,9.999999999999994316e+01,1.000000000000000000e+02,9.999999999999995737e+01,1.000000000000000000e+02
1.000000000000000000e+02,1.000000000000000000e+02,1.000000000000000000e+02,1.000000000000000000e+02,1.000000000000000000e+02,1.000000000000000000e+02,1.000000000000000000e+02,1.000000000000000000e+02,1.000000000000000000e+02,1.000000000000000000e+02,1.000000000000000000e+02,9.999999999999991473e+01,1.000000000000000000e+02,1.000000000000000000e+02,1.000000000000000000e+02,1.000000000000000000e+02,9.999999999999995737e+01,9.999999999999992895e+01,9.999999999999997158e+01,1.000000000000000000e+02,9.999999999999994316e+01,9.999999999999984368e+01,1.000000000000000000e+02,1.000000000000000000e+02,1.000000000000000000e+02,9.999999999999997158e+01,1.000000000000000000e+02,9.999999999999994316e+01,1.000000000000000000e+02,-9.999999999999981526e+01
1.000000000000000000e+02,1.000000000000000000e+02,1.000000000000000000e+02,1.000000000000000000e+02,1.000000000000000000e+02,1.000000000000000000e+02,1.000000000000000000e+02,1.000000000000000000e+02,1.000000000000000000e+02,1.000000000000000000e+02,1.000000000000000000e+02,1.000000000000000000e+02,1.000000000000000000e+02,1.000000000000000000e+02,9.999999999999991473e+01,1.000000000000000000e+02,1.000000000000000000e+02,9.999999999999995737e+01,1.000000000000000000e+02,9.999999999999988631e+01,9.999999999999991473e+01,1.000000000000000000e+02,9.999999999999994316e+01,9.999999999999995737e+01,1.000000000000000000e+02,9.999999999999998579e+01,9.999999999999990052e+01,9.999999999999992895e+01,1.000000000000000000e+02,9.999999999999994316e+01
1.000000000000000000e+02,1.000000000000000000e+02,1.000000000000000000e+02,1.000000000000000000e+02,1.000000000000000000e+02,1.000000000000000000e+02,1.000000000000000000e+02,1.000000000000000000e+02,9.999999999999998579e+01,1.000000000000000000e+02,9.999999999999991473e+01,1.000000000000000000e+02,1.000000000000000000e+02,1.000000000000000000e+02,9.999999999999997158e+01,1.000000000000000000e+02,1.000000000000000000e+02,9.999999999999991473e+01,9.999999999999997158e+01,9.999999999999997158e+01,9.999999999999985789e+01,1.000000000000000000e+02,9.999999999999998579e+01,1.000000000000000000e+02,9.999999999999994316e+01,1.000000000000000000e+02,1.000000000000000000e+02,1.000000000000000000e+02,9.999999999999997158e+01,9.999999999999977263e+01
1.000000000000000000e+02,1.000000000000000000e+02,1.000000000000000000e+02,1.000000000000000000e+02,1.000000000000000000e+02,1.000000000000000000e+02,1.000000000000000000e+02,1.000000000000000000e+02,1.000000000000000000e+02,1.000000000000000000e+02,1.000000000000000000e+02,1.000000000000000000e+02,1.000000000000000000e+02,1.000000000000000000e+02,1.000000000000000000e+02,1.000000000000000000e+02,1.000000000000000000e+02,1.000000000000000000e+02,1.000000000000000000e+02,1.000000000000000000e+02,1.000000000000000000e+02,9.999999999999987210e+01,1.000000000000000000e+02,1.000000000000000000e+02,1.000000000000000000e+02,1.000000000000000000e+02,1.000000000000000000e+02,1.000000000000000000e+02,1.000000000000000000e+02,-1.000000000000000000e+02
9.999999999999990052e+01,1.000000000000000000e+02,1.000000000000000000e+02,1.000000000000000000e+02,1.000000000000000000e+02,1.000000000000000000e+02,1.000000000000000000e+02,1.000000000000000000e+02,1.000000000000000000e+02,1.000000000000000000e+02,1.000000000000000000e+02,1.000000000000000000e+02,1.000000000000000000e+02,9.999999999999991473e+01,1.000000000000000000e+02,1.000000000000000000e+02,9.999999999999992895e+01,9.999999999999998579e+01,9.999999999999997158e+01,1.000000000000000000e+02,1.000000000000000000e+02,1.000000000000000000e+02,1.000000000000000000e+02,1.000000000000000000e+02,9.999999999999990052e+01,1.000000000000000000e+02,9.999999999999997158e+01,9.999999999999988631e+01,9.999999999999994316e+01,-1.000000000000000000e+02
1.000000000000000000e+02,1.000000000000000000e+02,1.000000000000000000e+02,1.000000000000000000e+02,1.000000000000000000e+02,1.000000000000000000e+02,1.000000000000000000e+02,1.000000000000000000e+02,1.000000000000000000e+02,1.000000000000000000e+02,1.000000000000000000e+02,1.000000000000000000e+02,1.000000000000000000e+02,1.000000000000000000e+02,1.000000000000000000e+02,1.000000000000000000e+02,1.000000000000000000e+02,9.999999999999990052e+01,1.000000000000000000e+02,1.000000000000000000e+02,1.000000000000000000e+02,9.999999999999988631e+01,1.000000000000000000e+02,9.999999999999988631e+01,1.000000000000000000e+02,1.000000000000000000e+02,9.999999999999992895e+01,1.000000000000000000e+02,9.999999999999991473e+01,-9.999999999999988631e+01
9.999999999999995737e+01,1.000000000000000000e+02,1.000000000000000000e+02,1.000000000000000000e+02,1.000000000000000000e+02,1.000000000000000000e+02,1.000000000000000000e+02,1.000000000000000000e+02,9.999999999999992895e+01,9.999999999999998579e+01,1.000000000000000000e+02,1.000000000000000000e+02,1.000000000000000000e+02,9.999999999999998579e+01,1.000000000000000000e+02,1.000000000000000000e+02,1.000000000000000000e+02,1.000000000000000000e+02,1.000000000000000000e+02,1.000000000000000000e+02,9.999999999999991473e+01,1.000000000000000000e+02,9.999999999999994316e+01,9.999999999999987210e+01,9.999999999999995737e+01,1.000000000000000000e+02,9.999999999999998579e+01,9.999999999999995737e+01,9.999999999999998579e+01,1.000000000000000000e+02
1.000000000000000000e+02,1.000000000000000000e+02,1.000000000000000000e+02,1.000000000000000000e+02,1.000000000000000000e+02,1.000000000000000000e+02,1.000000000000000000e+02,1.000000000000000000e+02,9.999999999999992895e+01,1.000000000000000000e+02,1.000000000000000000e+02,9.999999999999998579e+01,1.000000000000000000e+02,1.000000000000000000e+02,1.000000000000000000e+02,1.000000000000000000e+02,9.999999999999998579e+01,1.000000000000000000e+02,9.999999999999988631e+01,1.000000000000000000e+02,9.999999999999997158e+01,9.999999999999987210e+01,1.000000000000000000e+02,1.000000000000000000e+02,1.000000000000000000e+02,9.999999999999985789e+01,1.000000000000000000e+02,1.000000000000000000e+02,1.000000000000000000e+02,1.000000000000000000e+02
1.000000000000000000e+02,1.000000000000000000e+02,1.000000000000000000e+02,1.000000000000000000e+02,1.000000000000000000e+02,1.000000000000000000e+02,1.000000000000000000e+02,1.000000000000000000e+02,9.999999999999994316e+01,1.000000000000000000e+02,1.000000000000000000e+02,1.000000000000000000e+02,1.000000000000000000e+02,1.000000000000000000e+02,1.000000000000000000e+02,1.000000000000000000e+02,9.999999999999998579e+01,1.000000000000000000e+02,1.000000000000000000e+02,9.999999999999995737e+01,1.000000000000000000e+02,1.000000000000000000e+02,1.000000000000000000e+02,1.000000000000000000e+02,9.999999999999985789e+01,1.000000000000000000e+02,1.000000000000000000e+02,1.000000000000000000e+02,9.999999999999990052e+01,-1.000000000000000000e+02
9.999999999999998579e+01,1.000000000000000000e+02,1.000000000000000000e+02,1.000000000000000000e+02,1.000000000000000000e+02,1.000000000000000000e+02,1.000000000000000000e+02,1.000000000000000000e+02,1.000000000000000000e+02,1.000000000000000000e+02,1.000000000000000000e+02,9.999999999999995737e+01,1.000000000000000000e+02,1.000000000000000000e+02,1.000000000000000000e+02,1.000000000000000000e+02,9.999999999999997158e+01,9.999999999999992895e+01,1.000000000000000000e+02,1.000000000000000000e+02,1.000000000000000000e+02,1.000000000000000000e+02,1.000000000000000000e+02,1.000000000000000000e+02,1.000000000000000000e+02,1.000000000000000000e+02,1.000000000000000000e+02,1.000000000000000000e+02,9.999999999999987210e+01,1.000000000000000000e+02
1.000000000000000000e+02,1.000000000000000000e+02,1.000000000000000000e+02,1.000000000000000000e+02,1.000000000000000000e+02,1.000000000000000000e+02,1.000000000000000000e+02,1.000000000000000000e+02,1.000000000000000000e+02,1.000000000000000000e+02,1.000000000000000000e+02,1.000000000000000000e+02,1.000000000000000000e+02,1.000000000000000000e+02,1.000000000000000000e+02,1.000000000000000000e+02,1.000000000000000000e+02,1.000000000000000000e+02,1.000000000000000000e+02,1.000000000000000000e+02,1.000000000000000000e+02,9.999999999999998579e+01,1.000000000000000000e+02,1.000000000000000000e+02,9.999999999999985789e+01,1.000000000000000000e+02,1.000000000000000000e+02,1.000000000000000000e+02,1.000000000000000000e+02,-9.999999999999955946e+01
1.000000000000000000e+02,1.000000000000000000e+02,1.000000000000000000e+02,1.000000000000000000e+02,1.000000000000000000e+02,1.000000000000000000e+02,1.000000000000000000e+02,9.999999999999995737e+01,1.000000000000000000e+02,1.000000000000000000e+02,9.999999999999998579e+01,1.000000000000000000e+02,1.000000000000000000e+02,1.000000000000000000e+02,1.000000000000000000e+02,1.000000000000000000e+02,9.999999999999987210e+01,1.000000000000000000e+02,1.000000000000000000e+02,1.000000000000000000e+02,1.000000000000000000e+02,9.999999999999995737e+01,9.999999999999985789e+01,1.000000000000000000e+02,1.000000000000000000e+02,1.000000000000000000e+02,9.999999999999995737e+01,1.000000000000000000e+02,9.999999999999987210e+01,-1.000000000000000000e+02
1.000000000000000000e+02,1.000000000000000000e+02,1.000000000000000000e+02,1.000000000000000000e+02,1.000000000000000000e+02,9.999999999999995737e+01,1.000000000000000000e+02,1.000000000000000000e+02,1.000000000000000000e+02,9.999999999999992895e+01,1.000000000000000000e+02,9.999999999999997158e+01,9.999999999999997158e+01,1.000000000000000000e+02,1.000000000000000000e+02,1.000000000000000000e+02,9.999999999999998579e+01,9.999999999999995737e+01,1.000000000000000000e+02,1.000000000000000000e+02,1.000000000000000000e+02,1.000000000000000000e+02,9.999999999999990052e+01,9.999999999999990052e+01,9.999999999999992895e+01,9.999999999999988631e+01,9.999999999999990052e+01,9.999999999999995737e+01,1.000000000000000000e+02,9.999999999999995737e+01
1.000000000000000000e+02,1.000000000000000000e+02,1.000000000000000000e+02,1.000000000000000000e+02,1.000000000000000000e+02,1.000000000000000000e+02,1.000000000000000000e+02,1.000000000000000000e+02,1.000000000000000000e+02,1.000000000000000000e+02,1.000000000000000000e+02,9.999999999999991473e+01,1.000000000000000000e+02,1.000000000000000000e+02,1.000000000000000000e+02,1.000000000000000000e+02,9.999999999999994316e+01,1.000000000000000000e+02,1.000000000000000000e+02,1.000000000000000000e+02,1.000000000000000000e+02,1.000000000000000000e+02,1.000000000000000000e+02,9.999999999999994316e+01,1.000000000000000000e+02,1.000000000000000000e+02,1.000000000000000000e+02,1.000000000000000000e+02,1.000000000000000000e+02,-1.000000000000000000e+02
1.000000000000000000e+02,1.000000000000000000e+02,1.000000000000000000e+02,1.000000000000000000e+02,1.000000000000000000e+02,1.000000000000000000e+02,1.000000000000000000e+02,1.000000000000000000e+02,1.000000000000000000e+02,1.000000000000000000e+02,1.000000000000000000e+02,9.999999999999991473e+01,1.000000000000000000e+02,1.000000000000000000e+02,1.000000000000000000e+02,1.000000000000000000e+02,1.000000000000000000e+02,1.000000000000000000e+02,9.999999999999995737e+01,1.000000000000000000e+02,9.999999999999995737e+01,9.999999999999997158e+01,1.000000000000000000e+02,1.000000000000000000e+02,9.999999999999994316e+01,1.000000000000000000e+02,9.999999999999990052e+01,1.000000000000000000e+02,1.000000000000000000e+02,-1.000000000000000000e+02
