1.000000000000000000e+02,-9.999999999999997158e+01,5.174094729344169963e+01,1.000000000000000000e+02,-1.000000000000000000e+02,1.000000000000000000e+02,-1.000000000000000000e+02,1.000000000000000000e+02,-1.000000000000000000e+02,1.000000000000000000e+02,-1.000000000000000000e+02,1.000000000000000000e+02,-1.000000000000000000e+02,1.000000000000000000e+02,-1.000000000000000000e+02,5.174094862138822037e+01,1.000000000000000000e+02,-1.000000000000000000e+02,1.000000000000000000e+02,-1.000000000000000000e+02,9.999999999999991473e+01,-1.000000000000000000e+02,9.999999999999997158e+01,-1.000000000000000000e+02,5.174094874220705265e+01,1.000000000000000000e+02,-1.000000000000000000e+02,1.000000000000000000e+02,-1.000000000000000000e+02,9.999999999999978684e+01
1.000000000000000000e+02,-1.000000000000000000e+02,1.000000000000000000e+02,-1.000000000000000000e+02,1.000000000000000000e+02,-1.000000000000000000e+02,1.000000000000000000e+02,-9.999999999999995737e+01,1.000000000000000000e+02,-1.000000000000000000e+02,1.000000000000000000e+02,-1.000000000000000000e+02,1.000000000000000000e+02,-1.000000000000000000e+02,1.000000000000000000e+02,-1.000000000000000000e+02,1.000000000000000000e+02,-1.000000000000000000e+02,1.000000000000000000e+02,-1.000000000000000000e+02,9.999999999999994316e+01,-1.000000000000000000e+02,1.000000000000000000e+02,-1.000000000000000000e+02,1.000000000000000000e+02,-1.000000000000000000e+02,9.999999999999995737e+01,-1.000000000000000000e+02,9.999999999999998579e+01,-1.000000000000000000e+02
1.000000000000000000e+02,-1.000000000000000000e+02,1.000000000000000000e+02,-4.338259299729390506e+01,-1.000000000000000000e+02,1.000000000000000000e+02,-1.000000000000000000e+02,1.000000000000000000e+02,-1.000000000000000000e+02,1.000000000000000000e+02,-1.000000000000000000e+02,9.999999999999998579e+01,-1.000000000000000000e+02,9.999999999999994316e+01,-1.000000000000000000e+02,1.000000000000000000e+02,-1.000000000000000000e+02,1.000000000000000000e+02,-9.999999999999998579e+01,1.000000000000000000e+02,-1.000000000000000000e+02,5.174094744555318215e+01,1.000000000000000000e+02,-9.999999999999998579e+01,1.000000000000000000e+02,-1.000000000000000000e+02,1.000000000000000000e+02,-1.000000000000000000e+02,9.999999999999998579e+01,-1.000000000000000000e+02
9.999999999999997158e+01,-1.000000000000000000e+02,1.000000000000000000e+02,-1.000000000000000000e+02,1.000000000000000000e+02,-1.000000000000000000e+02,1.000000000000000000e+02,-1.000000000000000000e+02,9.999999999999994316e+01,-1.000000000000000000e+02,9.999999999999997158e+01,-1.000000000000000000e+02,1.000000000000000000e+02,-1.000000000000000000e+02,1.000000000000000000e+02,-1.000000000000000000e+02,9.999999999999997158e+01,-4.338259422008788846e+01,-9.999999999999998579e+01,9.999999999999991473e+01,-9.999999999999998579e+01,1.000000000000000000e+02,-1.000000000000000000e+02,9.999999999999997158e+01,-1.000000000000000000e+02,1.000000000000000000e+02,-1.000000000000000000e+02,9.999999999999998579e+01,-1.000000000000000000e+02,1.000000000000000000e+02
1.000000000000000000e+02,-1.000000000000000000e+02,9.999999999999997158e+01,-1.000000000000000000e+02,1.000000000000000000e+02,-1.000000000000000000e+02,1.000000000000000000e+02,-4.338259095458214887e+01,-1.000000000000000000e+02,1.000000000000000000e+02,-1.000000000000000000e+02,9.999999999999994316e+01,-1.000000000000000000e+02,1.000000000000000000e+02,-1.000000000000000000e+02,1.000000000000000000e+02,-9.999999999999998579e+01,5.174094755388148315e+01,1.000000000000000000e+02,-1.000000000000000000e+02,1.000000000000000000e+02,-9.999999999999998579e+01,9.999999999999995737e+01,-9.999999999999997158e+01,1.000000000000000000e+02,-9.999999999999992895e+01,9.999999999999997158e+01,-1.000000000000000000e+02,1.000000000000000000e+02,-9.999999999999991473e+01
1.000000000000000000e+02,-1.000000000000000000e+02,1.000000000000000000e+02,-1.000000000000000000e+02,9.999999999999997158e+01,-1.000000000000000000e+02,1.000000000000000000e+02,-1.000000000000000000e+02,9.999999999999997158e+01,-9.999999999999998579e+01,1.000000000000000000e+02,-9.999999999999995737e+01,1.000000000000000000e+02,-9.999999999999997158e+01,1.000000000000000000e+02,-1.000000000000000000e+02,9.999999999999991473e+01,-9.999999999999998579e+01,1.000000000000000000e+02,-4.338259200566058382e+01,-9.999999999999995737e+01,9.999999999999991473e+01,-1.000000000000000000e+02,1.000000000000000000e+02,-9.999999999999997158e+01,1.000000000000000000e+02,-1.000000000000000000e+02,9.999999999999997158e+01,-1.000000000000000000e+02,9.999999999999987210e+01
-1.000000000000000000e+02,1.000000000000000000e+02,-1.000000000000000000e+02,1.000000000000000000e+02,-9.999999999999992895e+01,5.174094782763878442e+01,9.999999999999998579e+01,-1.000000000000000000e+02,9.999999999999997158e+01,-1.000000000000000000e+02,1.000000000000000000e+02,-1.000000000000000000e+02,1.000000000000000000e+02,-1.000000000000000000e+02,1.000000000000000000e+02,-1.000000000000000000e+02,1.000000000000000000e+02,-1.000000000000000000e+02,1.000000000000000000e+02,-9.999999999999998579e+01,9.999999999999991473e+01,-9.999999999999997158e+01,1.000000000000000000e+02,-1.000000000000000000e+02,9.999999999999998579e+01,-9.999999999999998579e+01,1.000000000000000000e+02,-1.000000000000000000e+02,1.000000000000000000e+02,-9.999999999999985789e+01
1.000000000000000000e+02,-1.000000000000000000e+02,5.174094893974913845e+01,1.000000000000000000e+02,-1.000000000000000000e+02,5.174094658436743543e+01,1.000000000000000000e+02,-1.000000000000000000e+02,1.000000000000000000e+02,-1.000000000000000000e+02,1.000000000000000000e+02,-1.000000000000000000e+02,1.000000000000000000e+02,-1.000000000000000000e+02,1.000000000000000000e+02,-4.338259258594935375e+01,-1.000000000000000000e+02,1.000000000000000000e+02,-9.999999999999997158e+01,1.000000000000000000e+02,-1.000000000000000000e+02,9.999999999999998579e+01,-1.000000000000000000e+02,1.000000000000000000e+02,-1.000000000000000000e+02,1.000000000000000000e+02,-1.000000000000000000e+02,9.999999999999991473e+01,-1.000000000000000000e+02,9.999999999999984368e+01
-9.999999999999992895e+01,1.000000000000000000e+02,-1.000000000000000000e+02,9.999999999999998579e+01,-1.000000000000000000e+02,9.999999999999998579e+01,-1.000000000000000000e+02,1.000000000000000000e+02,-1.000000000000000000e+02,9.999999999999997158e+01,-9.999999999999997158e+01,9.999999999999997158e+01,-4.338259480994609874e+01,-9.999999999999998579e+01,1.000000000000000000e+02,-9.999999999999995737e+01,1.000000000000000000e+02,-1.000000000000000000e+02,1.000000000000000000e+02,-1.000000000000000000e+02,1.000000000000000000e+02,-9.999999999999998579e+01,9.999999999999994316e+01,-9.999999999999997158e+01,9.999999999999998579e+01,-4.338259208912607789e+01,-9.999999999999995737e+01,9.999999999999991473e+01,-9.999999999999998579e+01,9.999999999999995737e+01
-9.999999999999998579e+01,1.000000000000000000e+02,-1.000000000000000000e+02,1.000000000000000000e+02,-9.999999999999998579e+01,1.000000000000000000e+02,-9.999999999999994316e+01,1.000000000000000000e+02,-1.000000000000000000e+02,9.999999999999997158e+01,-1.000000000000000000e+02,9.999999999999998579e+01,-9.999999999999997158e+01,9.999999999999997158e+01,-4.338259542995278650e+01,-9.999999999999997158e+01,1.000000000000000000e+02,-1.000000000000000000e+02,1.000000000000000000e+02,-9.999999999999995737e+01,9.999999999999992895e+01,-9.999999999999992895e+01,1.000000000000000000e+02,-9.999999999999998579e+01,5.174094784104990907e+01,9.999999999999995737e+01,-1.000000000000000000e+02,9.999999999999991473e+01,-9.999999999999997158e+01,9.999999999999992895e+01
1.000000000000000000e+02,-1.000000000000000000e+02,9.999999999999998579e+01,-1.000000000000000000e+02,1.000000000000000000e+02,-1.000000000000000000e+02,9.999999999999997158e+01,-9.999999999999998579e+01,9.999999999999997158e+01,-9.999999999999997158e+01,1.000000000000000000e+02,-9.999999999999998579e+01,1.000000000000000000e+02,-9.999999999999998579e+01,9.999999999999997158e+01,-9.999999999999992895e+01,9.999999999999998579e+01,-9.999999999999997158e+01,9.999999999999998579e+01,-4.338259185542173668e+01,-9.999999999999994316e+01,1.000000000000000000e+02,-1.000000000000000000e+02,9.999999999999998579e+01,-1.000000000000000000e+02,9.999999999999998579e+01,-9.999999999999998579e+01,9.999999999999991473e+01,-9.999999999999995737e+01,9.999999999999997158e+01
-1.000000000000000000e+02,1.000000000000000000e+02,-1.000000000000000000e+02,1.000000000000000000e+02,-4.338259372996609642e+01,-1.000000000000000000e+02,1.000000000000000000e+02,-1.000000000000000000e+02,9.999999999999997158e+01,-1.000000000000000000e+02,1.000000000000000000e+02,-1.000000000000000000e+02,1.000000000000000000e+02,-4.338258900004876040e+01,-1.000000000000000000e+02,1.000000000000000000e+02,-1.000000000000000000e+02,1.000000000000000000e+02,-1.000000000000000000e+02,5.174094988955020114e+01,1.000000000000000000e+02,-1.000000000000000000e+02,9.999999999999997158e+01,-1.000000000000000000e+02,5.174094693637373155e+01,9.999999999999998579e+01,-1.000000000000000000e+02,9.999999999999998579e+01,-9.999999999999997158e+01,9.999999999999987210e+01
-1.000000000000000000e+02,9.999999999999998579e+01,-1.000000000000000000e+02,1.000000000000000000e+02,-1.000000000000000000e+02,1.000000000000000000e+02,-9.999999999999995737e+01,1.000000000000000000e+02,-9.999999999999997158e+01,1.000000000000000000e+02,-1.000000000000000000e+02,1.000000000000000000e+02,-4.338259197477155027e+01,-1.000000000000000000e+02,1.000000000000000000e+02,-1.000000000000000000e+02,1.000000000000000000e+02,-4.338259340429935662e+01,-1.000000000000000000e+02,1.000000000000000000e+02,-1.000000000000000000e+02,5.174094843015419798e+01,9.999999999999991473e+01,-9.999999999999997158e+01,1.000000000000000000e+02,-9.999999999999991473e+01,1.000000000000000000e+02,-9.999999999999997158e+01,1.000000000000000000e+02,-1.000000000000000000e+02
1.000000000000000000e+02,-1.000000000000000000e+02,1.000000000000000000e+02,-1.000000000000000000e+02,1.000000000000000000e+02,-1.000000000000000000e+02,1.000000000000000000e+02,-4.338259101548663210e+01,-9.999999999999994316e+01,1.000000000000000000e+02,-9.999999999999997158e+01,1.000000000000000000e+02,-1.000000000000000000e+02,1.000000000000000000e+02,-9.999999999999997158e+01,5.174094874452247694e+01,9.999999999999997158e+01,-1.000000000000000000e+02,1.000000000000000000e+02,-1.000000000000000000e+02,9.999999999999992895e+01,-1.000000000000000000e+02,1.000000000000000000e+02,-9.999999999999995737e+01,9.999999999999994316e+01,-1.000000000000000000e+02,5.174094771344346810e+01,9.999999999999998579e+01,-1.000000000000000000e+02,9.999999999999982947e+01
1.000000000000000000e+02,-1.000000000000000000e+02,1.000000000000000000e+02,-1.000000000000000000e+02,1.000000000000000000e+02,-1.000000000000000000e+02,5.174094891585526312e+01,1.000000000000000000e+02,-1.000000000000000000e+02,1.000000000000000000e+02,-1.000000000000000000e+02,1.000000000000000000e+02,-1.000000000000000000e+02,1.000000000000000000e+02,-1.000000000000000000e+02,1.000000000000000000e+02,-1.000000000000000000e+02,1.000000000000000000e+02,-1.000000000000000000e+02,9.999999999999994316e+01,-1.000000000000000000e+02,9.999999999999998579e+01,-1.000000000000000000e+02,1.000000000000000000e+02,-1.000000000000000000e+02,1.000000000000000000e+02,-1.000000000000000000e+02,1.000000000000000000e+02,-1.000000000000000000e+02,9.999999999999977263e+01
1.000000000000000000e+02,-1.000000000000000000e+02,9.999999999999997158e+01,-1.000000000000000000e+02,1.000000000000000000e+02,-1.000000000000000000e+02,1.000000000000000000e+02,-1.000000000000000000e+02,1.000000000000000000e+02,-9.999999999999995737e+01,1.000000000000000000e+02,-9.999999999999998579e+01,1.000000000000000000e+02,-1.000000000000000000e+02,9.999999999999998579e+01,-1.000000000000000000e+02,5.174094870465531670e+01,1.000000000000000000e+02,-1.000000000000000000e+02,9.999999999999994316e+01,-1.000000000000000000e+02,9.999999999999991473e+01,-1.000000000000000000e+02,5.174094807451025702e+01,9.999999999999994316e+01,-1.000000000000000000e+02,1.000000000000000000e+02,-9.999999999999995737e+01,9.999999999999991473e+01,-9.999999999999995737e+01
9.999999999999997158e+01,-1.000000000000000000e+02,1.000000000000000000e+02,-1.000000000000000000e+02,1.000000000000000000e+02,-1.000000000000000000e+02,1.000000000000000000e+02,-1.000000000000000000e+02,9.999999999999994316e+01,-1.000000000000000000e+02,1.000000000000000000e+02,-4.338258988544847483e+01,-1.000000000000000000e+02,1.000000000000000000e+02,-1.000000000000000000e+02,1.000000000000000000e+02,-1.000000000000000000e+02,1.000000000000000000e+02,-1.000000000000000000e+02,1.000000000000000000e+02,-1.000000000000000000e+02,1.000000000000000000e+02,-1.000000000000000000e+02,1.000000000000000000e+02,-1.000000000000000000e+02,1.000000000000000000e+02,-1.000000000000000000e+02,1.000000000000000000e+02,-1.000000000000000000e+02,1.000000000000000000e+02
9.999999999999997158e+01,-1.000000000000000000e+02,1.000000000000000000e+02,-1.000000000000000000e+02,1.000000000000000000e+02,-4.338258991383059993e+01,-1.000000000000000000e+02,1.000000000000000000e+02,-4.338259176778818471e+01,-1.000000000000000000e+02,1.000000000000000000e+02,-1.000000000000000000e+02,1.000000000000000000e+02,-4.338259187596679567e+01,-1.000000000000000000e+02,9.999999999999997158e+01,-1.000000000000000000e+02,9.999999999999995737e+01,-9.999999999999997158e+01,1.000000000000000000e+02,-9.999999999999997158e+01,1.000000000000000000e+02,-9.999999999999997158e+01,9.999999999999998579e+01,-1.000000000000000000e+02,1.000000000000000000e+02,-9.999999999999995737e+01,1.000000000000000000e+02,-9.999999999999997158e+01,1.000000000000000000e+02
1.000000000000000000e+02,-1.000000000000000000e+02,9.999999999999997158e+01,-1.000000000000000000e+02,5.174094571888002747e+01,9.999999999999997158e+01,-1.000000000000000000e+02,1.000000000000000000e+02,-1.000000000000000000e+02,5.174094761028822376e+01,9.999999999999994316e+01,-1.000000000000000000e+02,9.999999999999998579e+01,-9.999999999999997158e+01,1.000000000000000000e+02,-1.000000000000000000e+02,9.999999999999998579e+01,-1.000000000000000000e+02,9.999999999999994316e+01,-9.999999999999994316e+01,1.000000000000000000e+02,-9.999999999999997158e+01,9.999999999999998579e+01,-4.338259213778274415e+01,-1.000000000000000000e+02,1.000000000000000000e+02,-1.000000000000000000e+02,1.000000000000000000e+02,-1.000000000000000000e+02,9.999999999999984368e+01
1.000000000000000000e+02,-9.999999999999998579e+01,1.000000000000000000e+02,-1.000000000000000000e+02,9.999999999999998579e+01,-4.338259249444568866e+01,-9.999999999999995737e+01,1.000000000000000000e+02,-1.000000000000000000e+02,1.000000000000000000e+02,-1.000000000000000000e+02,1.000000000000000000e+02,-1.000000000000000000e+02,9.999999999999997158e+01,-1.000000000000000000e+02,1.000000000000000000e+02,-1.000000000000000000e+02,9.999999999999991473e+01,-9.999999999999998579e+01,5.174094891680219632e+01,9.999999999999994316e+01,-1.000000000000000000e+02,5.174094953907560779e+01,1.000000000000000000e+02,-9.999999999999992895e+01,1.000000000000000000e+02,-9.999999999999992895e+01,1.000000000000000000e+02,-1.000000000000000000e+02,9.999999999999988631e+01
-1.000000000000000000e+02,1.000000000000000000e+02,-1.000000000000000000e+02,1.000000000000000000e+02,-1.000000000000000000e+02,9.999999999999998579e+01,-1.000000000000000000e+02,9.999999999999995737e+01,-9.999999999999998579e+01,1.000000000000000000e+02,-9.999999999999998579e+01,9.999999999999995737e+01,-4.338259309427327537e+01,-1.000000000000000000e+02,9.999999999999994316e+01,-1.000000000000000000e+02,5.174094653031466606e+01,9.999999999999997158e+01,-1.000000000000000000e+02,9.999999999999991473e+01,-9.999999999999997158e+01,1.000000000000000000e+02,-9.999999999999995737e+01,9.999999999999995737e+01,-1.000000000000000000e+02,1.000000000000000000e+02,-1.000000000000000000e+02,1.000000000000000000e+02,-1.000000000000000000e+02,9.999999999999995737e+01
-1.000000000000000000e+02,1.000000000000000000e+02,-1.000000000000000000e+02,1.000000000000000000e+02,-1.000000000000000000e+02,1.000000000000000000e+02,-1.000000000000000000e+02,1.000000000000000000e+02,-4.338259202590102603e+01,-1.000000000000000000e+02,1.000000000000000000e+02,-1.000000000000000000e+02,1.000000000000000000e+02,-1.000000000000000000e+02,1.000000000000000000e+02,-1.000000000000000000e+02,5.174094977413569296e+01,1.000000000000000000e+02,-1.000000000000000000e+02,9.999999999999995737e+01,-1.000000000000000000e+02,1.000000000000000000e+02,-1.000000000000000000e+02,1.000000000000000000e+02,-1.000000000000000000e+02,1.000000000000000000e+02,-1.000000000000000000e+02,1.000000000000000000e+02,-1.000000000000000000e+02,9.999999999999995737e+01
9.999999999999990052e+01,-1.000000000000000000e+02,1.000000000000000000e+02,-1.000000000000000000e+02,9.999999999999995737e+01,-1.000000000000000000e+02,9.999999999999997158e+01,-9.999999999999995737e+01,9.999999999999998579e+01,-9.999999999999997158e+01,9.999999999999998579e+01,-1.000000000000000000e+02,1.000000000000000000e+02,-9.999999999999997158e+01,1.000000000000000000e+02,-1.000000000000000000e+02,9.999999999999992895e+01,-9.999999999999994316e+01,1.000000000000000000e+02,-9.999999999999992895e+01,1.000000000000000000e+02,-1.000000000000000000e+02,9.999999999999995737e+01,-1.000000000000000000e+02,5.174094847389184793e+01,9.999999999999998579e+01,-9.999999999999995737e+01,9.999999999999994316e+01,-9.999999999999997158e+01,9.999999999999994316e+01
1.000000000000000000e+02,-1.000000000000000000e+02,1.000000000000000000e+02,-1.000000000000000000e+02,9.999999999999998579e+01,-1.000000000000000000e+02,1.000000000000000000e+02,-1.000000000000000000e+02,9.999999999999998579e+01,-9.999999999999997158e+01,9.999999999999995737e+01,-4.338258900199616619e+01,-9.999999999999995737e+01,1.000000000000000000e+02,-1.000000000000000000e+02,5.174094817718990669e+01,1.000000000000000000e+02,-1.000000000000000000e+02,1.000000000000000000e+02,-9.999999999999997158e+01,9.999999999999998579e+01,-4.338259172002133113e+01,-1.000000000000000000e+02,9.999999999999991473e+01,-1.000000000000000000e+02,9.999999999999998579e+01,-1.000000000000000000e+02,1.000000000000000000e+02,-1.000000000000000000e+02,9.999999999999998579e+01
-1.000000000000000000e+02,1.000000000000000000e+02,-1.000000000000000000e+02,1.000000000000000000e+02,-1.000000000000000000e+02,1.000000000000000000e+02,-1.000000000000000000e+02,9.999999999999998579e+01,-1.000000000000000000e+02,1.000000000000000000e+02,-1.000000000000000000e+02,1.000000000000000000e+02,-1.000000000000000000e+02,9.999999999999998579e+01,-1.000000000000000000e+02,1.000000000000000000e+02,-1.000000000000000000e+02,1.000000000000000000e+02,-4.338259088340434033e+01,-1.000000000000000000e+02,9.999999999999990052e+01,-1.000000000000000000e+02,9.999999999999995737e+01,-1.000000000000000000e+02,1.000000000000000000e+02,-9.999999999999994316e+01,9.999999999999997158e+01,-1.000000000000000000e+02,1.000000000000000000e+02,-1.000000000000000000e+02
1.000000000000000000e+02,-1.000000000000000000e+02,1.000000000000000000e+02,-1.000000000000000000e+02,9.999999999999997158e+01,-1.000000000000000000e+02,1.000000000000000000e+02,-1.000000000000000000e+02,1.000000000000000000e+02,-1.000000000000000000e+02,9.999999999999994316e+01,-1.000000000000000000e+02,1.000000000000000000e+02,-1.000000000000000000e+02,1.000000000000000000e+02,-1.000000000000000000e+02,1.000000000000000000e+02,-1.000000000000000000e+02,1.000000000000000000e+02,-1.000000000000000000e+02,1.000000000000000000e+02,-1.000000000000000000e+02,1.000000000000000000e+02,-1.000000000000000000e+02,9.999999999999994316e+01,-1.000000000000000000e+02,1.000000000000000000e+02,-1.000000000000000000e+02,1.000000000000000000e+02,-1.000000000000000000e+02
1.000000000000000000e+02,-1.000000000000000000e+02,1.000000000000000000e+02,-1.000000000000000000e+02,5.174094961857593944e+01,1.000000000000000000e+02,-1.000000000000000000e+02,1.000000000000000000e+02,-1.000000000000000000e+02,1.000000000000000000e+02,-1.000000000000000000e+02,5.174094497595144304e+01,1.000000000000000000e+02,-1.000000000000000000e+02,1.000000000000000000e+02,-1.000000000000000000e+02,1.000000000000000000e+02,-1.000000000000000000e+02,1.000000000000000000e+02,-1.000000000000000000e+02,1.000000000000000000e+02,-1.000000000000000000e+02,1.000000000000000000e+02,-1.000000000000000000e+02,1.000000000000000000e+02,-9.999999999999997158e+01,1.000000000000000000e+02,-1.000000000000000000e+02,1.000000000000000000e+02,-9.999999999999981526e+01
-1.000000000000000000e+02,1.000000000000000000e+02,-1.000000000000000000e+02,1.000000000000000000e+02,-1.000000000000000000e+02,1.000000000000000000e+02,-1.000000000000000000e+02,9.999999999999995737e+01,-1.000000000000000000e+02,1.000000000000000000e+02,-4.338259100795816181e+01,-1.000000000000000000e+02,1.000000000000000000e+02,-1.000000000000000000e+02,9.999999999999998579e+01,-1.000000000000000000e+02,5.174094761367618389e+01,1.000000000000000000e+02,-1.000000000000000000e+02,1.000000000000000000e+02,-1.000000000000000000e+02,9.999999999999992895e+01,-9.999999999999995737e+01,5.174094807342351743e+01,1.000000000000000000e+02,-9.999999999999997158e+01,9.999999999999994316e+01,-1.000000000000000000e+02,9.999999999999998579e+01,-9.999999999999982947e+01
1.000000000000000000e+02,-9.999999999999998579e+01,1.000000000000000000e+02,-9.999999999999997158e+01,1.000000000000000000e+02,-1.000000000000000000e+02,1.000000000000000000e+02,-9.999999999999998579e+01,5.174094894997122651e+01,9.999999999999998579e+01,-9.999999999999998579e+01,1.000000000000000000e+02,-1.000000000000000000e+02,1.000000000000000000e+02,-9.999999999999998579e+01,5.174094741638205619e+01,1.000000000000000000e+02,-1.000000000000000000e+02,1.000000000000000000e+02,-9.999999999999997158e+01,9.999999999999991473e+01,-1.000000000000000000e+02,9.999999999999995737e+01,-9.999999999999998579e+01,5.174094796750632241e+01,9.999999999999995737e+01,-9.999999999999995737e+01,1.000000000000000000e+02,-1.000000000000000000e+02,1.000000000000000000e+02
9.999999999999997158e+01,-1.000000000000000000e+02,1.000000000000000000e+02,-1.000000000000000000e+02,5.174094856081864435e+01,1.000000000000000000e+02,-9.999999999999997158e+01,5.174094750611968152e+01,1.000000000000000000e+02,-1.000000000000000000e+02,1.000000000000000000e+02,-1.000000000000000000e+02,9.999999999999995737e+01,-1.000000000000000000e+02,9.999999999999994316e+01,-1.000000000000000000e+02,9.999999999999997158e+01,-9.999999999999997158e+01,1.000000000000000000e+02,-1.000000000000000000e+02,9.999999999999998579e+01,-1.000000000000000000e+02,9.999999999999991473e+01,-9.999999999999997158e+01,1.000000000000000000e+02,-4.338259146700926294e+01,-1.000000000000000000e+02,1.000000000000000000e+02,-1.000000000000000000e+02,1.000000000000000000e+02
