-8.168140764697243128e+01,-1.000000000000000000e+02,-1.000000000000000000e+02,-1.000000000000000000e+02,-1.000000000000000000e+02,-1.000000000000000000e+02,-1.000000000000000000e+02,-1.000000000000000000e+02,-1.000000000000000000e+02,-9.999999999999991473e+01
-9.110618721483056959e+01,-9.999999999999997158e+01,-9.999999999999982947e+01,-1.000000000000000000e+02,-9.999999999999998579e+01,-9.999999999999992895e+01,-9.999999999999984368e+01,-9.999999999999990052e+01,-1.000000000000000000e+02,-9.999999999999988631e+01
4.084070378569886373e+01,-1.000000000000000000e+02,-1.000000000000000000e+02,-1.000000000000000000e+02,-9.999999999999990052e+01,-1.000000000000000000e+02,-1.000000000000000000e+02,-1.000000000000000000e+02,-1.000000000000000000e+02,-1.000000000000000000e+02
-6.911502972492877461e+01,-1.000000000000000000e+02,-1.000000000000000000e+02,-1.000000000000000000e+02,-1.000000000000000000e+02,-1.000000000000000000e+02,-9.999999999999991473e+01,-9.999999999999990052e+01,-1.000000000000000000e+02,-1.000000000000000000e+02
-3.141592892972059570e+00,-9.999999999999981526e+01,-9.999999999999988631e+01,-9.999999999999990052e+01,-9.999999999999997158e+01,-1.000000000000000000e+02,-9.999999999999998579e+01,-1.000000000000000000e+02,-9.999999999999998579e+01,-9.999999999999994316e+01
-1.256636805002887058e+01,-9.999999999999991473e+01,-1.000000000000000000e+02,-9.999999999999994316e+01,-1.000000000000000000e+02,-1.000000000000000000e+02,-1.000000000000000000e+02,-9.999999999999991473e+01,-1.000000000000000000e+02,-9.999999999999991473e+01
7.539822404678518808e+01,-1.000000000000000000e+02,-9.999999999999987210e+01,-9.999999999999995737e+01,-1.000000000000000000e+02,-1.000000000000000000e+02,-9.999999999999995737e+01,-1.000000000000000000e+02,-1.000000000000000000e+02,-9.999999999999997158e+01
7.225663085910504435e+01,-9.999999999999228351e+01,-9.999999999999982947e+01,-9.999999999999975842e+01,-9.999999999999981526e+01,-9.999999999999961631e+01,-1.000000000000000000e+02,-9.999999999999992895e+01,-9.999999999999987210e+01,-9.999999999999995737e+01
7.539822421855804180e+01,-9.999999999999984368e+01,-9.999999999999997158e+01,-1.000000000000000000e+02,-9.999999999999992895e+01,-1.000000000000000000e+02,-9.999999999999994316e+01,-9.999999999999998579e+01,-9.999999999999988631e+01,-1.000000000000000000e+02
4.712388915364203257e+01,-1.000000000000000000e+02,-9.999999999999955946e+01,-9.999999999999995737e+01,-9.999999999999998579e+01,-9.999999999999991473e+01,-9.999999999999965894e+01,-9.999999999999997158e+01,-9.999999999999970157e+01,-9.999999999999994316e+01
7.225663269882110740e+01,-9.999999999999994316e+01,-9.999999999999955946e+01,-9.999999999999955946e+01,-9.999999999999971578e+01,-9.999999999999930367e+01,-9.999999999999698730e+01,-9.999999999999901945e+01,-9.999999999999822364e+01,-9.999999999999991473e+01
6.911503856236384991e+01,-1.000000000000000000e+02,-1.000000000000000000e+02,-9.999999999999990052e+01,-9.999999999999985789e+01,-1.000000000000000000e+02,-9.999999999999985789e+01,-9.999999999999994316e+01,-9.999999999999982947e+01,-9.999999999999970157e+01
5.654867093401755795e+01,-9.999999999999977263e+01,-9.999999999999991473e+01,-9.999999999999997158e+01,-1.000000000000000000e+02,-1.000000000000000000e+02,-1.000000000000000000e+02,-1.000000000000000000e+02,-9.999999999999988631e+01,-1.000000000000000000e+02
9.738937199250968035e+01,-1.000000000000000000e+02,-1.000000000000000000e+02,-9.999999999999992895e+01,-1.000000000000000000e+02,-1.000000000000000000e+02,-9.999999999999988631e+01,-1.000000000000000000e+02,-1.000000000000000000e+02,-9.999999999999988631e+01
5.654866793985077322e+01,-1.000000000000000000e+02,-1.000000000000000000e+02,-9.999999999999990052e+01,-1.000000000000000000e+02,-9.999999999999981526e+01,-9.999999999999998579e+01,-9.999999999999997158e+01,-1.000000000000000000e+02,-1.000000000000000000e+02
-4.712388941923239827e+01,-1.000000000000000000e+02,-1.000000000000000000e+02,-1.000000000000000000e+02,-1.000000000000000000e+02,-1.000000000000000000e+02,-9.999999999999988631e+01,-1.000000000000000000e+02,-1.000000000000000000e+02,-1.000000000000000000e+02
4.011235006373681244e-07,-9.999999999999988631e+01,-1.000000000000000000e+02,-1.000000000000000000e+02,-1.000000000000000000e+02,-9.999999999999988631e+01,-1.000000000000000000e+02,-1.000000000000000000e+02,-9.999999999999997158e+01,-9.999999999999975842e+01
3.141591077294961565e+00,-1.000000000000000000e+02,-1.000000000000000000e+02,-9.999999999999982947e+01,-9.999999999999994316e+01,-9.999999999999997158e+01,-9.999999999999991473e+01,-9.999999999999998579e+01,-9.999999999999998579e+01,-1.000000000000000000e+02
-4.084070368010922891e+01,-1.000000000000000000e+02,-1.000000000000000000e+02,-9.999999999999998579e+01,-1.000000000000000000e+02,-1.000000000000000000e+02,-9.999999999999982947e+01,-9.999999999999975842e+01,-9.999999999999978684e+01,-9.999999999999980105e+01
-5.654865973141300373e+01,-9.999999999999995737e+01,-1.000000000000000000e+02,-1.000000000000000000e+02,-1.000000000000000000e+02,-1.000000000000000000e+02,-1.000000000000000000e+02,-1.000000000000000000e+02,-9.999999999999990052e+01,-1.000000000000000000e+02
-1.884955723262028471e+01,-9.999999999999997158e+01,-1.000000000000000000e+02,-9.999999999999997158e+01,-9.999999999999994316e+01,-9.999999999999990052e+01,-9.999999999999977263e+01,-9.999999999999992895e+01,-1.000000000000000000e+02,-9.999999999999870681e+01
9.738937327037467639e+01,-1.000000000000000000e+02,-1.000000000000000000e+02,-9.999999999999997158e+01,-1.000000000000000000e+02,-1.000000000000000000e+02,-9.999999999999988631e+01,-1.000000000000000000e+02,-1.000000000000000000e+02,-1.000000000000000000e+02
-5.969026002452655177e+01,-1.000000000000000000e+02,-9.999999999999906208e+01,-1.000000000000000000e+02,-9.999999999999994316e+01,-9.999999999999991473e+01,-9.999999999999977263e+01,-9.999999999999980105e+01,-1.000000000000000000e+02,-9.999999999999992895e+01
6.283184729527064860e+00,-9.999999999999981526e+01,-1.000000000000000000e+02,-1.000000000000000000e+02,-9.999999999999991473e+01,-1.000000000000000000e+02,-1.000000000000000000e+02,-1.000000000000000000e+02,-1.000000000000000000e+02,-1.000000000000000000e+02
9.738937404269250919e+01,-1.000000000000000000e+02,-9.999999999999994316e+01,-9.999999999999994316e+01,-1.000000000000000000e+02,-1.000000000000000000e+02,-1.000000000000000000e+02,-9.999999999999994316e+01,-1.000000000000000000e+02,-9.999999999999988631e+01
8.482300061615083564e+01,-9.999999999999998579e+01,-1.000000000000000000e+02,-9.999999999999998579e+01,-1.000000000000000000e+02,-9.999999999999998579e+01,-9.999999999999991473e+01,-1.000000000000000000e+02,-1.000000000000000000e+02,-9.999999999999995737e+01
8.482299269091015503e+01,-1.000000000000000000e+02,-1.000000000000000000e+02,-1.000000000000000000e+02,-9.999999999999995737e+01,-1.000000000000000000e+02,-1.000000000000000000e+02,-9.999999999999990052e+01,-1.000000000000000000e+02,-9.999999999999981526e+01
1.884955580750759907e+01,-1.000000000000000000e+02,-1.000000000000000000e+02,-9.999999999999998579e+01,-1.000000000000000000e+02,-1.000000000000000000e+02,-1.000000000000000000e+02,-9.999999999999994316e+01,-9.999999999999997158e+01,-1.000000000000000000e+02
9.424777935213313640e+01,-1.000000000000000000e+02,-9.999999999999997158e+01,-1.000000000000000000e+02,-1.000000000000000000e+02,-1.000000000000000000e+02,-1.000000000000000000e+02,-9.999999999999991473e+01,-9.999999999999995737e+01,-1.000000000000000000e+02
-7.539822453170735628e+01,-1.000000000000000000e+02,-1.000000000000000000e+02,-1.000000000000000000e+02,-9.999999999999977263e+01,-9.999999999999998579e+01,-9.999999999999991473e+01,-1.000000000000000000e+02,-1.000000000000000000e+02,-9.999999999999991473e+01
