2.002707783151204124e-01,6.208798290009081782e-07,-1.955356372989519587e-02,-4.368955942276395815e-07,1.684907915031901710e-02,2.415611313874818660e-08,-3.977801988212970041e-02,-1.770081369357852648e-06,-3.229713088030563423e-02,1.979458916043198154e-06,5.288150035212832445e-02,-1.307103603132521683e-11,-1.000000000000000000e+02,-3.409240162777708061e-10,1.000000000000000000e+02,-2.847447340666264479e-10,1.210150028856573901e-09,-1.000000000000000000e+02,6.295699910997383669e-10,-2.216464148722356310e-06,8.283640836773499549e-02,1.228657467097192938e-09,-1.000000000000000000e+02,-4.393655661785220584e-10,-1.170948027318239185e-09,-1.000000000000000000e+02,6.101898216149791185e-10,1.604883440560575636e+00,-2.447878267771810241e-08,-2.248926541010691227e-01
-3.295916612262637935e-02,4.650563996018077739e-07,-3.567212759786046739e-03,1.551214906036677520e-06,2.035878417654332639e-03,-2.303710304596957403e-05,-9.975534394604069349e-03,-3.133408472901041719e-05,1.317863391689881331e-03,4.847313398134467681e-05,-1.176570852967252865e-03,-1.267299593539061159e-04,9.545043779837284175e-04,7.277300465988695115e-04,-1.917874703871040088e-04,2.024744616111476703e-03,1.206340852292604954e-04,5.627276160820446002e-04,-7.414557088163989623e-05,6.521217891924543063e-04,-7.275046103032362446e-05,4.087951340906418479e-04,3.850874964676027001e-04,6.536514120246212289e-04,6.088137931157888645e-05,3.607116099726175289e-03,-6.619249999632532738e-06,2.537379803542035017e-02,6.549962098252741413e-06,-7.366484456529054370e-02
1.081268563217314613e-04,2.903159839785086324e-05,-1.889942234879215827e-04,5.624439267748284656e-04,-1.053278545219679750e-07,5.799990143941742282e-01,1.214855358597765173e-09,-1.000000000000000000e+02,-1.189805359695393695e-10,-2.939548246639143714e-01,1.230072036535421467e-07,-6.859872792486519932e-01,-2.130359007949240466e-07,1.031173451813283681e-01,2.795466570295515319e-07,-4.241407664290224311e-01,1.982557832226210429e-07,-2.862971349935072851e-03,-2.599649538145674718e-09,-1.000000000000000000e+02,-1.550184041908371147e-09,-2.396197583931979125e+01,1.016868296753338120e-10,-1.000000000000000000e+02,-1.976745443242944404e-09,2.969462161652701177e-04,4.272321902551750770e-05,8.181568302518096378e-10,-1.000000000000000000e+02,7.498112904033285895e-10
-4.284816888680988001e+01,3.681786825717626622e-10,9.869871720110340974e+00,-4.228137335400036290e-12,-1.000000000000000000e+02,-7.483734228515264194e-11,-1.000000000000000000e+02,8.565349175855831817e-11,-1.000000000000000000e+02,-6.077748486521189954e-11,-2.803421528833199616e+01,8.471427007123230330e-11,-1.000000000000000000e+02,-1.204989037939779874e-10,-2.113823264982352124e-02,-6.294414069757076497e-07,-3.277000585520197288e-04,-3.482003925863165982e-06,-1.147208703440185886e-04,-4.746921169940648822e-05,2.094419078228683517e-07,2.182371739589055587e-02,-9.579044381655135787e-11,-1.000000000000000000e+02,-1.186524409114992538e-10,3.116946150465242926e+00,1.724615420239858239e-10,-1.348971532415373176e+01,-6.354591224363508457e-11,-1.000000000000000000e+02
4.390805444650761237e-06,-7.515158413389306374e-03,7.008519895210503152e-10,-1.000000000000000000e+02,-1.107801505380605936e-10,-1.793247594582542681e-01,4.095407718847744498e-07,-1.097407725011471068e-02,-1.021465683294005147e-06,3.287270347085354677e-02,4.233812970870773857e-08,4.225964905587874243e-03,8.377673933185831036e-06,4.384422849238941988e-03,-3.089454489252603223e-06,1.010385318906766722e-02,-4.951901581472760100e-06,9.914569792842259106e-04,-1.988342952885832859e-05,-6.447568393640546250e-04,5.090287389295816185e-06,-7.630015178645784338e-03,4.194658193188087595e-07,1.065868678861494299e-02,1.946806573130810008e-09,1.785353615884545664e-01,7.809740886557159885e-08,2.007281649904401818e-02,-6.640106266450944841e-10,-1.000000000000000000e+02
1.824621119341378168e-05,1.010078203341859601e-04,7.057922022220169547e-06,-1.023081277331752573e-04,5.249220147950512415e-07,-1.214229059808370759e-03,-3.724707816387686819e-11,-1.000000000000000000e+02,1.345387894123701764e-11,-1.000000000000000000e+02,6.551554787485512046e-12,-1.031402892880759037e+00,1.136696290120443939e-09,1.817444945878932572e+00,2.362218274215800447e-11,-1.000000000000000000e+02,-3.506330280445557590e-11,-1.000000000000000000e+02,2.331075402632730793e-11,-1.194494084225377506e+00,-4.159872997029618412e-11,1.662038033340552801e+01,-1.104242586061434069e-11,-1.000000000000000000e+02,-7.932960112629107444e-12,3.617310364027483072e+00,-4.190202167457979177e-10,1.541352253885252654e+00,-4.082264824125215440e-11,-1.000000000000000000e+02
-1.000000000000000000e+02,2.503580012323461414e-09,2.002000133099870460e-01,1.918942481836130895e-08,-1.174474072685786075e-01,1.209980224369544922e-10,-1.000000000000000000e+02,2.515925079226390519e-09,-1.000000000000000000e+02,-8.618229307744352868e-10,5.787870777475460082e-01,1.403431724641483166e-07,-1.184842231988747496e-01,4.814147804311610478e-07,-3.001151282465525094e-02,9.522074318531249825e-06,1.209369852733178843e-03,1.178492976461247470e-05,-1.848611175768753289e-03,-9.026077250486104378e-05,2.020846228699666488e-04,1.829521726326222876e-04,5.857925694704533420e-04,6.426744629762732653e-06,2.344842017072234445e-03,7.610565296393764532e-10,-1.000000000000000000e+02,3.316708459181342223e-09,-1.574789468966058311e-03,2.303408008903568482e-04
-1.000000000000000000e+02,1.326648970541165883e-09,-2.969918787286698284e-04,9.562551688826477803e-06,-5.742008871415744886e-10,1.000000000000000000e+02,-2.404994427789739975e-10,-1.000000000000000000e+02,-6.959137794630427511e-10,2.083334804868578516e+01,-2.758785696740506395e-10,2.990019697850822666e+01,-1.640459774178003607e-10,-3.489298753266324127e+01,-6.876586407374395005e-10,-1.000000000000000000e+02,-3.155059079281459942e-10,-3.060894742723051885e-10,-9.999999999402591300e+01,-4.468826642831165738e-10,8.608060530369310325e-05,-1.634825897715605318e-04,1.258088798549703173e-09,1.000000000000000000e+02,-2.670060902965095554e-10,-1.842797733049283404e-01,1.096703607044967022e-07,-2.686425956828684125e-01,-4.937758465986748513e-09,-2.813978443062479684e+00
-2.096993175305563994e+01,-1.082039211844573180e-09,-5.600503380105656959e+00,-8.159857435035605405e-10,-9.998023011812890104e+01,-1.309265117341251408e-09,9.129410689810371279e-03,1.372055130440214492e-05,2.534460598776636445e-04,1.564388027995456537e-04,-6.698103816790476465e-05,8.268980861487237443e-04,5.432573762989492824e-05,-5.923933258302416715e-04,2.020452450155727257e-04,-3.434520413276336481e-04,-4.478905230379601340e-05,6.909703641310880814e-04,-2.028498541738214453e-05,5.326767868310642185e-05,4.924719027966570187e-07,1.392158392621019314e-01,1.430456545059659839e-09,-1.000000000000000000e+02,-3.720141516108242486e-10,1.186060751978745387e+01,-4.647058327363777128e-09,-5.000600523904442873e+00,1.596763190382035805e-08,4.345362599417894600e+00
5.516712910422404414e-01,3.537849228423431205e-08,5.238734764268443422e-02,-4.565045906257923012e-08,-2.782901126367374675e-02,-9.241264238953686692e-07,-7.945897158671794830e-03,-4.414422123297615538e-06,-5.354919174156693926e-04,4.599228623552614577e-06,-1.819072324515380200e-03,-8.423720023177748829e-06,-6.997083346751186220e-04,2.752314709900157953e-05,2.210935403886625343e-04,-1.179870320813751071e-05,-1.372309511448450807e-03,1.381554216032852909e-05,-2.286379122786275997e-04,-3.395953927412580708e-05,-1.308932259269551652e-05,5.199076131301469221e-04,-5.224786024942616862e-07,-2.218750584589260482e-03,3.190696762440782086e-06,-1.039526424575779734e-03,-7.418072752670173754e-06,-3.625492187957656508e-03,-1.366602399520083618e-09,2.180990772377044140e-01
-3.807470979002156031e-02,1.536774647228411578e-07,4.131539013055776643e-02,3.158915801289930253e-08,-3.705719315474737159e-03,-6.035069155706909194e-06,3.211014149123480373e-04,-2.495324828028645725e-06,6.899113873918449229e-07,-9.177333645651348116e-04,6.633616826702586544e-05,-1.363646611161022223e-05,-1.104298924656096296e-05,-1.010148951636888424e-03,1.873606598129421796e-05,1.842940072401996233e-03,6.116021117733930144e-06,3.314704924748522897e-04,1.884019895087116095e-05,8.995769508926958224e-05,5.726928348172345039e-06,-6.837422058867141314e-03,-2.683346896977329557e-06,7.439176280418728637e-03,1.623224760629242150e-06,1.658741217434246684e-02,9.489588952503273300e-11,-1.000000000000000000e+02,-1.863359095816943287e-10,-8.485578374030943394e+01
1.765362098811418257e+00,-5.006970187247409633e-08,3.357353696085258576e+00,1.048689128552870345e-09,-1.499157712714665180e+01,6.517555609861248380e-09,-1.490473670369559578e+00,-1.029004629213706316e-09,-1.000000000000000000e+02,-1.863653591044997056e-10,-5.645912290259438647e-10,-1.000000000000000000e+02,-5.087932380792869451e-10,-1.000000000000000000e+02,1.255686870191727798e-09,-1.000000000000000000e+02,-4.312395334710760085e-10,-1.254387397220146638e-01,-2.974593347014919189e-07,-1.246357411838686500e-09,-1.000000000000000000e+02,-7.210688289554944651e-10,1.239309718607463284e-09,1.000000000000000000e+02,-6.183706448634898506e-10,1.343521842965785851e+01,-1.174413513696048534e-09,5.159863196028350529e+00,4.057174143218864680e-10,-1.000000000000000000e+02
-9.205119857136637589e-11,-1.000000000000000000e+02,3.361361423449229396e-11,-1.000000000000000000e+02,6.131798129482008752e-11,-1.000000000000000000e+02,2.873790952512051828e-10,6.984097202871705767e-02,-1.977252978699104311e-08,2.348950183163596162e-01,-3.483004704969914860e-09,3.018114762654624084e+00,7.674029795763849841e-10,-1.000000000000000000e+02,5.795059681765134632e-10,-1.602502142427515708e-01,-2.792880691220304929e-07,-6.636966422765025464e-02,2.301793040088331014e-07,4.612320806416966151e-02,3.466396831132304650e-07,4.270217315115853313e-03,4.487139771227881457e-07,1.769878692446012758e-03,4.601490145763921276e-09,2.225333241893543909e-02,2.023383535607352867e-07,7.774896279434118096e-02,5.550970781845066756e-11,-1.000000000000000000e+02
3.085105076487968181e-04,3.071563411290107251e-03,-8.444658945614619421e-09,-1.000000000000000000e+02,7.450529239370971994e-09,5.854503824925716329e-04,-3.404202371031029087e-04,-2.394989368481865351e-05,-4.247936733359687633e-02,6.559815919709781428e-09,-1.000000000000000000e+02,8.181613084404880182e-09,1.278648102833905398e+00,-2.437676333597892698e-07,-6.153255844478170561e-02,-1.247087113434085877e-05,-7.086167029186539457e-03,4.325740605692644840e-05,3.393250379447541529e-03,2.171988629321621855e-04,-4.557769951703022522e-05,-1.775425701561309660e-02,-3.471347382046825091e-05,-7.636507527164791698e-03,6.697114868446859290e-05,-5.316133049433485747e-04,-1.519844192577245463e-05,-1.923170172413640744e-02,-4.412693784142609449e-06,-2.125263632349592979e-02
1.000000000000000000e+02,6.373640731219155935e-10,-1.401545938991811902e+00,8.781405609252013103e-09,-1.389332815361769224e+00,-7.081848069955404820e-10,-1.000000000000000000e+02,-1.071778318055800640e-09,-2.277264906099874149e-03,-6.021102666850077157e-06,-1.822448427889803375e-06,-2.142440899812612237e-02,-7.832002387109636904e-10,-1.000000000000000000e+02,4.315283978953308668e-10,1.752393683569768157e-03,-1.552349081700520305e-05,-8.767096995856232672e-07,2.331823804675418887e-02,9.998652232162713559e-10,-1.000000000000000000e+02,-5.247974311546897635e-10,-5.009768536683334439e-02,-6.291922024390130788e-07,5.096730033281395190e-06,-5.563264468249366421e-03,1.276061305959324637e-10,-1.000000000000000000e+02,2.467285430989446336e-10,-1.000000000000000000e+02
1.157297782180000123e+00,-6.496134409903228536e-09,-7.458845889509546634e-02,-3.659204719420861358e-08,-4.589808266653977453e-03,2.774820049668305058e-06,-4.548168428060578306e-04,-5.553335700685390429e-06,5.705513183422689094e-03,-9.567709170987256620e-07,-8.833430791407515664e-03,-2.125362575984827779e-09,-1.000000000000000000e+02,-4.046435718359130399e-10,-1.000000000000000000e+02,-3.340848686502181842e-10,2.989750351957932636e-03,1.756625249546678969e-05,-1.675387299614831613e-03,-6.852763836725541270e-07,1.070819359271596716e-01,-2.539049287332272413e-07,-2.186751585757391037e-01,-2.164764449536060056e-07,8.734380770792589399e-02,8.619517924295427966e-07,4.381666620013346947e-02,3.569708364503942606e-10,-1.000000000000000000e+02,-8.839548335436589515e-10
-3.521031738993816995e-02,-1.488601908071205998e-06,6.249686700269094404e-04,-4.875173672300805745e-04,-1.121180594667531901e-04,-1.537618727444297869e-03,3.626066794112876982e-10,-1.000000000000000000e+02,2.091218326862802080e-09,1.258291787009146734e-01,-4.561487138519916452e-07,8.537830627644741460e-03,8.847177036579967585e-06,5.143575348771550759e-03,-3.487140580621226780e-05,3.557624116761322081e-03,-2.263589497510880272e-05,5.402778805096417926e-04,-7.074633067295274102e-05,-7.250225817089601607e-05,1.825140219487594818e-04,-1.089241902048435366e-04,-1.570693330064222115e-04,-5.573251839675842298e-05,9.088410512905737522e-04,2.160375704761418898e-04,1.265573336594299071e-04,-6.581605685072617479e-05,1.629615990494680581e-04,4.354882221376531496e-04
4.192121132767044796e-03,2.463267022999186454e-05,2.808467538621824480e-03,2.695136291469430183e-05,-1.442412033620721129e-04,3.539387581680007505e-04,5.181031232140594078e-04,9.143235650075408967e-05,-2.913102679759605688e-04,-2.234201479611687066e-06,1.019109547639761477e-03,2.765244486058041941e-05,4.428641690213763835e-04,-2.787136069837793054e-04,-4.872652437549721167e-04,-7.734188845507965150e-05,-4.200396038208617814e-04,2.402778449193011942e-04,2.560595063190969963e-04,1.799948325482841633e-04,-7.645579388943322268e-05,1.773238582941202206e-04,9.318641128521496300e-04,-7.988620845791913301e-06,3.627862925682117691e-03,3.017946965719441862e-05,3.902553188769881248e-04,6.444535342412621411e-04,-2.395842130547816504e-05,2.257208205204737014e-03
1.726083468854896358e-02,-5.161615127188631039e-06,-1.117608035349286185e-04,1.956764305929545907e-04,1.656331541133677834e-04,-4.812265730891958533e-05,5.992716062802459125e-05,3.412693292582537471e-04,1.063015003279560171e-09,-1.000000000000000000e+02,-2.093283997170465829e-09,-2.059645152102951826e+01,5.139805507593855999e-10,-1.000000000000000000e+02,-1.142511397913523809e-11,-1.000000000000000000e+02,-4.456739667990195580e-10,-1.000000000000000000e+02,-3.956581129374675723e-10,-4.273804677284531728e-02,-1.134427014592710506e-07,7.498534837615365364e-03,-8.492001558806373785e-08,1.622557863743544909e-02,-7.752908976350311097e-06,3.288324157907914630e-03,1.709399629433394575e-05,-9.955996838996773041e-03,4.502015410569933790e-06,-1.428797495146790636e-03
-1.000000000000000000e+02,-3.798620199528416031e-11,-1.000000000000000000e+02,-1.231972220126505488e-10,9.537564657672399804e+00,4.557531156988786163e-10,-1.547027474633945232e+01,-1.357342591986051756e-11,-1.000000000000000000e+02,-1.376509450004411526e-10,-1.554919650703266099e+00,-6.286582469692181340e-09,1.205671683520941562e+00,7.333960608433381340e-10,3.871406051863005571e-01,1.863279016957826761e-10,-2.449457439165021810e+01,2.848687476993365932e-10,-1.000000000000000000e+02,1.236460511077857915e-11,9.328551961625407250e-06,-3.300886753760093675e-03,3.002774989327108280e-10,-1.000000000000000000e+02,1.586585169598287376e-10,6.969837739884815475e-02,5.970750489188947791e-08,9.431500267753863131e-03,3.275682214130814377e-09,1.236190320621424477e-01
1.055703858840851585e-03,-1.761359399584124490e-05,-2.903482122617532645e-04,-3.132319531730980914e-05,2.075514341955166098e-04,6.372926779914485156e-05,-1.395513880538642353e-04,-6.938274225541131695e-05,2.520659295575423692e-04,2.495653456922343732e-05,8.625027920228338363e-04,-9.092912940863930133e-07,3.452318801734272774e-02,1.222949558192349602e-07,1.562035119572088571e-01,-3.286525139845110311e-10,-1.000000000000000000e+02,5.832881954845109961e-10,-3.705095271749973915e-03,4.656462132901910173e-07,-6.214348447387455605e-05,1.506179359648526848e-04,-1.028105389457645627e-05,3.018580054005932304e-04,4.659849571601157092e-05,-1.269631071011946338e-03,2.047299863940386038e-06,-1.841665481340509780e-02,6.682138468910386922e-08,-8.571523988912560510e-02
-1.000000000000000000e+02,-2.818820116991611226e-09,3.648605845192050105e-04,1.344993681786146584e-04,-1.127008967217210832e-05,-3.431356931639041510e-03,4.143823795387774740e-09,-1.000000000000000000e+02,8.278304705998914902e-10,4.759227019508149165e-02,2.401014316366272522e-06,4.144777223080912953e-02,-3.777403838444065687e-08,-7.458335187446223438e-03,2.560996460904507090e-06,-8.243603157174686849e-03,-9.830286443148842095e-06,4.796298734064175819e-04,-3.691255360574605062e-04,3.303344743000323535e-04,8.576633646290271040e-05,1.531752241485391953e-03,1.211012114321548971e-04,-1.701759932306685041e-04,1.092281275705523936e-04,-8.175188161271516873e-04,-4.817373370606186321e-06,-6.298051468725821000e-03,-2.548489776362091769e-08,-3.776859335725855915e-02
-1.486830992898410374e-04,5.709179896059727926e-06,-5.444954559784755420e-05,4.224678092244559154e-03,7.381321749884004379e-05,3.686303555800849070e-04,1.557605650060064038e-04,4.677657873805845384e-04,1.718646311639229719e-04,2.679710115369699332e-04,1.376940530380775377e-04,-1.063921837493471282e-03,2.654748728304708155e-05,-1.658468028669893464e-04,7.081851113134144830e-10,-1.000000000000000000e+02,1.069561477513858162e-09,-1.000000000000000000e+02,3.019771651343547608e-09,1.033816210964433102e+00,-2.382639845371833355e-07,-6.132686100927784573e-02,7.428571361020450863e-07,3.759705526297440863e-03,-7.031565002213642501e-06,1.087795820154877080e-06,-1.525794820916220419e-06,-3.779219884091197801e-02,-4.206688888974302533e-07,-9.470746249416057694e-01
7.426707071854462328e+00,-3.898912788800589199e-10,1.381767371117304322e+01,-2.411802616075013231e-11,-1.000000000000000000e+02,-8.597214110107384833e-11,1.159689392237112981e+00,-1.042891087179343890e-08,-2.980503512448637871e-01,3.142978652628184645e-09,-2.628229568735966915e-01,3.000862836296931592e-08,6.257106444113362531e-03,2.301767812026956242e-06,1.051728443400406273e-03,1.517016420647515076e-06,1.151919792083740124e-03,1.129086118937828693e-05,2.175761040413106469e-05,2.655333050427027472e-05,-2.114745374639213113e-04,4.084457537808666467e-05,9.365050911088950792e-04,2.115593093489161647e-05,9.268806758023372436e-06,2.435253786683311446e-03,-4.300227501068838302e-09,-5.723489319025307775e-01,-2.178006670375730934e-10,1.000000000000000000e+02
-4.998594737582319480e-02,7.130791317225875029e-07,-7.855556462902337639e-03,1.232215602356455062e-06,-1.486100849935220042e-02,4.736665625632892464e-07,1.231607576402991844e-01,-9.623886902717556350e-08,1.218107073218668845e-02,-2.471856885155614865e-09,-1.000000000000000000e+02,3.496103491694197819e-10,-9.988815523391838269e+01,5.372477927891978726e-10,-1.000000000000000000e+02,-7.862483568801772537e-10,-1.000000000000000000e+02,1.183275446734854944e-09,5.015135801518315617e-01,5.496137863945142295e-08,-8.622514552971775534e-03,-1.723372811415791741e-05,-3.509536350823095566e-03,2.381169355276565650e-05,2.803844793795706031e-04,-3.703900839404269930e-04,-2.213728615834756330e-04,5.278397036351397363e-04,-3.285294917894704916e-08,-6.228742805469141830e-01
-1.000000000000000000e+02,2.919138070709869959e-10,2.697507076153021544e+01,-1.229096607514159325e-09,-9.741600200702828616e+00,1.243158300905030666e-09,1.699243484889604305e+00,5.242017528729001645e-10,-1.000000000000000000e+02,7.733896827050946106e-10,6.052637527291801489e-02,1.045087036313368552e-08,-2.003493393268818590e+00,-1.071639168709417647e-08,8.591904861574871655e-01,5.007788594362358497e-09,-2.377163186985991050e+00,1.056719192073399092e-09,-1.000000000000000000e+02,1.937977044468382219e-10,-1.000000000000000000e+02,5.094627569868730309e-10,3.437629109232451266e-10,-1.000000000000000000e+02,-4.080715220018339167e-11,4.149704389952484918e-01,2.227567135437656700e-08,-1.043125543122401799e-01,-2.452716749792798931e-08,1.888644766529285590e+00
-1.000000000000000000e+02,-2.969500571557715498e-09,-2.808429382006025210e-02,2.663783588131570461e-05,5.845355103164653031e-03,-7.074013004297000778e-05,-2.333893720746873558e-04,4.587797728019678517e-05,1.781999117362411712e-04,1.869514965310724221e-03,7.216995607196234185e-06,-1.989695007167874459e-03,-2.354639571616603509e-06,4.453181255112681480e-03,4.817655330071950825e-09,-1.000000000000000000e+02,4.001951955733003972e-10,-1.940040993284340153e-05,-6.099113103316618906e-02,-2.150998981468195255e-09,-1.000000000000000000e+02,2.044025710114163063e-09,2.621701841505069686e-02,1.160632263540230402e-06,-1.209596335488553887e-03,-1.565949157384290678e-04,-5.825442000825158204e-04,7.184266242518302231e-04,-3.321260773118298417e-05,-8.420934300265837946e-03
-1.000000000000000000e+02,-1.796420852957078199e-09,1.809641247040543969e-09,1.000000000000000000e+02,1.349763479216695004e-09,2.265621605385678694e-02,1.377197470132055882e-07,7.762012153763932568e-03,-1.211453253904660904e-05,-2.909875123494087921e-03,5.114460901235116626e-05,4.697065609108745697e-04,-1.151004879857512599e-04,-1.058228904273446954e-03,1.039854374524642414e-04,-4.590380546218273436e-04,-8.608927640665243076e-05,-9.392511547632275120e-04,-1.393716922882449094e-04,-7.046047925669626398e-04,5.329945725086800709e-05,-1.002267370280753370e-03,-1.723107936102380271e-04,-7.037226348972126528e-04,-1.529959692897029798e-04,-6.388817217600290194e-05,3.383716851051680075e-05,-2.759128244437005807e-03,5.859429139452961477e-05,2.705945482685137918e-05
-4.222428239706968456e-02,3.889402553184114287e-06,1.778972410886293237e-02,1.163233852532804600e-06,1.103012149025597854e-02,3.095321525290687520e-05,3.609461430588877494e-03,-6.173919260390574800e-06,2.041459594437434848e-03,1.478432235611684253e-06,1.140914292800717517e-02,3.172524971912981328e-05,5.531364179653260570e-04,-2.965869045033557686e-05,-3.891441366719568056e-04,5.325800941942214874e-05,-4.721323229893016984e-06,3.556245791445565747e-03,2.228663323885734290e-05,1.447751381218950880e-06,5.558137572149184080e-02,-3.235267816866794547e-08,-3.401294915507258043e-02,-3.049055466421520405e-09,-1.000000000000000000e+02,4.035877605061856056e-09,3.011443046055355642e-03,-1.670089693178950039e-05,2.400717262028463153e-06,5.511326203830455017e-02
-1.852998294003141666e+01,-1.372535551692764043e-09,3.440779804041103951e+00,-3.970629931557930439e-09,6.690992635248538267e-01,3.370618744525196035e-10,-1.000000000000000000e+02,-6.947656122567273378e-11,1.629242805894260282e-07,-4.723556282203605211e-02,1.066590544085235419e-09,-1.000000000000000000e+02,-3.246180088363190452e-10,3.321654849548284424e-03,3.769721580175830087e-06,6.541478269241173503e-03,6.420612027017440084e-06,-4.819911944570836118e-03,4.929357159138222754e-08,-3.535984001969313395e-01,-4.192049486457772649e-10,-1.000000000000000000e+02,-9.795628575139878180e-11,1.000000000000000000e+02,-3.132332479734559047e-10,1.359948497868807560e-01,-2.920130738666712564e-08,4.519271770483317407e-01,-5.970973498678919758e-09,-9.285532361678127344e+00
