5.607669563603492691e+01,-1.622997536341740243e+01,1.591096566773844501e+01,-3.761268718138259004e+01,-4.328219744385104661e+01,2.695143435951652577e+01,-7.599910474700061513e+01,8.933448081404056040e+01,6.005412327296966168e-02,-6.301808042658744569e+01
5.644705789958693032e+01,-3.228003080006006087e+01,-5.998684717309392767e+01,5.987663058015820639e+01,5.631438815123166108e+01,7.741336623070088066e-04,-5.584970391654513122e+01,8.216543481441135555e+01,-8.638282409389159966e+01,6.680815550740128117e+01
2.650318413037420484e+01,3.579783351951526527e-03,3.051597588601719124e+01,-6.553428832480815913e+01,-5.744866577974051580e+01,7.072293338692486486e+01,4.091830807462173425e+01,-5.672427729941864527e+01,5.397150240731410520e+01,4.916101528944146537e+01
-6.620377910339774985e+01,2.312635222317397776e+01,-6.392832618212430873e+01,2.243318721993126422e-04,-8.336843370303743939e+01,7.497945674459475640e+01,7.030532598037413550e+01,6.842925908635061205e+01,-1.651403686728961873e+01,-3.852303795064486991e+01
-9.255167797753749426e+01,-3.389651939770616451e+01,-1.741218884710396608e+01,-5.478122694472692444e+01,9.089755035574853537e-02,-7.287434927821786346e+01,4.631275379788357682e-04,-4.345578183972805419e+01,8.566829594809783543e+01,-4.856302584191571725e+01
-3.089876580248110827e+01,7.660731919681170154e+01,-1.639553621115049964e+01,2.301304365143533204e+01,2.856875411325177083e-03,-8.308476163154998062e+01,2.011460729523299662e+01,-2.235093556222535938e+01,-4.461319833861971063e+00,-4.043751928715058597e+01
-4.612202513427008910e+01,4.550958784165004545e-03,-4.572490820377133502e+01,-3.441397582199731175e+01,3.094075091458001481e+01,6.888298528966652157e+01,7.381946085190087103e+01,4.040214396711832734e+01,-4.673209327261653101e+01,6.545526493973535764e+01
9.565483258242375086e+01,-5.904408569917160321e+01,9.512219616656565790e+00,1.305318971518553717e+01,8.769306945705976375e+01,4.504625136261692830e+01,8.283657919324805619e+01,-4.720439069191245807e+01,3.272058042771419650e-03,9.402377768907296485e+00
7.213458728478865112e+01,-7.274196775342053911e+01,8.133574204142581721e+01,7.419599549253109672e+01,-6.654578759128717991e+01,2.404519271333826591e-04,5.406755487247981051e+01,-9.610194739481482884e+01,9.662469713108507108e+01,-9.556441966747041761e+01
-6.897627559460863722e+01,2.780573314145404077e-04,-5.496662890804289958e+01,-5.141709892005438576e+01,-9.741590722966500948e+01,-4.045520554462569862e+00,7.393024586313310920e+01,2.125623105235506216e+01,-1.833692839671524411e+01,-9.364677094909042410e+01
2.622690869625375143e+01,6.144229207516295332e+01,2.187048575829854258e+01,-8.377113831150039402e+01,6.054997535854949575e+01,1.954772391077776561e+01,5.560244035320190126e-03,-5.393335590715351202e+01,-7.658463768158812002e+01,1.005872573576218088e+01
-4.842778095714096764e+01,7.465084520113629196e+01,-3.081424857143530716e+01,-3.050280314949356608e+01,1.214545846277886199e+00,2.824884569776841303e+01,4.460637810034029371e-03,-9.412790413380432142e+01,6.606864994838943517e+01,3.797859159802956697e+01
4.028759467861012666e+01,5.352967124635208052e+01,7.483858903072777480e+01,-7.964937260364706617e+00,9.119633641236629273e+01,-5.857399379343561918e-01,7.054565007706717950e+01,4.534677479225006662e-04,5.089476069405141345e+01,3.903291517355139462e+01
4.307957087252211892e+01,-5.167881980461559266e+01,1.988169780358740013e+01,-6.234028010828714628e+01,2.300813983442829419e-04,-4.118385756098746953e+01,1.492616605763917548e+01,-9.683842136489111851e+01,-3.531433544767563859e+01,2.342656863107747256e+01
-4.820135802021641780e+01,6.874397170142259483e+01,7.361332596832362185e+01,7.274068906172627674e-04,-4.965478269551918089e+01,-8.448509035823444435e+01,-6.211263662186263446e+01,9.613848626809286202e+01,7.949953972708757988e+01,-8.889487301434121491e+01
1.279285041795677813e+01,-9.224848787773390768e+01,-8.500821179389147630e+01,7.716132643618836084e+01,9.727679235030051075e+01,-6.421977931334333789e+01,2.248789458081906344e-04,-1.023468608099071808e+01,9.799958161619230168e+01,8.650779353636065139e+01
3.813022945371400851e+01,7.878776762692581315e+01,-7.497285627122053597e+01,-5.179844117135434800e+00,5.875550553351148864e+01,-6.206390971996754757e+01,2.291319387062724748e-04,-5.993776166657504234e+01,6.804096903547824127e+01,5.896550135363106904e+01
4.406842863304193259e+01,6.458072301222027534e+01,-9.507503047967142606e+01,4.878123454973426476e-02,2.356421033246084562e+01,2.842483475856028008e-03,-5.727594405274723499e+01,1.613353727761861478e-01,-2.260329040265966682e+01,1.506229464419322284e+01
4.876270171761100158e+01,8.442031951664988298e+01,7.607986130739398334e+01,7.880444917831000851e+01,-4.453729260305529181e+01,4.611217547050733145e+01,2.160388542066846856e-02,-7.362238766810651214e+01,-5.428332616748405570e+01,-6.861324684723584255e+01
9.183286325997343624e+01,2.100689071198115343e+01,2.876460213060151005e+01,5.041001474160644591e-03,7.721575734001396540e+01,2.984122373192939826e+00,1.840172379801067848e+01,7.681945006277648247e+01,-6.487219698186393657e+01,6.171606836526452611e+01
-6.546979624983158885e+01,-4.480406831447325544e-01,-2.764563551677419184e+01,-5.580214545660151515e+00,2.113985466275875372e-02,-1.934531815453931358e+01,-1.679098596339543548e+01,4.782570343796197676e+01,-9.035050718239466505e+01,3.247385941333153170e+01
7.432070858269533176e+01,3.700167743289637912e+01,9.116021131460112770e+01,1.279143724835520857e-01,3.078585685026529717e+01,2.249727512526216344e+01,7.101761930522201283e-01,-2.210481983378058857e+01,8.409100541136805873e+01,-5.967213472065117230e+01
-7.451338522589507818e+01,6.385910428774367631e+01,2.917276716224966385e-04,-6.489073673844744405e+01,-7.707210667238973656e+01,5.192593871200148214e+01,-1.915938080448840708e+01,-9.426162497296503773e+01,-1.720063155916932374e+01,5.230065184031080605e+01
7.044750193480686562e+01,1.378624284427587554e-03,2.360623352904733352e+01,5.000541516911502526e+01,-9.866678486967413164e+01,3.533997386557075515e+01,5.109362418469653733e+01,-5.381009439301388397e+01,-2.137140704411071113e+01,-2.139287501761714694e+01
-5.743188491924956196e+01,3.576590104081392241e+01,-2.895773570181349754e+01,-4.265216193547151846e+01,2.260681379321027862e-02,7.901227031814283919e+01,6.065520885366721870e+01,4.715962148159027834e+01,8.801655575154615008e+01,-1.257075053123356945e+01
-3.529698018054144626e+01,3.578343117681301067e+01,-8.490949461233813622e+01,1.671741035372340178e+01,7.280234383744962656e+01,-4.302633305785091977e+01,6.609278707173119471e+01,-6.605283165486380881e+01,2.341555539833139717e-04,-3.121572294045781959e+00
7.688101290533390397e+01,1.678900582010170407e-03,-1.830208418041725338e+01,7.127058011107774860e+01,2.532358761672161762e+01,8.559428921012617764e+01,8.205453238620708589e+01,8.874293812386991931e+01,8.228707140390987718e+01,6.723833382629830169e+01
-1.668513016229277923e+01,7.845729175138522749e+01,-7.628717666705748002e+01,8.275281633061126740e-04,-9.127277731971810226e+01,1.283141745117250565e+01,-1.453376490655514353e+01,7.440758794910581742e+01,3.309904280699098678e+01,2.688721475577253273e+00
-9.590248673876797625e+01,-2.271682150715500370e+01,-3.294306986650308033e+01,6.058410393521285187e-03,5.186494837147603221e+01,4.995680156926093929e+01,3.139016386018981919e+01,-3.728952310013306715e+01,-8.236195383416477966e+01,-7.084223487009091969e+01
-9.664770192136282390e+01,7.389229513884080802e+01,5.351401600047820040e+01,8.045023977611877189e-04,-9.970040425246929772e+01,9.098099242109822171e+01,9.591943939315426348e+01,-7.252521388791774370e+01,-8.727003363609838971e+01,-9.975169113255564923e+01
