-5.953498007269110559e+01,-7.709346466730936243e+01,-7.651983016703816531e+01,1.122649437975961817e+01,-7.625203605604380641e+01,-8.000851145634289452e+00,-7.736768507516171667e+01,-9.992561516784189735e+01,-8.127535397944639328e+01,8.834150759681327258e+01
-7.389143716580248622e+01,2.524137577467944027e+01,-6.417868611825453229e+01,5.462354093394901611e+01,4.082729668181595173e+01,-9.682982031505716236e+01,7.131037080767490011e+01,-4.656336726066039233e+01,5.107583584500645202e+01,3.972813576271877167e+01
6.521562350568579802e+01,-5.320722353296843465e+01,-8.563590502961272932e+01,-3.214354960844185882e+01,-5.243884122122808833e+01,-1.218219422654320283e+01,-9.863140454558882197e+01,-1.945066021314590543e+01,-5.790784515154516754e+01,-9.643731266769347599e+01
2.117832757707943969e+01,4.451629810375700202e+01,-9.128571255825841035e+01,-7.222832720200017320e+00,-4.338516306988908866e+01,-6.502978313021843348e+01,-8.604945123357938996e+01,-3.907838494289451603e+01,-3.928395020033315177e+01,4.723571429522358756e+01
-8.973296295008493928e+01,-2.753918956197021828e+01,-8.354257172593676728e+01,-2.199744476826523254e+01,7.163577854097907505e+01,-6.010259525269044900e+01,-1.657264992276925852e+01,-7.981637061596509852e+01,-8.362040326460343920e+01,-1.702219332621211478e+01
-9.325832561807948196e+01,-4.067018527262925431e+01,-3.473569287669927519e+01,8.083138605645437735e+00,2.191008697982459097e+01,-3.165566381914570115e+01,-5.401167850256452851e+01,-4.503868407288347697e+01,-8.938210668471742792e+01,-5.252462118878307251e+01
-7.790308804769108519e+01,8.220914357628453573e+00,-9.220289685821154535e+01,-7.417142544252091341e+01,-7.789661587582608604e+01,-8.005683267475302500e+01,-1.848225591747538132e+01,-6.333168987033029396e+01,-6.290271709197634209e+01,8.646882183491719331e+01
-3.387851252963823612e+01,6.649868475789975264e+01,-6.481469687350235631e+01,9.526728179595826873e+01,3.741142081071018310e+00,-6.609685477998486647e+01,-3.952124749769099310e+01,-9.584398453289773556e+01,-2.128260959656487472e+01,6.060095893908005849e+01
1.527294043218506658e+01,4.173294433585450491e+00,9.288808276957175281e+01,-7.975796060024588741e+00,-2.712608998001752525e+01,-2.305442375420523859e+01,8.812082609399347177e+01,-7.339863997560902931e+01,-6.651698157207297868e+01,-9.538944628805147374e+01
-5.779716005258293876e+00,-4.565888127841520117e+01,-2.657161123973889616e+01,9.982660852813360464e+00,-8.163211169452621618e+01,-6.239237395151477017e+01,-6.163177355064912177e+01,1.222157008141467927e+01,-2.768607832198924967e+01,-3.428750451515871589e+01
-9.786460640493865526e+01,-1.534770389979332705e+01,-2.550825627605507151e+01,-3.187569578744763987e+01,-9.206183941176851704e+01,-9.738828903258504965e+01,4.581047334235357482e-01,-1.001077540065839599e+00,9.303560895489701466e+01,-4.554651788655974087e+01
4.506652310267565298e+01,-2.413527475124972099e+01,-9.007137941278013926e+00,-5.823922749175732605e+01,-9.024018044176452236e+01,-9.167382452162695472e+01,-3.154480296635021830e+01,-5.638028529844073944e+01,9.804217538487182537e+01,8.594910737879106932e+01
-6.083592310803486214e+01,-2.570501380103216604e+01,8.358581856540621402e+01,-2.604900270835398857e+01,-5.283985499118137596e+01,-2.144241234287960651e+01,4.881920799706300329e+00,-5.260707058047239570e+01,-7.587514197582166275e+01,-1.077943762071721956e+01
2.207796497972626781e+01,-4.300940516467296959e+01,-5.861823176795273582e+01,-4.728743381665015733e+01,-6.783544286350230834e+01,-7.511899186985307608e+01,-7.807782648065830244e+01,4.051700773982784654e+01,9.836910832147525241e+01,1.977990921824217452e+01
2.698878732221397669e+01,-3.805645456764315782e+01,-8.752042109742708931e+01,-8.038296150563687092e+01,3.448208783045597858e+00,-3.353440112011070084e+01,8.298719195539442239e+01,-2.615895185521976529e+01,-5.770820804630774070e+00,9.092323477435148504e+01
-2.755710627779049560e+01,-4.326846400097289091e+01,-8.774826654019176431e+01,7.623465983648588917e+01,-5.824975899172952154e+01,4.265598023895879010e+01,9.717165370803976998e+01,-6.908523308467891866e+01,-7.928311232600323422e+01,9.061421641770209590e+01
5.870738454334592404e+01,5.061819514606717973e+01,-5.753984081409925011e+01,-9.675357226333451877e+01,8.018797536694688688e+01,-8.511575947375785489e+00,9.065270406130706249e+01,-7.793509945003835071e+01,6.711396072962236303e+01,-9.180762419422836729e+01
5.629317011501419188e+01,6.927019959587860853e+01,1.108957279520488726e+00,-8.309904409793733748e+01,-8.472435156928349897e+01,-4.089694651678939863e+00,-9.514894326462137997e+01,-4.720586186350368507e+01,-1.726905360955172952e+01,9.651499650917642725e+01
-5.118066788412911450e+01,-7.383312886018808285e+01,-6.833335826395980916e-01,-8.319118532208551642e+01,8.563037992766290074e+01,8.239699031740705948e+00,-6.621611838338988321e+01,4.751822438868516940e+01,-2.031444117414330464e+01,-4.939270678952446048e+01
1.104073789154789154e+00,-8.069172103737582802e+01,-8.798043622848732070e+01,5.085970620829483835e+01,-2.006049001295757250e+00,-6.008124885117987901e+01,-8.830962982947805529e+01,4.285413486672966599e+01,5.553455089774683273e+01,8.233960516501406346e+01
5.750419592372045940e+01,5.536514327958493453e+01,3.606003456067541890e+01,-7.429147408495755656e+01,-5.795532805854191594e+01,-8.083971383991502080e+01,-5.431052229673449716e+01,6.382070019577498243e+01,-5.616974828212711657e+01,1.095163840424071111e+01
5.594025930592695595e+00,-3.116453895064032764e+01,-3.407548776794921253e+01,5.751760801709280280e+00,-4.298951865428886521e+01,3.861560433481369614e+01,-8.088337463960496621e+01,-5.587802606238086867e+01,1.011571201182630553e+01,-8.178859287246781662e+01
-8.698203147590592721e+01,-9.825141466008597035e+01,-6.523482797506829911e+01,6.725924453295012029e+01,2.389370756222767511e+00,-3.305911342595388192e+01,2.195105873906008398e+01,-6.031019135913449247e+01,-2.546933052570014056e+01,-3.585743637330070754e+01
5.100109687521874946e+01,-5.646984644561268141e+01,2.919041615954963476e+00,9.743668459342052302e+01,-7.852498033580187098e+01,-3.333149780998401468e+01,6.017970969630887623e+01,-9.009928815463960916e+01,-7.281151405452322933e+01,-8.654189998275833773e+01
-7.159546677279899995e+01,4.161718693711708994e+01,-5.298042240462189767e+01,2.178444387100416435e+01,1.942122417233766640e+01,-7.705710002523778712e+01,-1.305357796388595659e+01,-4.259256363473591023e+01,7.335404335964227585e+01,-3.925345316499914361e+01
-4.001651412067586477e+01,-8.670671896062049200e+01,-3.933457594556514891e+01,-8.649150840939650919e+00,-2.445465008827908093e+01,7.555983339229072726e+01,-1.483790353161968056e+01,-9.082608385688439512e+01,-8.900584889392033006e+01,-5.315977668564636360e+01
-6.577421409506580119e+01,3.685981909680806723e+01,-2.161627918339501875e+01,2.008609280566896160e+01,-4.320702553749834607e+01,6.824785455266508905e+01,1.646153672011639912e+01,2.153708128725900650e+01,-8.069711846037067460e+01,4.863025167127298687e+01
-9.262417530405787147e+01,-2.216459157023478355e+01,5.775185122151822270e+01,-7.505411244166234042e+01,-1.024009688993763234e+01,2.970018171802596640e+01,-1.989037918383701964e+01,-8.253386953351690636e+01,6.285182926256896963e+01,3.066864789572896655e+00
2.520627969119027512e+01,-8.249283008177101806e+01,-8.050346839886012162e+01,-8.666243766761948564e+01,-1.507949334027006927e+01,-7.222502698965189438e+01,-2.902798672882632047e+00,-8.705393942646634287e+01,-7.218469153985300579e+01,-8.236379845092798746e+01
9.472365302355800054e+01,8.631852661611785038e+01,-7.633122411311930477e+01,-4.827729503970752489e+01,-9.117792496335917463e+01,6.145610083291406767e+01,-1.271372884516533475e+01,-2.741181687960882840e+01,-9.747974187468810214e+01,8.677088855129258604e+01
