-9.999999999999982947e+01,-1.000000000000000000e+02,-1.000000000000000000e+02,-1.000000000000000000e+02,-1.000000000000000000e+02,-1.000000000000000000e+02,-1.000000000000000000e+02,-1.000000000000000000e+02,-1.000000000000000000e+02,-1.000000000000000000e+02,-1.000000000000000000e+02,-1.000000000000000000e+02,-1.000000000000000000e+02,-1.000000000000000000e+02,-1.000000000000000000e+02,-1.000000000000000000e+02,-1.000000000000000000e+02,-1.000000000000000000e+02,-1.000000000000000000e+02,-1.000000000000000000e+02,-9.999999999999998579e+01,-1.000000000000000000e+02,-1.000000000000000000e+02,-1.000000000000000000e+02,-9.999999999999981526e+01,-1.000000000000000000e+02,-1.000000000000000000e+02,-1.000000000000000000e+02,-1.000000000000000000e+02,1.000000000000000000e+02
-1.000000000000000000e+02,-1.000000000000000000e+02,-9.999999999999984368e+01,-1.000000000000000000e+02,-9.999999999999995737e+01,-9.999999999999961631e+01,-1.000000000000000000e+02,-1.000000000000000000e+02,-9.999999999999995737e+01,-9.999999999999995737e+01,-9.999999999999988631e+01,-9.999999999999998579e+01,-1.000000000000000000e+02,-1.000000000000000000e+02,-9.999999999999995737e+01,-1.000000000000000000e+02,-9.999999999999964473e+01,-1.000000000000000000e+02,-1.000000000000000000e+02,-1.000000000000000000e+02,-9.999999999999987210e+01,-9.999999999999985789e+01,-9.999999999999997158e+01,-9.999999999999994316e+01,-9.999999999999982947e+01,-9.999999999999982947e+01,-9.999999999999997158e+01,-9.999999999999991473e+01,-1.000000000000000000e+02,-3.463363604191696532e-01
-1.000000000000000000e+02,-1.000000000000000000e+02,-1.000000000000000000e+02,-1.000000000000000000e+02,-1.000000000000000000e+02,-1.000000000000000000e+02,-1.000000000000000000e+02,-1.000000000000000000e+02,-1.000000000000000000e+02,-1.000000000000000000e+02,-9.999999999999972999e+01,-1.000000000000000000e+02,-1.000000000000000000e+02,-1.000000000000000000e+02,-1.000000000000000000e+02,-1.000000000000000000e+02,-1.000000000000000000e+02,-1.000000000000000000e+02,-1.000000000000000000e+02,-1.000000000000000000e+02,-1.000000000000000000e+02,-9.999999999999981526e+01,-1.000000000000000000e+02,-1.000000000000000000e+02,-9.999999999999982947e+01,-1.000000000000000000e+02,-9.999999999999984368e+01,-1.000000000000000000e+02,-1.000000000000000000e+02,1.000000000000000000e+02
-1.000000000000000000e+02,-1.000000000000000000e+02,-1.000000000000000000e+02,-1.000000000000000000e+02,-1.000000000000000000e+02,-1.000000000000000000e+02,-1.000000000000000000e+02,-1.000000000000000000e+02,-1.000000000000000000e+02,-9.999999999999987210e+01,-1.000000000000000000e+02,-1.000000000000000000e+02,-9.999999999999990052e+01,-9.999999999999987210e+01,-1.000000000000000000e+02,-9.999999999999994316e+01,-9.999999999999974420e+01,-1.000000000000000000e+02,-1.000000000000000000e+02,-1.000000000000000000e+02,-9.999999999999985789e+01,-9.999999999999990052e+01,-9.999999999999980105e+01,-1.000000000000000000e+02,-9.999999999999982947e+01,-9.999999999999987210e+01,-1.000000000000000000e+02,-1.000000000000000000e+02,-1.000000000000000000e+02,9.999999999999913314e+01
-9.999999999999998579e+01,-1.000000000000000000e+02,-1.000000000000000000e+02,-1.000000000000000000e+02,-9.999999999999995737e+01,-1.000000000000000000e+02,-1.000000000000000000e+02,-1.000000000000000000e+02,-1.000000000000000000e+02,-9.999999999999992895e+01,-9.999999999999997158e+01,-9.999999999999998579e+01,-9.999999999999991473e+01,-9.999999999999998579e+01,-9.999999999999994316e+01,-9.999999999999991473e+01,-9.999999999999998579e+01,-9.999999999999997158e+01,-9.999999999999998579e+01,-9.999999999999982947e+01,-9.999999999999985789e+01,-9.999999999999980105e+01,-1.000000000000000000e+02,-1.000000000000000000e+02,-1.000000000000000000e+02,-9.999999999999980105e+01,-9.999999999999998579e+01,-9.999999999999984368e+01,-9.999999999999998579e+01,-3.463363615000660811e-01
-1.000000000000000000e+02,-1.000000000000000000e+02,-1.000000000000000000e+02,-1.000000000000000000e+02,-1.000000000000000000e+02,-1.000000000000000000e+02,-1.000000000000000000e+02,-1.000000000000000000e+02,-9.999999999999990052e+01,-9.999999999999991473e+01,-1.000000000000000000e+02,-9.999999999999988631e+01,-1.000000000000000000e+02,-1.000000000000000000e+02,-9.999999999999997158e+01,-1.000000000000000000e+02,-9.999999999999990052e+01,-1.000000000000000000e+02,-9.999999999999997158e+01,-9.999999999999980105e+01,-1.000000000000000000e+02,-9.999999999999998579e+01,-1.000000000000000000e+02,-1.000000000000000000e+02,-9.999999999999985789e+01,-9.999999999999988631e+01,-9.999999999999982947e+01,-9.999999999999988631e+01,-1.000000000000000000e+02,-3.463363582921130113e-01
-9.999999999999998579e+01,-1.000000000000000000e+02,-1.000000000000000000e+02,-1.000000000000000000e+02,-1.000000000000000000e+02,-9.999999999999995737e+01,-9.999999999999982947e+01,-1.000000000000000000e+02,-9.999999999999994316e+01,-1.000000000000000000e+02,-1.000000000000000000e+02,-9.999999999999994316e+01,-9.999999999999991473e+01,-9.999999999999990052e+01,-1.000000000000000000e+02,-9.999999999999994316e+01,-1.000000000000000000e+02,-1.000000000000000000e+02,-9.999999999999988631e+01,-9.999999999999984368e+01,-9.999999999999981526e+01,-9.999999999999992895e+01,-1.000000000000000000e+02,-9.999999999999997158e+01,-9.999999999999982947e+01,-9.999999999999980105e+01,-1.000000000000000000e+02,-9.999999999999980105e+01,-1.000000000000000000e+02,-9.999999999999963052e+01
-9.999999999999982947e+01,-1.000000000000000000e+02,-1.000000000000000000e+02,-1.000000000000000000e+02,-1.000000000000000000e+02,-1.000000000000000000e+02,-1.000000000000000000e+02,-1.000000000000000000e+02,-1.000000000000000000e+02,-9.999999999999997158e+01,-9.999999999999990052e+01,-9.999999999999990052e+01,-1.000000000000000000e+02,-1.000000000000000000e+02,-1.000000000000000000e+02,-1.000000000000000000e+02,-9.999999999999998579e+01,-1.000000000000000000e+02,-1.000000000000000000e+02,-1.000000000000000000e+02,-1.000000000000000000e+02,-9.999999999999982947e+01,-9.999999999999982947e+01,-1.000000000000000000e+02,-1.000000000000000000e+02,-9.999999999999981526e+01,-9.999999999999998579e+01,-9.999999999999982947e+01,-9.999999999999980105e+01,1.000000000000000000e+02
-1.000000000000000000e+02,-1.000000000000000000e+02,-9.999999999999991473e+01,-9.999999999999975842e+01,-1.000000000000000000e+02,-1.000000000000000000e+02,-1.000000000000000000e+02,-1.000000000000000000e+02,-9.999999999999987210e+01,-1.000000000000000000e+02,-1.000000000000000000e+02,-9.999999999999934630e+01,-9.999999999999991473e+01,-9.999999999999992895e+01,-1.000000000000000000e+02,-9.999999999999998579e+01,-1.000000000000000000e+02,-9.999999999999981526e+01,-9.999999999999997158e+01,-1.000000000000000000e+02,-1.000000000000000000e+02,-9.999999999999982947e+01,-9.999999999999984368e+01,-9.999999999999981526e+01,-1.000000000000000000e+02,-9.999999999999990052e+01,-1.000000000000000000e+02,-9.999999999999994316e+01,-9.999999999999992895e+01,3.463363307896146770e-01
-1.000000000000000000e+02,-9.999999999999981526e+01,-1.000000000000000000e+02,-1.000000000000000000e+02,-9.999999999999995737e+01,-1.000000000000000000e+02,-1.000000000000000000e+02,-1.000000000000000000e+02,-1.000000000000000000e+02,-9.999999999999987210e+01,-1.000000000000000000e+02,-1.000000000000000000e+02,-9.999999999999997158e+01,-1.000000000000000000e+02,-9.999999999999991473e+01,-9.999999999999987210e+01,-9.999999999999997158e+01,-9.999999999999998579e+01,-9.999999999999991473e+01,-1.000000000000000000e+02,-1.000000000000000000e+02,-9.999999999999991473e+01,-9.999999999999980105e+01,-1.000000000000000000e+02,-9.999999999999982947e+01,-9.999999999999980105e+01,-1.000000000000000000e+02,-9.999999999999980105e+01,-9.999999999999998579e+01,9.999999999999911893e+01
-1.000000000000000000e+02,-1.000000000000000000e+02,-1.000000000000000000e+02,-1.000000000000000000e+02,-1.000000000000000000e+02,-1.000000000000000000e+02,-1.000000000000000000e+02,-9.999999999999980105e+01,-1.000000000000000000e+02,-9.999999999999992895e+01,-1.000000000000000000e+02,-9.999999999999980105e+01,-9.999999999999990052e+01,-9.999999999999997158e+01,-1.000000000000000000e+02,-9.999999999999998579e+01,-1.000000000000000000e+02,-1.000000000000000000e+02,-9.999999999999984368e+01,-9.999999999999997158e+01,-9.999999999999987210e+01,-9.999999999999984368e+01,-9.999999999999980105e+01,-1.000000000000000000e+02,-9.999999999999980105e+01,-1.000000000000000000e+02,-1.000000000000000000e+02,-1.000000000000000000e+02,-9.999999999999991473e+01,-3.463363346792175390e-01
-1.000000000000000000e+02,-1.000000000000000000e+02,-1.000000000000000000e+02,-1.000000000000000000e+02,-1.000000000000000000e+02,-1.000000000000000000e+02,-1.000000000000000000e+02,-1.000000000000000000e+02,-1.000000000000000000e+02,-9.999999999999998579e+01,-1.000000000000000000e+02,-9.999999999999991473e+01,-1.000000000000000000e+02,-9.999999999999995737e+01,-1.000000000000000000e+02,-1.000000000000000000e+02,-9.999999999999974420e+01,-1.000000000000000000e+02,-1.000000000000000000e+02,-9.999999999999981526e+01,-9.999999999999998579e+01,-9.999999999999987210e+01,-9.999999999999981526e+01,-1.000000000000000000e+02,-1.000000000000000000e+02,-1.000000000000000000e+02,-1.000000000000000000e+02,-9.999999999999988631e+01,-1.000000000000000000e+02,-1.000000000000000000e+02
-9.999999999999998579e+01,-1.000000000000000000e+02,-1.000000000000000000e+02,-9.999999999999994316e+01,-1.000000000000000000e+02,-1.000000000000000000e+02,-1.000000000000000000e+02,-1.000000000000000000e+02,-1.000000000000000000e+02,-1.000000000000000000e+02,-1.000000000000000000e+02,-9.999999999999992895e+01,-1.000000000000000000e+02,-1.000000000000000000e+02,-1.000000000000000000e+02,-1.000000000000000000e+02,-9.999999999999988631e+01,-1.000000000000000000e+02,-1.000000000000000000e+02,-9.999999999999982947e+01,-1.000000000000000000e+02,-1.000000000000000000e+02,-1.000000000000000000e+02,-1.000000000000000000e+02,-1.000000000000000000e+02,-9.999999999999981526e+01,-1.000000000000000000e+02,-1.000000000000000000e+02,-9.999999999999988631e+01,3.463363257128805328e-01
-1.000000000000000000e+02,-1.000000000000000000e+02,-1.000000000000000000e+02,-1.000000000000000000e+02,-1.000000000000000000e+02,-1.000000000000000000e+02,-1.000000000000000000e+02,-1.000000000000000000e+02,-1.000000000000000000e+02,-1.000000000000000000e+02,-9.999999999999987210e+01,-1.000000000000000000e+02,-9.999999999999998579e+01,-1.000000000000000000e+02,-1.000000000000000000e+02,-1.000000000000000000e+02,-1.000000000000000000e+02,-9.999999999999985789e+01,-1.000000000000000000e+02,-1.000000000000000000e+02,-1.000000000000000000e+02,-1.000000000000000000e+02,-9.999999999999980105e+01,-1.000000000000000000e+02,-1.000000000000000000e+02,-1.000000000000000000e+02,-9.999999999999981526e+01,-1.000000000000000000e+02,-1.000000000000000000e+02,-3.463363610847364216e-01
-1.000000000000000000e+02,-1.000000000000000000e+02,-1.000000000000000000e+02,-1.000000000000000000e+02,-1.000000000000000000e+02,-1.000000000000000000e+02,-1.000000000000000000e+02,-1.000000000000000000e+02,-1.000000000000000000e+02,-9.999999999999990052e+01,-1.000000000000000000e+02,-9.999999999999980105e+01,-1.000000000000000000e+02,-1.000000000000000000e+02,-9.999999999999998579e+01,-1.000000000000000000e+02,-1.000000000000000000e+02,-1.000000000000000000e+02,-1.000000000000000000e+02,-1.000000000000000000e+02,-1.000000000000000000e+02,-9.999999999999980105e+01,-1.000000000000000000e+02,-1.000000000000000000e+02,-1.000000000000000000e+02,-1.000000000000000000e+02,-1.000000000000000000e+02,-1.000000000000000000e+02,-1.000000000000000000e+02,-3.463363166182160113e-01
-1.000000000000000000e+02,-1.000000000000000000e+02,-9.999999999999995737e+01,-1.000000000000000000e+02,-1.000000000000000000e+02,-1.000000000000000000e+02,-1.000000000000000000e+02,-1.000000000000000000e+02,-1.000000000000000000e+02,-1.000000000000000000e+02,-9.999999999999988631e+01,-9.999999999999998579e+01,-9.999999999999995737e+01,-9.999999999999992895e+01,-9.999999999999995737e+01,-9.999999999999990052e+01,-1.000000000000000000e+02,-1.000000000000000000e+02,-9.999999999999984368e+01,-1.000000000000000000e+02,-1.000000000000000000e+02,-9.999999999999980105e+01,-1.000000000000000000e+02,-1.000000000000000000e+02,-9.999999999999997158e+01,-1.000000000000000000e+02,-9.999999999999987210e+01,-9.999999999999981526e+01,-9.999999999999998579e+01,9.999999999999930367e+01
-1.000000000000000000e+02,-1.000000000000000000e+02,-1.000000000000000000e+02,-9.999999999999988631e+01,-1.000000000000000000e+02,-1.000000000000000000e+02,-1.000000000000000000e+02,-1.000000000000000000e+02,-1.000000000000000000e+02,-9.999999999999998579e+01,-9.999999999999994316e+01,-1.000000000000000000e+02,-1.000000000000000000e+02,-1.000000000000000000e+02,-1.000000000000000000e+02,-9.999999999999992895e+01,-9.999999999999994316e+01,-1.000000000000000000e+02,-1.000000000000000000e+02,-9.999999999999980105e+01,-1.000000000000000000e+02,-1.000000000000000000e+02,-1.000000000000000000e+02,-9.999999999999981526e+01,-9.999999999999991473e+01,-9.999999999999982947e+01,-1.000000000000000000e+02,-1.000000000000000000e+02,-1.000000000000000000e+02,1.000000000000000000e+02
-9.999999999999998579e+01,-1.000000000000000000e+02,-1.000000000000000000e+02,-1.000000000000000000e+02,-1.000000000000000000e+02,-1.000000000000000000e+02,-1.000000000000000000e+02,-1.000000000000000000e+02,-1.000000000000000000e+02,-1.000000000000000000e+02,-9.999999999999982947e+01,-1.000000000000000000e+02,-9.999999999999991473e+01,-1.000000000000000000e+02,-9.999999999999988631e+01,-1.000000000000000000e+02,-9.999999999999997158e+01,-1.000000000000000000e+02,-1.000000000000000000e+02,-1.000000000000000000e+02,-1.000000000000000000e+02,-9.999999999999982947e+01,-9.999999999999980105e+01,-1.000000000000000000e+02,-1.000000000000000000e+02,-9.999999999999992895e+01,-1.000000000000000000e+02,-1.000000000000000000e+02,-1.000000000000000000e+02,3.463363586582877129e-01
-1.000000000000000000e+02,-1.000000000000000000e+02,-1.000000000000000000e+02,-1.000000000000000000e+02,-1.000000000000000000e+02,-1.000000000000000000e+02,-1.000000000000000000e+02,-1.000000000000000000e+02,-1.000000000000000000e+02,-1.000000000000000000e+02,-1.000000000000000000e+02,-1.000000000000000000e+02,-1.000000000000000000e+02,-9.999999999999990052e+01,-9.999999999999987210e+01,-1.000000000000000000e+02,-9.999999999999975842e+01,-1.000000000000000000e+02,-1.000000000000000000e+02,-9.999999999999980105e+01,-1.000000000000000000e+02,-9.999999999999980105e+01,-1.000000000000000000e+02,-9.999999999999997158e+01,-1.000000000000000000e+02,-1.000000000000000000e+02,-9.999999999999981526e+01,-1.000000000000000000e+02,-1.000000000000000000e+02,9.999999999999998579e+01
-1.000000000000000000e+02,-1.000000000000000000e+02,-1.000000000000000000e+02,-1.000000000000000000e+02,-1.000000000000000000e+02,-1.000000000000000000e+02,-1.000000000000000000e+02,-1.000000000000000000e+02,-1.000000000000000000e+02,-9.999999999999998579e+01,-1.000000000000000000e+02,-1.000000000000000000e+02,-9.999999999999992895e+01,-1.000000000000000000e+02,-1.000000000000000000e+02,-1.000000000000000000e+02,-9.999999999999975842e+01,-1.000000000000000000e+02,-9.999999999999984368e+01,-9.999999999999980105e+01,-1.000000000000000000e+02,-1.000000000000000000e+02,-9.999999999999980105e+01,-1.000000000000000000e+02,-1.000000000000000000e+02,-9.999999999999984368e+01,-9.999999999999982947e+01,-9.999999999999990052e+01,-1.000000000000000000e+02,9.999999999999998579e+01
-1.000000000000000000e+02,-1.000000000000000000e+02,-1.000000000000000000e+02,-1.000000000000000000e+02,-1.000000000000000000e+02,-9.999999999999995737e+01,-9.999999999999998579e+01,-9.999999999999990052e+01,-1.000000000000000000e+02,-1.000000000000000000e+02,-9.999999999999994316e+01,-9.999999999999990052e+01,-9.999999999999990052e+01,-9.999999999999998579e+01,-9.999999999999997158e+01,-1.000000000000000000e+02,-9.999999999999991473e+01,-1.000000000000000000e+02,-9.999999999999988631e+01,-1.000000000000000000e+02,-9.999999999999982947e+01,-9.999999999999988631e+01,-9.999999999999984368e+01,-1.000000000000000000e+02,-9.999999999999995737e+01,-1.000000000000000000e+02,-9.999999999999982947e+01,-9.999999999999982947e+01,-1.000000000000000000e+02,-9.999999999999994316e+01
-9.999999999999978684e+01,-1.000000000000000000e+02,-1.000000000000000000e+02,-1.000000000000000000e+02,-1.000000000000000000e+02,-9.999999999999995737e+01,-9.999999999999995737e+01,-9.999999999999974420e+01,-1.000000000000000000e+02,-9.999999999999998579e+01,-9.999999999999990052e+01,-1.000000000000000000e+02,-9.999999999999998579e+01,-1.000000000000000000e+02,-1.000000000000000000e+02,-9.999999999999990052e+01,-1.000000000000000000e+02,-1.000000000000000000e+02,-9.999999999999995737e+01,-1.000000000000000000e+02,-9.999999999999990052e+01,-9.999999999999980105e+01,-1.000000000000000000e+02,-1.000000000000000000e+02,-9.999999999999994316e+01,-9.999999999999985789e+01,-9.999999999999987210e+01,-9.999999999999982947e+01,-9.999999999999987210e+01,-3.463363273222907490e-01
-9.999999999999982947e+01,-9.999999999999997158e+01,-1.000000000000000000e+02,-1.000000000000000000e+02,-1.000000000000000000e+02,-1.000000000000000000e+02,-1.000000000000000000e+02,-1.000000000000000000e+02,-1.000000000000000000e+02,-9.999999999999987210e+01,-9.999999999999998579e+01,-1.000000000000000000e+02,-9.999999999999998579e+01,-1.000000000000000000e+02,-9.999999999999991473e+01,-9.999999999999997158e+01,-9.999999999999998579e+01,-9.999999999999997158e+01,-1.000000000000000000e+02,-9.999999999999982947e+01,-9.999999999999988631e+01,-1.000000000000000000e+02,-1.000000000000000000e+02,-9.999999999999980105e+01,-1.000000000000000000e+02,-9.999999999999994316e+01,-1.000000000000000000e+02,-9.999999999999987210e+01,-1.000000000000000000e+02,-9.999999999999926104e+01
-1.000000000000000000e+02,-1.000000000000000000e+02,-1.000000000000000000e+02,-1.000000000000000000e+02,-1.000000000000000000e+02,-1.000000000000000000e+02,-1.000000000000000000e+02,-1.000000000000000000e+02,-1.000000000000000000e+02,-1.000000000000000000e+02,-9.999999999999974420e+01,-1.000000000000000000e+02,-1.000000000000000000e+02,-1.000000000000000000e+02,-1.000000000000000000e+02,-1.000000000000000000e+02,-9.999999999999997158e+01,-1.000000000000000000e+02,-1.000000000000000000e+02,-1.000000000000000000e+02,-1.000000000000000000e+02,-1.000000000000000000e+02,-1.000000000000000000e+02,-1.000000000000000000e+02,-9.999999999999980105e+01,-1.000000000000000000e+02,-9.999999999999981526e+01,-1.000000000000000000e+02,-1.000000000000000000e+02,-1.000000000000000000e+02
-9.999999999999994316e+01,-1.000000000000000000e+02,-1.000000000000000000e+02,-1.000000000000000000e+02,-9.999999999999995737e+01,-1.000000000000000000e+02,-1.000000000000000000e+02,-1.000000000000000000e+02,-1.000000000000000000e+02,-9.999999999999972999e+01,-9.999999999999998579e+01,-1.000000000000000000e+02,-1.000000000000000000e+02,-1.000000000000000000e+02,-9.999999999999994316e+01,-1.000000000000000000e+02,-1.000000000000000000e+02,-1.000000000000000000e+02,-1.000000000000000000e+02,-9.999999999999981526e+01,-9.999999999999997158e+01,-9.999999999999980105e+01,-1.000000000000000000e+02,-1.000000000000000000e+02,-1.000000000000000000e+02,-9.999999999999982947e+01,-9.999999999999988631e+01,-1.000000000000000000e+02,-1.000000000000000000e+02,3.463363188156480255e-01
-1.000000000000000000e+02,-9.999999999999994316e+01,-1.000000000000000000e+02,-1.000000000000000000e+02,-1.000000000000000000e+02,-1.000000000000000000e+02,-1.000000000000000000e+02,-1.000000000000000000e+02,-1.000000000000000000e+02,-1.000000000000000000e+02,-9.999999999999991473e+01,-1.000000000000000000e+02,-9.999999999999991473e+01,-1.000000000000000000e+02,-1.000000000000000000e+02,-1.000000000000000000e+02,-1.000000000000000000e+02,-1.000000000000000000e+02,-9.999999999999995737e+01,-9.999999999999980105e+01,-1.000000000000000000e+02,-1.000000000000000000e+02,-1.000000000000000000e+02,-9.999999999999985789e+01,-9.999999999999981526e+01,-1.000000000000000000e+02,-1.000000000000000000e+02,-1.000000000000000000e+02,-1.000000000000000000e+02,-9.999999999999906208e+01
-1.000000000000000000e+02,-1.000000000000000000e+02,-1.000000000000000000e+02,-9.999999999999985789e+01,-1.000000000000000000e+02,-1.000000000000000000e+02,-1.000000000000000000e+02,-1.000000000000000000e+02,-1.000000000000000000e+02,-1.000000000000000000e+02,-9.999999999999990052e+01,-1.000000000000000000e+02,-9.999999999999990052e+01,-1.000000000000000000e+02,-1.000000000000000000e+02,-9.999999999999992895e+01,-1.000000000000000000e+02,-1.000000000000000000e+02,-9.999999999999997158e+01,-9.999999999999988631e+01,-9.999999999999998579e+01,-9.999999999999982947e+01,-9.999999999999981526e+01,-1.000000000000000000e+02,-9.999999999999997158e+01,-9.999999999999985789e+01,-9.999999999999988631e+01,-9.999999999999981526e+01,-1.000000000000000000e+02,9.999999999999998579e+01
-1.000000000000000000e+02,-1.000000000000000000e+02,-1.000000000000000000e+02,-1.000000000000000000e+02,-1.000000000000000000e+02,-1.000000000000000000e+02,-1.000000000000000000e+02,-1.000000000000000000e+02,-1.000000000000000000e+02,-1.000000000000000000e+02,-9.999999999999982947e+01,-1.000000000000000000e+02,-1.000000000000000000e+02,-1.000000000000000000e+02,-1.000000000000000000e+02,-9.999999999999990052e+01,-1.000000000000000000e+02,-1.000000000000000000e+02,-1.000000000000000000e+02,-1.000000000000000000e+02,-1.000000000000000000e+02,-1.000000000000000000e+02,-9.999999999999998579e+01,-1.000000000000000000e+02,-1.000000000000000000e+02,-1.000000000000000000e+02,-1.000000000000000000e+02,-1.000000000000000000e+02,-1.000000000000000000e+02,-3.463363631880706506e-01
-1.000000000000000000e+02,-1.000000000000000000e+02,-1.000000000000000000e+02,-1.000000000000000000e+02,-1.000000000000000000e+02,-1.000000000000000000e+02,-1.000000000000000000e+02,-1.000000000000000000e+02,-1.000000000000000000e+02,-1.000000000000000000e+02,-9.999999999999985789e+01,-1.000000000000000000e+02,-1.000000000000000000e+02,-1.000000000000000000e+02,-1.000000000000000000e+02,-1.000000000000000000e+02,-9.999999999999988631e+01,-9.999999999999997158e+01,-1.000000000000000000e+02,-9.999999999999980105e+01,-1.000000000000000000e+02,-1.000000000000000000e+02,-1.000000000000000000e+02,-1.000000000000000000e+02,-1.000000000000000000e+02,-1.000000000000000000e+02,-1.000000000000000000e+02,-1.000000000000000000e+02,-1.000000000000000000e+02,3.463363167199491333e-01
-1.000000000000000000e+02,-1.000000000000000000e+02,-1.000000000000000000e+02,-1.000000000000000000e+02,-1.000000000000000000e+02,-1.000000000000000000e+02,-1.000000000000000000e+02,-1.000000000000000000e+02,-9.999999999999974420e+01,-1.000000000000000000e+02,-1.000000000000000000e+02,-9.999999999999991473e+01,-1.000000000000000000e+02,-1.000000000000000000e+02,-1.000000000000000000e+02,-9.999999999999975842e+01,-9.999999999999988631e+01,-1.000000000000000000e+02,-1.000000000000000000e+02,-1.000000000000000000e+02,-9.999999999999988631e+01,-9.999999999999988631e+01,-9.999999999999981526e+01,-1.000000000000000000e+02,-9.999999999999981526e+01,-1.000000000000000000e+02,-1.000000000000000000e+02,-9.999999999999987210e+01,-1.000000000000000000e+02,3.463363605153879643e-01
