1.000000000000000000e+02,1.000000000000000000e+02,8.900000000000001421e+01,1.000000000000000000e+02,-1.000000000000000000e+02,-1.000000000000000000e+02,-1.000000000000000000e+02,1.000000000000000000e+02,-1.000000000000000000e+02,1.000000000000000000e+02
1.000000000000000000e+02,-1.000000000000000000e+02,1.000000000000000000e+02,-1.000000000000000000e+02,1.000000000000000000e+02,1.000000000000000000e+02,-1.000000000000000000e+02,8.900000000000001421e+01,-1.000000000000000000e+02,-1.000000000000000000e+02
-1.000000000000000000e+02,-1.000000000000000000e+02,-1.000000000000000000e+02,-1.000000000000000000e+02,-1.000000000000000000e+02,-1.000000000000000000e+02,-1.000000000000000000e+02,8.900000000000001421e+01,-1.000000000000000000e+02,-1.000000000000000000e+02
-1.000000000000000000e+02,1.000000000000000000e+02,8.900000000000001421e+01,-1.000000000000000000e+02,-1.000000000000000000e+02,1.000000000000000000e+02,-1.000000000000000000e+02,1.000000000000000000e+02,-1.000000000000000000e+02,1.000000000000000000e+02
-1.000000000000000000e+02,1.000000000000000000e+02,-1.000000000000000000e+02,1.000000000000000000e+02,-1.000000000000000000e+02,-1.000000000000000000e+02,8.900000000000001421e+01,1.000000000000000000e+02,1.000000000000000000e+02,-1.000000000000000000e+02
1.000000000000000000e+02,1.000000000000000000e+02,-1.000000000000000000e+02,1.000000000000000000e+02,1.000000000000000000e+02,8.900000000000001421e+01,-1.000000000000000000e+02,-1.000000000000000000e+02,1.000000000000000000e+02,-1.000000000000000000e+02
1.000000000000000000e+02,8.900000000000001421e+01,-1.000000000000000000e+02,-1.000000000000000000e+02,-1.000000000000000000e+02,1.000000000000000000e+02,-1.000000000000000000e+02,-1.000000000000000000e+02,-1.000000000000000000e+02,-1.000000000000000000e+02
1.000000000000000000e+02,-1.000000000000000000e+02,1.000000000000000000e+02,-1.000000000000000000e+02,1.000000000000000000e+02,1.000000000000000000e+02,8.900000000000001421e+01,-1.000000000000000000e+02,-1.000000000000000000e+02,1.000000000000000000e+02
1.000000000000000000e+02,-1.000000000000000000e+02,1.000000000000000000e+02,1.000000000000000000e+02,-1.000000000000000000e+02,8.900000000000001421e+01,-1.000000000000000000e+02,-1.000000000000000000e+02,-1.000000000000000000e+02,-1.000000000000000000e+02
-1.000000000000000000e+02,1.000000000000000000e+02,-1.000000000000000000e+02,1.000000000000000000e+02,8.900000000000001421e+01,-1.000000000000000000e+02,1.000000000000000000e+02,-1.000000000000000000e+02,-1.000000000000000000e+02,1.000000000000000000e+02
1.000000000000000000e+02,1.000000000000000000e+02,-1.000000000000000000e+02,-1.000000000000000000e+02,-1.000000000000000000e+02,8.900000000000001421e+01,1.000000000000000000e+02,-1.000000000000000000e+02,-1.000000000000000000e+02,-1.000000000000000000e+02
1.000000000000000000e+02,-1.000000000000000000e+02,1.000000000000000000e+02,1.000000000000000000e+02,-1.000000000000000000e+02,-1.000000000000000000e+02,8.900000000000001421e+01,1.000000000000000000e+02,1.000000000000000000e+02,1.000000000000000000e+02
1.000000000000000000e+02,1.000000000000000000e+02,-1.000000000000000000e+02,8.900000000000001421e+01,1.000000000000000000e+02,1.000000000000000000e+02,1.000000000000000000e+02,-1.000000000000000000e+02,-1.000000000000000000e+02,-1.000000000000000000e+02
-1.000000000000000000e+02,1.000000000000000000e+02,1.000000000000000000e+02,1.000000000000000000e+02,-1.000000000000000000e+02,1.000000000000000000e+02,-1.000000000000000000e+02,1.000000000000000000e+02,8.900000000000001421e+01,-1.000000000000000000e+02
1.000000000000000000e+02,-1.000000000000000000e+02,-1.000000000000000000e+02,-1.000000000000000000e+02,-1.000000000000000000e+02,1.000000000000000000e+02,-1.000000000000000000e+02,8.900000000000001421e+01,-1.000000000000000000e+02,-1.000000000000000000e+02
-1.000000000000000000e+02,-1.000000000000000000e+02,1.000000000000000000e+02,-1.000000000000000000e+02,1.000000000000000000e+02,-1.000000000000000000e+02,8.900000000000001421e+01,-1.000000000000000000e+02,-1.000000000000000000e+02,-1.000000000000000000e+02
1.000000000000000000e+02,1.000000000000000000e+02,-1.000000000000000000e+02,-1.000000000000000000e+02,-1.000000000000000000e+02,-1.000000000000000000e+02,-1.000000000000000000e+02,1.000000000000000000e+02,8.900000000000001421e+01,-1.000000000000000000e+02
1.000000000000000000e+02,1.000000000000000000e+02,-1.000000000000000000e+02,-1.000000000000000000e+02,-1.000000000000000000e+02,1.000000000000000000e+02,1.000000000000000000e+02,1.000000000000000000e+02,8.900000000000001421e+01,-1.000000000000000000e+02
-1.000000000000000000e+02,-1.000000000000000000e+02,-1.000000000000000000e+02,1.000000000000000000e+02,1.000000000000000000e+02,1.000000000000000000e+02,-1.000000000000000000e+02,-1.000000000000000000e+02,8.900000000000001421e+01,-1.000000000000000000e+02
1.000000000000000000e+02,-1.000000000000000000e+02,-1.000000000000000000e+02,1.000000000000000000e+02,1.000000000000000000e+02,1.000000000000000000e+02,8.900000000000001421e+01,1.000000000000000000e+02,1.000000000000000000e+02,-1.000000000000000000e+02
-1.000000000000000000e+02,1.000000000000000000e+02,1.000000000000000000e+02,1.000000000000000000e+02,-1.000000000000000000e+02,8.900000000000001421e+01,-1.000000000000000000e+02,1.000000000000000000e+02,1.000000000000000000e+02,1.000000000000000000e+02
1.000000000000000000e+02,8.900000000000001421e+01,1.000000000000000000e+02,-1.000000000000000000e+02,-1.000000000000000000e+02,1.000000000000000000e+02,-1.000000000000000000e+02,-1.000000000000000000e+02,-1.000000000000000000e+02,-1.000000000000000000e+02
1.000000000000000000e+02,1.000000000000000000e+02,-1.000000000000000000e+02,-1.000000000000000000e+02,8.900000000000001421e+01,1.000000000000000000e+02,-1.000000000000000000e+02,-1.000000000000000000e+02,-1.000000000000000000e+02,-1.000000000000000000e+02
1.000000000000000000e+02,1.000000000000000000e+02,1.000000000000000000e+02,-1.000000000000000000e+02,1.000000000000000000e+02,1.000000000000000000e+02,8.900000000000001421e+01,-1.000000000000000000e+02,1.000000000000000000e+02,-1.000000000000000000e+02
-1.000000000000000000e+02,-1.000000000000000000e+02,8.900000000000001421e+01,-1.000000000000000000e+02,-1.000000000000000000e+02,1.000000000000000000e+02,-1.000000000000000000e+02,1.000000000000000000e+02,1.000000000000000000e+02,-1.000000000000000000e+02
1.000000000000000000e+02,-1.000000000000000000e+02,8.900000000000001421e+01,-1.000000000000000000e+02,-1.000000000000000000e+02,-1.000000000000000000e+02,1.000000000000000000e+02,-1.000000000000000000e+02,1.000000000000000000e+02,-1.000000000000000000e+02
-1.000000000000000000e+02,1.000000000000000000e+02,-1.000000000000000000e+02,-1.000000000000000000e+02,8.900000000000001421e+01,-1.000000000000000000e+02,-1.000000000000000000e+02,-1.000000000000000000e+02,1.000000000000000000e+02,-1.000000000000000000e+02
1.000000000000000000e+02,-1.000000000000000000e+02,-1.000000000000000000e+02,1.000000000000000000e+02,-1.000000000000000000e+02,-1.000000000000000000e+02,-1.000000000000000000e+02,1.000000000000000000e+02,8.900000000000001421e+01,-1.000000000000000000e+02
1.000000000000000000e+02,-1.000000000000000000e+02,1.000000000000000000e+02,-1.000000000000000000e+02,1.000000000000000000e+02,8.900000000000001421e+01,1.000000000000000000e+02,-1.000000000000000000e+02,-1.000000000000000000e+02,-1.000000000000000000e+02
1.000000000000000000e+02,-1.000000000000000000e+02,8.900000000000001421e+01,1.000000000000000000e+02,1.000000000000000000e+02,1.000000000000000000e+02,1.000000000000000000e+02,-1.000000000000000000e+02,1.000000000000000000e+02,-1.000000000000000000e+02
