-1.000000000000000000e+02,-1.000000000000000000e+02,-1.000000000000000000e+02,-1.000000000000000000e+02,1.000000000000000000e+02,1.000000000000000000e+02,-1.000000000000000000e+02,-1.386037843348927878e-01,-1.000000000000000000e+02,1.386037843348927878e-01,-1.000000000000000000e+02,-1.000000000000000000e+02,-1.000000000000000000e+02,-1.000000000000000000e+02,-1.000000000000000000e+02,1.386037843348927878e-01,-1.000000000000000000e+02,1.386037843348927878e-01,-1.000000000000000000e+02,-9.657540038967928808e+01,-1.000000000000000000e+02,-1.000000000000000000e+02,-1.000000000000000000e+02,-1.000000000000000000e+02,-1.000000000000000000e+02,-1.000000000000000000e+02,-9.999996625036682474e+01,-1.000000000000000000e+02,-1.000000000000000000e+02,1.000000000000000000e+02
-9.978226970724003309e+01,1.000000000000000000e+02,1.000000000000000000e+02,-1.000000000000000000e+02,-1.000000000000000000e+02,1.000000000000000000e+02,1.386037843348927878e-01,-1.000000000000000000e+02,-1.000000000000000000e+02,-1.000000000000000000e+02,-1.000000000000000000e+02,-1.386037843348927878e-01,-1.000000000000000000e+02,1.386037843348927878e-01,-7.831433392344280264e+01,-1.000000000000000000e+02,-1.000000000000000000e+02,1.386037843348927878e-01,-1.000000000000000000e+02,1.386037843348927878e-01,-1.000000000000000000e+02,9.978240363926201439e+01,-1.000000000000000000e+02,-1.000000000000000000e+02,1.000000000000000000e+02,-1.000000000000000000e+02,-9.999999911092541538e+01,-1.000000000000000000e+02,-1.000000000000000000e+02,-1.000000000000000000e+02
-1.000000000000000000e+02,-1.386037843348927878e-01,-1.000000000000000000e+02,-1.000000000000000000e+02,1.000000000000000000e+02,-1.386037843348927878e-01,-1.000000000000000000e+02,-1.000000000000000000e+02,-1.000000000000000000e+02,-1.000000000000000000e+02,-1.000000000000000000e+02,-1.000000000000000000e+02,1.386037843348927878e-01,-1.000000000000000000e+02,-1.000000000000000000e+02,-1.386037843348927878e-01,-1.000000000000000000e+02,-1.000000000000000000e+02,-1.000000000000000000e+02,-1.000000000000000000e+02,-1.000000000000000000e+02,1.386037843348927878e-01,-1.000000000000000000e+02,-1.000000000000000000e+02,-1.000000000000000000e+02,-1.000000000000000000e+02,-1.000000000000000000e+02,-1.000000000000000000e+02,-1.000000000000000000e+02,1.000000000000000000e+02
1.000000000000000000e+02,-1.000000000000000000e+02,1.386037843348927878e-01,1.000000000000000000e+02,1.386037843348927878e-01,-1.000000000000000000e+02,-1.386037843348927878e-01,-1.000000000000000000e+02,-1.386037843348927878e-01,-1.000000000000000000e+02,-1.000000000000000000e+02,-1.000000000000000000e+02,-1.000000000000000000e+02,1.386034089720284412e-01,-1.000000000000000000e+02,-1.000000000000000000e+02,-1.000000000000000000e+02,-1.386037843348927878e-01,-1.000000000000000000e+02,-1.000000000000000000e+02,-1.000000000000000000e+02,-1.000000000000000000e+02,-1.000000000000000000e+02,-1.000000000000000000e+02,-1.000000000000000000e+02,1.000000000000000000e+02,-1.000000000000000000e+02,-1.386037843348927878e-01,-1.000000000000000000e+02,-1.000000000000000000e+02
-1.000000000000000000e+02,-1.000000000000000000e+02,-1.000000000000000000e+02,1.000000000000000000e+02,-1.386037843348927878e-01,-1.000000000000000000e+02,-1.000000000000000000e+02,1.386037843348927878e-01,-1.000000000000000000e+02,-1.386037843348927878e-01,-1.000000000000000000e+02,-1.000000000000000000e+02,-1.386037843348927878e-01,-1.000000000000000000e+02,-1.000000000000000000e+02,-1.000000000000000000e+02,1.386037843348927878e-01,-1.000000000000000000e+02,1.000000000000000000e+02,-1.000000000000000000e+02,-1.000000000000000000e+02,-1.000000000000000000e+02,1.386037843348927878e-01,-1.000000000000000000e+02,-1.000000000000000000e+02,1.000000000000000000e+02,-9.899165519172690608e+01,-1.000000000000000000e+02,9.998493307688190157e+01,-1.000000000000000000e+02
-1.000000000000000000e+02,-1.000000000000000000e+02,-1.000000000000000000e+02,-1.000000000000000000e+02,-1.000000000000000000e+02,-1.000000000000000000e+02,-1.000000000000000000e+02,-1.000000000000000000e+02,-1.000000000000000000e+02,1.000000000000000000e+02,-1.000000000000000000e+02,-1.000000000000000000e+02,1.386037843348927878e-01,-1.000000000000000000e+02,-1.000000000000000000e+02,-1.386037843348927878e-01,-1.000000000000000000e+02,-1.000000000000000000e+02,-1.000000000000000000e+02,-1.000000000000000000e+02,-1.000000000000000000e+02,-1.386037843348927878e-01,-1.000000000000000000e+02,-1.000000000000000000e+02,-1.000000000000000000e+02,1.386037843348927878e-01,-1.000000000000000000e+02,-1.000000000000000000e+02,1.386037843348927878e-01,-9.921031181146310018e+01
-1.000000000000000000e+02,-1.000000000000000000e+02,-1.000000000000000000e+02,1.386037843348927878e-01,-1.000000000000000000e+02,-1.000000000000000000e+02,-1.386037843348927878e-01,-1.000000000000000000e+02,-1.000000000000000000e+02,-1.000000000000000000e+02,-1.000000000000000000e+02,-4.598405314162533131e+01,-1.000000000000000000e+02,-9.769231344399877059e+01,-1.000000000000000000e+02,-1.386037843348927878e-01,-2.945445410627566929e+01,-1.000000000000000000e+02,-7.369762436552684903e+01,-1.000000000000000000e+02,1.386037843348927878e-01,-1.000000000000000000e+02,-1.000000000000000000e+02,1.386037843348927878e-01,1.000000000000000000e+02,-1.000000000000000000e+02,-1.386037843348927878e-01,-1.000000000000000000e+02,-1.000000000000000000e+02,-1.000000000000000000e+02
1.000000000000000000e+02,-1.000000000000000000e+02,-1.000000000000000000e+02,-1.000000000000000000e+02,-9.790333406492624135e+01,-1.000000000000000000e+02,1.000000000000000000e+02,1.000000000000000000e+02,-1.000000000000000000e+02,-1.000000000000000000e+02,-1.000000000000000000e+02,-1.000000000000000000e+02,1.386037843348927878e-01,-1.000000000000000000e+02,-1.000000000000000000e+02,-1.386037843348927878e-01,-1.000000000000000000e+02,-1.000000000000000000e+02,-1.000000000000000000e+02,-1.000000000000000000e+02,9.968813613302302201e+01,-1.000000000000000000e+02,-1.000000000000000000e+02,-1.000000000000000000e+02,-1.000000000000000000e+02,-1.000000000000000000e+02,-1.000000000000000000e+02,-1.386037843348927878e-01,-1.000000000000000000e+02,-1.386037843348927878e-01
-1.000000000000000000e+02,-7.342421712097421960e+01,-1.000000000000000000e+02,-9.854742240815255627e+01,-1.386037725111203822e-01,-1.000000000000000000e+02,-1.000000000000000000e+02,-9.735620181003127982e+01,-1.000000000000000000e+02,-1.000000000000000000e+02,1.000000000000000000e+02,-1.000000000000000000e+02,-1.000000000000000000e+02,-9.999995686310863618e+01,-1.000000000000000000e+02,1.386037843348927878e-01,-9.999368002072579031e+01,-6.597329096974978313e+01,1.000000000000000000e+02,-1.000000000000000000e+02,1.000000000000000000e+02,-1.000000000000000000e+02,-1.000000000000000000e+02,-1.000000000000000000e+02,1.386037843348927878e-01,-1.000000000000000000e+02,1.386037843348927878e-01,-5.754138489719533567e+00,-9.998584974454517749e+01,-1.000000000000000000e+02
-1.000000000000000000e+02,1.000000000000000000e+02,-1.000000000000000000e+02,-1.000000000000000000e+02,-1.000000000000000000e+02,-1.000000000000000000e+02,-1.000000000000000000e+02,-1.000000000000000000e+02,-1.000000000000000000e+02,-9.999277773249285417e+01,-1.000000000000000000e+02,-1.000000000000000000e+02,-1.000000000000000000e+02,1.386037843348927878e-01,-1.000000000000000000e+02,-1.386037843348927878e-01,-8.067672779654810711e+01,-1.000000000000000000e+02,-9.997571953475386408e+01,1.000000000000000000e+02,1.386037843348927878e-01,-1.000000000000000000e+02,-1.000000000000000000e+02,-1.000000000000000000e+02,-1.000000000000000000e+02,-1.000000000000000000e+02,1.000000000000000000e+02,-1.000000000000000000e+02,-1.000000000000000000e+02,-1.000000000000000000e+02
1.000000000000000000e+02,-1.000000000000000000e+02,-1.000000000000000000e+02,-1.000000000000000000e+02,-1.000000000000000000e+02,-1.386037843348927878e-01,-3.158837846794982340e+01,1.000000000000000000e+02,-1.000000000000000000e+02,1.000000000000000000e+02,-1.000000000000000000e+02,1.000000000000000000e+02,1.386037843348927878e-01,-9.998521295096668382e+01,-1.000000000000000000e+02,-1.000000000000000000e+02,-1.000000000000000000e+02,-1.000000000000000000e+02,-1.000000000000000000e+02,-1.000000000000000000e+02,1.000000000000000000e+02,-1.000000000000000000e+02,1.000000000000000000e+02,-1.000000000000000000e+02,1.386037843348927878e-01,-1.000000000000000000e+02,1.000000000000000000e+02,-1.000000000000000000e+02,-1.000000000000000000e+02,-1.000000000000000000e+02
1.000000000000000000e+02,-1.000000000000000000e+02,-1.386037843348927878e-01,-1.000000000000000000e+02,-1.386037843348927878e-01,-1.000000000000000000e+02,-1.000000000000000000e+02,-1.000000000000000000e+02,1.386037843348927878e-01,-1.000000000000000000e+02,-1.000000000000000000e+02,-1.000000000000000000e+02,-1.386037843348927878e-01,-1.000000000000000000e+02,1.000000000000000000e+02,-1.000000000000000000e+02,-1.000000000000000000e+02,-1.000000000000000000e+02,-1.000000000000000000e+02,-1.000000000000000000e+02,-9.999809008782636965e+01,-1.000000000000000000e+02,-1.000000000000000000e+02,-1.000000000000000000e+02,-1.000000000000000000e+02,9.852045440514235963e+01,-1.000000000000000000e+02,-1.000000000000000000e+02,1.000000000000000000e+02,-1.000000000000000000e+02
-1.000000000000000000e+02,-1.386037843348927878e-01,-1.000000000000000000e+02,-1.000000000000000000e+02,-1.000000000000000000e+02,-1.000000000000000000e+02,1.000000000000000000e+02,1.000000000000000000e+02,-1.000000000000000000e+02,-1.000000000000000000e+02,-1.386037843348927878e-01,-1.000000000000000000e+02,-1.000000000000000000e+02,-1.386037843348927878e-01,-1.000000000000000000e+02,-1.000000000000000000e+02,-9.763729922943994666e+01,-1.000000000000000000e+02,-1.000000000000000000e+02,-1.000000000000000000e+02,-9.826964932114961471e+01,4.781304876704103179e+01,-1.000000000000000000e+02,1.386037843348927878e-01,-1.000000000000000000e+02,-1.000000000000000000e+02,-1.000000000000000000e+02,1.000000000000000000e+02,1.000000000000000000e+02,-1.000000000000000000e+02
-1.000000000000000000e+02,-1.000000000000000000e+02,-1.000000000000000000e+02,-1.000000000000000000e+02,-8.258124256654153328e+01,-1.000000000000000000e+02,1.386037843348927878e-01,-9.999999999980563814e+01,-1.000000000000000000e+02,-1.000000000000000000e+02,1.000000000000000000e+02,-1.000000000000000000e+02,-1.000000000000000000e+02,-1.000000000000000000e+02,1.386037843348927878e-01,-1.000000000000000000e+02,1.000000000000000000e+02,-1.000000000000000000e+02,-1.000000000000000000e+02,-1.000000000000000000e+02,1.386037843348927878e-01,-9.999256611737696687e+01,-1.000000000000000000e+02,1.000000000000000000e+02,1.000000000000000000e+02,-1.000000000000000000e+02,-1.000000000000000000e+02,-7.390181247232382589e+01,-1.000000000000000000e+02,-9.254519750374039688e+01
-9.977613474716130781e+01,-1.000000000000000000e+02,-1.000000000000000000e+02,-1.386037843348927878e-01,-2.563105541765490258e+01,-1.000000000000000000e+02,1.000000000000000000e+02,-1.000000000000000000e+02,-1.000000000000000000e+02,-1.386037843348927878e-01,-1.000000000000000000e+02,-1.000000000000000000e+02,-1.000000000000000000e+02,-1.000000000000000000e+02,-1.000000000000000000e+02,-1.000000000000000000e+02,-1.000000000000000000e+02,-1.000000000000000000e+02,-1.000000000000000000e+02,-1.000000000000000000e+02,-1.386037843348927878e-01,-3.558702821455460708e+01,-1.000000000000000000e+02,7.871035277860535473e+01,-1.000000000000000000e+02,-5.560565751686190339e+01,-1.000000000000000000e+02,-1.000000000000000000e+02,-1.000000000000000000e+02,-9.999886675496152577e+01
-1.000000000000000000e+02,-1.000000000000000000e+02,-1.000000000000000000e+02,-1.000000000000000000e+02,1.000000000000000000e+02,-7.435215624140536761e+01,-1.000000000000000000e+02,-9.998645691144400871e+01,-1.000000000000000000e+02,9.949512251544105368e+01,-1.000000000000000000e+02,-1.000000000000000000e+02,-1.000000000000000000e+02,1.386037843348927878e-01,-1.000000000000000000e+02,1.386037843348927878e-01,-1.744453964466827145e+01,-1.000000000000000000e+02,-1.000000000000000000e+02,-1.000000000000000000e+02,-1.000000000000000000e+02,1.386037843348927878e-01,-1.000000000000000000e+02,-1.386037843348927878e-01,-1.000000000000000000e+02,1.000000000000000000e+02,-1.000000000000000000e+02,-1.000000000000000000e+02,-1.000000000000000000e+02,-8.655738009995764060e+01
-9.998922542934364799e+01,-1.000000000000000000e+02,-9.847922321543309465e+01,1.000000000000000000e+02,-1.000000000000000000e+02,-9.999998665394070940e+01,1.000000000000000000e+02,-1.000000000000000000e+02,-1.000000000000000000e+02,1.000000000000000000e+02,-1.000000000000000000e+02,-1.000000000000000000e+02,-1.386037843348927878e-01,-1.000000000000000000e+02,1.000000000000000000e+02,-1.000000000000000000e+02,-1.000000000000000000e+02,-1.000000000000000000e+02,-1.000000000000000000e+02,1.386037843348927878e-01,-1.000000000000000000e+02,-1.000000000000000000e+02,-1.386037843348927878e-01,-1.000000000000000000e+02,1.000000000000000000e+02,1.386037843348927878e-01,-1.000000000000000000e+02,1.386037843348927878e-01,-1.000000000000000000e+02,-1.000000000000000000e+02
-1.000000000000000000e+02,-1.386037843348927878e-01,-1.000000000000000000e+02,-1.000000000000000000e+02,1.000000000000000000e+02,-1.000000000000000000e+02,1.000000000000000000e+02,-1.000000000000000000e+02,-1.386037843348927878e-01,-1.000000000000000000e+02,-1.000000000000000000e+02,1.000000000000000000e+02,-1.000000000000000000e+02,1.386037843348927878e-01,-1.000000000000000000e+02,-1.000000000000000000e+02,-1.000000000000000000e+02,-1.000000000000000000e+02,-1.386037843348927878e-01,-6.855798867416875453e+01,-1.000000000000000000e+02,1.386037843348927878e-01,-1.000000000000000000e+02,1.000000000000000000e+02,-1.000000000000000000e+02,-1.000000000000000000e+02,1.386037843348927878e-01,-1.000000000000000000e+02,-1.000000000000000000e+02,-1.000000000000000000e+02
-1.000000000000000000e+02,-1.000000000000000000e+02,-1.000000000000000000e+02,-1.386037843348927878e-01,-1.000000000000000000e+02,-1.000000000000000000e+02,9.911774272711629408e+01,-1.000000000000000000e+02,-1.000000000000000000e+02,1.000000000000000000e+02,-9.999302243128282441e+01,-1.000000000000000000e+02,-1.000000000000000000e+02,-1.000000000000000000e+02,-1.000000000000000000e+02,-1.000000000000000000e+02,-1.000000000000000000e+02,-1.000000000000000000e+02,-1.000000000000000000e+02,-1.000000000000000000e+02,-1.000000000000000000e+02,-1.000000000000000000e+02,1.386037843348927878e-01,-1.792633077708798339e+01,1.000000000000000000e+02,-1.000000000000000000e+02,1.386037843348927878e-01,-1.000000000000000000e+02,-1.000000000000000000e+02,-1.386037843348927878e-01
-1.000000000000000000e+02,-1.000000000000000000e+02,-1.000000000000000000e+02,1.386037843348927878e-01,-1.000000000000000000e+02,-9.403366639039710151e+01,-1.000000000000000000e+02,-1.000000000000000000e+02,-1.386037843348927878e-01,-1.000000000000000000e+02,-1.000000000000000000e+02,-1.000000000000000000e+02,1.386037843348927878e-01,-1.000000000000000000e+02,-1.000000000000000000e+02,-1.000000000000000000e+02,-1.000000000000000000e+02,1.386037843348927878e-01,-1.000000000000000000e+02,-1.000000000000000000e+02,1.000000000000000000e+02,-1.000000000000000000e+02,1.000000000000000000e+02,-1.000000000000000000e+02,1.000000000000000000e+02,-1.000000000000000000e+02,-1.000000000000000000e+02,-1.000000000000000000e+02,-1.000000000000000000e+02,-1.386037843348927878e-01
-1.000000000000000000e+02,-1.386037843348927878e-01,-9.985085210176849557e+01,-1.000000000000000000e+02,-1.000000000000000000e+02,-1.000000000000000000e+02,-1.000000000000000000e+02,-1.386037843348927878e-01,-8.186739983348999772e+01,-1.000000000000000000e+02,-1.386037843348927878e-01,-1.000000000000000000e+02,-1.000000000000000000e+02,-6.544022636489960121e+01,-1.000000000000000000e+02,-1.000000000000000000e+02,1.386037843348927878e-01,-1.000000000000000000e+02,-1.000000000000000000e+02,-1.000000000000000000e+02,-9.999915736157834090e+01,-1.000000000000000000e+02,-1.000000000000000000e+02,1.386037843348927878e-01,-1.000000000000000000e+02,-1.000000000000000000e+02,-1.000000000000000000e+02,-1.000000000000000000e+02,-1.000000000000000000e+02,-1.000000000000000000e+02
1.000000000000000000e+02,-1.386037843348927878e-01,1.000000000000000000e+02,-1.000000000000000000e+02,-1.000000000000000000e+02,-1.386037843348927878e-01,-1.000000000000000000e+02,-1.386037843348927878e-01,-1.000000000000000000e+02,-1.000000000000000000e+02,1.000000000000000000e+02,-1.000000000000000000e+02,-1.000000000000000000e+02,-1.000000000000000000e+02,-1.000000000000000000e+02,1.386037843348927878e-01,-2.693349216470121021e+01,-1.000000000000000000e+02,-1.000000000000000000e+02,-1.000000000000000000e+02,-1.000000000000000000e+02,-1.000000000000000000e+02,-1.000000000000000000e+02,-1.000000000000000000e+02,-1.000000000000000000e+02,-1.000000000000000000e+02,1.000000000000000000e+02,-1.386037843348927878e-01,-1.000000000000000000e+02,-1.386037843348927878e-01
1.000000000000000000e+02,-1.000000000000000000e+02,1.000000000000000000e+02,-1.000000000000000000e+02,-1.000000000000000000e+02,-1.000000000000000000e+02,1.386037843348927878e-01,-1.000000000000000000e+02,1.386037843348927878e-01,-9.999920960475293441e+01,1.000000000000000000e+02,-1.000000000000000000e+02,-1.000000000000000000e+02,1.386037843348927878e-01,-1.000000000000000000e+02,1.000000000000000000e+02,1.000000000000000000e+02,1.000000000000000000e+02,-1.386037843348927878e-01,-1.000000000000000000e+02,-1.000000000000000000e+02,-1.000000000000000000e+02,-1.000000000000000000e+02,-1.000000000000000000e+02,-1.000000000000000000e+02,-1.386037843348927878e-01,-1.000000000000000000e+02,1.000000000000000000e+02,-1.000000000000000000e+02,-1.000000000000000000e+02
-1.000000000000000000e+02,-1.386037843348927878e-01,-1.000000000000000000e+02,-1.000000000000000000e+02,-1.000000000000000000e+02,-1.000000000000000000e+02,-1.000000000000000000e+02,-1.000000000000000000e+02,-1.000000000000000000e+02,-1.000000000000000000e+02,-1.000000000000000000e+02,-1.000000000000000000e+02,1.000000000000000000e+02,-1.000000000000000000e+02,-1.386037843348927878e-01,-1.000000000000000000e+02,1.000000000000000000e+02,1.000000000000000000e+02,1.386037843348927878e-01,-1.000000000000000000e+02,1.000000000000000000e+02,1.386037843348927878e-01,1.000000000000000000e+02,-1.386037843348927878e-01,-1.000000000000000000e+02,-1.000000000000000000e+02,-1.000000000000000000e+02,1.000000000000000000e+02,-1.000000000000000000e+02,-1.386037843348927878e-01
-1.000000000000000000e+02,-1.000000000000000000e+02,-9.999845863572345195e+01,-1.000000000000000000e+02,-1.000000000000000000e+02,-1.000000000000000000e+02,-1.000000000000000000e+02,1.000000000000000000e+02,-1.000000000000000000e+02,-1.000000000000000000e+02,-1.000000000000000000e+02,-1.000000000000000000e+02,1.386037843348927878e-01,-1.000000000000000000e+02,-1.386037843348927878e-01,-1.000000000000000000e+02,-9.997886742272410743e+01,1.000000000000000000e+02,-9.985697314155665083e+01,-1.000000000000000000e+02,-1.386037843348927878e-01,-1.000000000000000000e+02,-8.875217003733129673e+01,-1.000000000000000000e+02,-1.000000000000000000e+02,-1.000000000000000000e+02,-1.000000000000000000e+02,-1.000000000000000000e+02,-1.000000000000000000e+02,-1.386037843348927878e-01
-1.000000000000000000e+02,-9.998748860137246197e+01,-1.000000000000000000e+02,-9.905227926118219273e+01,-1.000000000000000000e+02,-9.993035971677596763e+01,1.000000000000000000e+02,-1.000000000000000000e+02,-1.000000000000000000e+02,-1.000000000000000000e+02,-1.000000000000000000e+02,-1.000000000000000000e+02,-1.000000000000000000e+02,-1.000000000000000000e+02,-1.000000000000000000e+02,-1.000000000000000000e+02,-1.386037843348927878e-01,-3.061482410510404151e+01,-9.992172112057599520e+01,-1.000000000000000000e+02,-1.000000000000000000e+02,-1.000000000000000000e+02,-7.283313506513812285e+01,-1.000000000000000000e+02,-1.000000000000000000e+02,-1.000000000000000000e+02,-1.386037843348927878e-01,-1.000000000000000000e+02,-1.000000000000000000e+02,-9.999999972088053823e+01
1.000000000000000000e+02,1.000000000000000000e+02,-1.000000000000000000e+02,-1.000000000000000000e+02,-1.000000000000000000e+02,-1.000000000000000000e+02,-1.386037843348927878e-01,-1.000000000000000000e+02,-1.000000000000000000e+02,-1.000000000000000000e+02,-1.000000000000000000e+02,-1.000000000000000000e+02,-1.000000000000000000e+02,-1.000000000000000000e+02,-1.000000000000000000e+02,-1.386037843348927878e-01,1.000000000000000000e+02,-1.386037843348927878e-01,-1.000000000000000000e+02,-1.000000000000000000e+02,-1.000000000000000000e+02,-9.999984526190563372e+01,-1.000000000000000000e+02,-1.000000000000000000e+02,-1.000000000000000000e+02,-1.000000000000000000e+02,-1.000000000000000000e+02,-1.000000000000000000e+02,-1.386037843348927878e-01,-1.000000000000000000e+02
-1.000000000000000000e+02,-1.000000000000000000e+02,-1.000000000000000000e+02,-1.000000000000000000e+02,1.000000000000000000e+02,1.000000000000000000e+02,-1.000000000000000000e+02,-1.000000000000000000e+02,-1.000000000000000000e+02,-1.000000000000000000e+02,1.386037843348927878e-01,-1.000000000000000000e+02,1.386037843348927878e-01,-1.000000000000000000e+02,-1.000000000000000000e+02,1.386037843348927878e-01,-1.000000000000000000e+02,1.000000000000000000e+02,-1.000000000000000000e+02,-1.000000000000000000e+02,9.997419865767416525e+01,-9.238722785786940506e+01,-1.000000000000000000e+02,-9.998685238418578081e+01,-1.000000000000000000e+02,-1.000000000000000000e+02,-1.000000000000000000e+02,-1.386037843348927878e-01,-1.000000000000000000e+02,-9.999889112478012976e+01
-1.000000000000000000e+02,-1.386037843348927878e-01,-9.999323327245470239e+01,1.000000000000000000e+02,1.000000000000000000e+02,-1.000000000000000000e+02,-1.000000000000000000e+02,1.000000000000000000e+02,-1.000000000000000000e+02,-1.386037843348927878e-01,-1.000000000000000000e+02,-1.000000000000000000e+02,-1.000000000000000000e+02,-6.351236854357186701e+01,-1.000000000000000000e+02,-1.000000000000000000e+02,-1.000000000000000000e+02,-1.000000000000000000e+02,-7.458841219576423498e+01,1.000000000000000000e+02,1.386037843348927878e-01,1.000000000000000000e+02,1.000000000000000000e+02,1.386037843348927878e-01,-1.000000000000000000e+02,1.000000000000000000e+02,-1.386037843348927878e-01,-1.000000000000000000e+02,-1.000000000000000000e+02,-1.000000000000000000e+02
-1.000000000000000000e+02,-1.386037843348927878e-01,-1.000000000000000000e+02,-1.000000000000000000e+02,-1.000000000000000000e+02,1.000000000000000000e+02,-1.000000000000000000e+02,-1.000000000000000000e+02,-1.000000000000000000e+02,-9.980905840359329773e+01,-1.000000000000000000e+02,-1.000000000000000000e+02,1.386037843348927878e-01,-1.000000000000000000e+02,1.000000000000000000e+02,-1.000000000000000000e+02,9.603469315850884414e+01,1.000000000000000000e+02,1.000000000000000000e+02,-1.000000000000000000e+02,1.000000000000000000e+02,-1.000000000000000000e+02,1.386037843348927878e-01,-8.118804008644556802e+01,-9.969513347666295999e+01,-1.000000000000000000e+02,-1.000000000000000000e+02,-1.386037843348927878e-01,1.000000000000000000e+02,-1.000000000000000000e+02
