2.502627972538527246e+01,-5.419988195023427835e+01,5.873665855184279394e+01,-1.347761974757901271e+00,-2.186050324088318320e+01,-7.167294793315160462e+01,-2.733522186228506712e+01,-9.110990261086240594e+01,-6.954731731047030507e+01,-8.615163064694431228e+01
-6.234257070522190247e+01,-8.784889546742638800e+01,6.386642837278488116e+01,7.279889723381924682e+01,-4.831789152674427612e+01,5.321132272903759031e+01,-1.391463638008564629e+01,9.552024540073304593e+01,4.066640659900274812e+01,-7.049154890303350385e+01
-9.873975582314278654e+01,-2.061417216511947714e+01,-3.152037499577037849e+01,7.649785120540136063e+01,6.816579923462846580e-01,-3.180170179109492068e+01,8.620786122968300447e+01,-4.173084418803669848e+01,5.245359320764001154e+01,7.994775095441326584e-01
8.341851092215780739e+01,-5.044212308081517904e+01,-4.506379044854796945e+01,7.239508938106760638e+01,-3.599027426483118575e+01,1.992501481294397081e+00,8.254139090082028929e+01,1.270516638773661100e+01,2.466953376516408269e+01,-7.110174813831648066e+01
-7.086933606706887190e+01,5.838613085091456156e+01,-5.580441904508490580e+01,-3.797333237374880355e+01,-2.236201414589935155e+01,-6.513025343267210587e+01,8.400746067070156187e+01,-5.905724280091756384e+01,-5.593131301289017188e+01,-2.779226747216874571e+01
-2.284478067131487933e+00,-4.454553977336516368e+01,8.938972796903362905e+01,5.332080444296593669e+00,4.200886110900729875e+01,4.693158089550038170e+01,1.339059230006266787e+01,2.260366873046434222e+01,-6.658491788669556399e+01,-2.808323890995607997e+01
7.912714958786347097e+01,1.355999374876624586e+00,5.133287955802835256e+00,3.016250132692987762e+01,4.495488001676966405e+01,5.794823374256466764e+00,-7.251239260336777903e+00,9.533700196438384467e+01,2.976313128312509804e+01,8.897085821990478394e+01
4.210350857860242968e+01,-4.193651368615856967e+01,-9.054041116138765233e+01,-2.898088837140058160e+01,-2.613344840345606457e+01,3.976186051549950662e+01,5.325737454485737032e+01,-3.610364239935336883e+01,-7.091214111863621383e+01,-5.642348577516789021e+01
-1.108860754714378061e+01,-4.761470803743064550e+01,5.056419606522533172e+01,-4.219233051472113516e+01,-2.824251356762443166e+01,-2.155337312658626203e+01,-8.147440636161556426e+01,-6.089119245164908989e+01,-1.810723324071183526e+01,-9.548897144721216534e+01
6.083663212424056610e+01,1.244354638411103586e+01,1.479460819746429223e+01,-4.327277359611678520e+01,9.474518015210261268e+00,9.725354325638059549e+01,-8.764389069641893570e+01,2.960076620745928011e+01,-2.442774841856915202e+01,-1.794680841703581820e+01
-2.171969568912432180e+01,1.462600175503126110e+01,-5.068778326743546359e+01,1.479372074445706176e+00,6.628196113108320731e+01,6.620143150871058424e+01,6.521118944712000598e+01,-7.939635410189195852e+01,-8.374084668914420604e+00,7.717827157373575631e+01
-6.024867502448447709e+01,-7.669839010949101521e+01,-1.725870791532893023e+00,-3.690056801151430932e+01,-6.669026062849484049e+01,6.808950134703529500e+00,-7.056568568163000066e+01,2.989761145386702879e+01,2.192396037100247241e+01,5.611229274953435464e+01
9.957804509632394740e+01,9.622738685702367434e+01,-2.790428955545325351e+01,4.974653570165334315e+01,4.053812677155529798e+01,5.144426822869774441e+01,-3.912611196704040140e+01,-4.043871702944142044e+01,-6.292438868703406740e+00,-4.397171023056468897e+01
4.599848605285818337e+01,6.703533516448342766e+01,4.154485745826804077e+01,2.655815250030138941e+01,1.694462456048874799e+00,2.894198021296353573e+01,1.195207209658744851e+01,4.567567716990469506e+01,-4.108712274382149587e+01,6.847060462741217179e+01
-6.724681692842075620e+01,7.492144099484288233e+01,3.694492798056291605e+01,-3.910541341366126744e+00,3.624737710822178371e+01,6.272977416940145190e+01,5.228343988482968996e+01,-5.588767104993111445e+01,5.514695801720561974e+01,7.787762530896829105e+01
9.851043709536429560e+01,-1.111472767433549080e+01,-8.288945214981048082e+01,3.331990687292535114e+01,-4.884114833181553905e+01,-4.137716366375819632e+00,4.675906063138588564e+01,4.432890795137129913e+01,-7.046988494610629061e+01,-2.644770630836748637e+01
-1.103007466947149418e+01,5.980730180056625045e+00,3.751177676128526883e+01,6.455576351395318113e+01,-3.902649365276040072e+01,-7.582986221554284612e+01,3.557141468191702671e+01,2.146784762442382544e+01,9.445275802091251194e+01,-6.497629019419900942e+01
2.708649175679927268e+01,3.457524957835236279e+00,-7.375732544840167293e+01,8.551958777724561145e+00,3.960033102412031525e+01,-8.941309846993505062e+01,3.437770607855455296e+00,-5.828148433481956658e-01,-3.438795592524368772e+01,4.009928570050400154e+00
-2.854245042349422334e+00,9.397778471760009467e+00,-2.267792848342845957e+01,-3.560962256823013661e+01,-2.622586255866734462e+01,-3.156253682384729231e+01,-6.597177634528648582e+01,-2.770171642719931882e+00,-3.525139152593744996e+01,-5.280704476426151217e+01
-3.923717853613997875e+01,-3.673245101040602378e+01,-5.692461728518026121e+00,6.154976938224281469e+01,9.654010800128182268e+01,7.739499023593135973e+01,3.982247900870622459e+01,-1.408339408588545894e+01,-9.267771206831338304e+01,-5.580576404120412093e+01
-8.973394238716826976e+01,3.085430106091518354e+01,1.875765709598695707e+01,-3.288277244451138870e+01,3.405407277399572052e+01,2.048239385606612473e+01,-7.275943374136025454e+01,9.629822186396425820e+01,9.137245296120129012e+01,1.983860038417016369e+01
-7.693090496181024207e+01,1.620892436865965180e+00,3.135768080180148587e+01,4.949961506713012938e+01,-3.414582863354392117e+01,-6.503449167468215819e+01,3.534449570134918872e+01,4.952489369025681754e+01,7.699671358804140198e+01,-5.576392557865082011e+01
1.835856109739374631e+00,-6.265024980283093470e+01,-4.300856832303558264e+01,-7.129739877093069822e+01,3.257671180931170341e+01,-2.626462914093279721e+01,-8.083027409373968908e+00,3.390289469380537923e+01,9.794125649521005528e+01,9.951560773274016469e+01
4.542153647931856142e+01,-3.692328876951104633e+01,-5.304246573628550010e+01,7.163966251573701527e+01,-6.486706322469147779e+01,4.358609710338308929e+01,-1.331359702465681494e+01,-5.333140159509786571e+01,5.491828121021151077e+01,-4.396143452831023524e+01
1.346396945220651276e+01,2.868248531119601097e+01,6.271324474276926253e+01,-3.899000424749515048e+01,-8.458185183259070072e+01,7.538429815234424325e+01,9.703722678854587969e+01,-9.602991028576757060e+01,-2.380569272305925210e+01,5.197470729988451410e+01
5.870656219013760335e+01,3.045595720128158135e+01,-7.415079146990400716e+01,-6.522883430113482461e+01,-6.558034151313808024e+01,-5.599651001318513011e+01,-1.614109819454591843e+01,3.905600068727212104e+00,1.495475967972329912e+01,-4.664808076971651474e+01
5.938225966099845010e+01,9.272524157265455358e+01,-8.833790262310536434e+00,-7.447653790510864269e+01,3.000914012322444790e+01,-9.330387520604216434e+01,-5.463183123537145747e+00,-6.444271117136391069e+01,-7.030742869419242425e+01,1.125599884381177418e+01
-1.834695037457123590e-01,2.896315319640831376e+01,8.382586191731672898e+01,7.623837161888431524e+00,5.361930010376156019e+00,-3.617710568601027177e+01,8.154326931899593944e+01,7.153749619979377883e+01,-5.017910564937586315e+01,-1.483403134897130116e+01
-2.869261728449069082e+01,6.509191858228393812e+01,-9.032215141647884593e+01,-5.253041249718698680e+01,-5.690018023005248438e+01,1.101559676323938675e+01,5.463693334644619881e+01,7.647956290016736602e+01,6.287015844557235766e+01,-1.134463812027414065e+01
-7.999736862728113351e+01,3.825741703199435051e+01,5.161366514786159598e+01,6.253764005424342542e+01,-1.589391769312620895e+01,-6.775906120952167555e+01,-1.970972087115802651e+01,-7.866305490047453475e+01,-3.192989505512768034e+01,-4.672749029332815951e+01
