-8.161818701299836221e+01,-8.276448519475856358e+01,4.889634021690414301e+01,-5.076040970935481766e+01,-4.010342571553518809e+01,-1.000000000000000000e+02,-3.207361331185062170e+01,-6.083092834001089955e+01,9.802478116408295250e+01,2.555605701285248799e+01
1.000000000000000000e+02,-9.870966242643723376e+01,1.000000000000000000e+02,-7.183921974015345313e+01,-1.000000000000000000e+02,-1.000000000000000000e+02,-1.000000000000000000e+02,-9.992971986454257660e+01,-1.000000000000000000e+02,-1.000000000000000000e+02
-5.987028228104541228e+01,-8.658308023958025501e+01,3.160120035400580818e+01,8.352600712358510293e+01,-9.470787267613197002e+00,-5.026621056166659685e+01,1.110012019444202025e-01,-1.000000000000000000e+02,4.043650621722440519e+01,-1.600291709027656140e+01
-1.244506058081058342e+01,-4.955996073319386852e+01,-1.000000000000000000e+02,-9.899864404929316208e+01,-1.000000000000000000e+02,-9.871721374962297091e+01,1.692788956094811681e+01,-8.016763139919987680e+01,-9.098762109872254200e+01,-3.472671512939157878e+01
6.783157578264463439e+01,9.389728287985313671e+01,-1.000000000000000000e+02,1.031866787504585048e+01,4.417405334151392537e+01,-1.000000000000000000e+02,-5.945515979460915901e+01,-6.446625154572375038e+01,-1.000000000000000000e+02,1.000000000000000000e+02
-5.418023226039333906e+01,-9.115879642620528500e+01,-1.000000000000000000e+02,-1.031866787504577410e+01,-1.000000000000000000e+02,-1.796454535409302977e+01,-3.111673424575864288e+01,4.427403929388201043e+00,3.299242954981345122e+01,-1.000000000000000000e+02
-9.997260217915247438e+01,-6.390682642115110212e+01,-1.000000000000000000e+02,-1.000000000000000000e+02,-9.992971986454257660e+01,1.000000000000000000e+02,-1.000000000000000000e+02,-1.000000000000000000e+02,1.579463864073575508e+01,-1.000000000000000000e+02
-1.000000000000000000e+02,-7.544980810963062368e+01,-1.000000000000000000e+02,-6.520512828890863943e+01,-1.000000000000000000e+02,-9.902553308080103989e+01,-9.999400004642215833e+01,-1.000000000000000000e+02,4.144246223491046521e+01,-4.454007216593122109e+01
-6.203815710831261043e+00,-1.000000000000000000e+02,-1.000000000000000000e+02,-5.798831351668078327e+01,-1.000000000000000000e+02,-4.454414697823745328e-01,-6.590641442073271605e+01,-8.002715536979657429e+01,-1.000000000000000000e+02,-1.000000000000000000e+02
2.916053600863856232e+01,-5.247696529195757620e+01,-4.635232505165100036e+01,-1.000000000000000000e+02,-5.994600326789580436e+01,-9.958898285009458107e+01,-9.777018986062782346e+01,-8.849416600396074273e+01,-7.203916314564342827e+01,-1.000000000000000000e+02
1.343167723498484101e+01,-9.182637599163290076e+01,-1.000000000000000000e+02,-1.000000000000000000e+02,-9.992971986454257660e+01,-1.000000000000000000e+02,-1.000000000000000000e+02,-6.231754121558599024e+01,-4.501528818141047594e+01,-1.000000000000000000e+02
-9.992971986454257660e+01,-1.000000000000000000e+02,1.000000000000000000e+02,9.964844573030353558e+01,-1.000000000000000000e+02,-1.000000000000000000e+02,-2.916490029912466042e+01,-6.304255608085249918e+01,-1.000000000000000000e+02,1.000000000000000000e+02
1.000000000000000000e+02,-1.000000000000000000e+02,-3.754014767764374483e+01,-1.000000000000000000e+02,9.907194510464995574e+01,9.648707580866083333e+01,2.398987248770936276e-01,1.017679468669242837e+01,8.452929502321872235e+01,-6.410733293246047992e+01
-1.000000000000000000e+02,1.894081504895479284e+01,-2.951250919119742022e+01,-3.754014767764374483e+01,1.000000000000000000e+02,-6.482657806123528133e+01,-7.257728112349042249e+01,1.985518025502660322e+01,-9.999884352984183522e+01,-6.923598872915928837e+01
-2.641607811714466791e+01,-3.754014767764374483e+01,-1.000000000000000000e+02,-1.000000000000000000e+02,-9.441574265470819682e+01,3.585881064142711239e+01,-7.726754082609150487e+01,-1.000000000000000000e+02,1.355592009885369542e+01,-2.835349020173453383e+01
8.284423648768054704e+01,-1.000000000000000000e+02,-1.000000000000000000e+02,-1.000000000000000000e+02,-1.000000000000000000e+02,-7.328680240923924316e+01,-9.516954338912002243e+01,5.507289999993549401e+01,-7.186029579479061624e+01,4.499809172476008712e+01
2.172137787037795675e+01,1.000000000000000000e+02,-2.611745348831792768e+01,-5.498837037663413696e+01,-4.140147781573375596e-01,-1.731630615252141681e+01,-7.758219553190339468e+01,9.885530103233021748e+01,-9.381950479169701396e+01,-1.000000000000000000e+02
-9.188153600442714719e+01,1.000000000000000000e+02,-9.358054326772226261e+00,-1.000000000000000000e+02,1.000000000000000000e+02,9.839975798539128959e+01,-1.000000000000000000e+02,-1.031866787504577410e+01,-1.000000000000000000e+02,9.974698492282482221e+01
-9.998757335622862286e+01,3.309042110302977591e+01,6.258033899976435777e+00,-7.934042067628087125e+01,-1.000000000000000000e+02,-1.000000000000000000e+02,-8.917153726867999808e+01,-1.000000000000000000e+02,-7.079313733729362923e+01,-1.000000000000000000e+02
-1.000000000000000000e+02,-5.688710974150025379e+01,-1.000000000000000000e+02,9.114883430819406840e+01,-5.038225671568122976e+01,-1.771846219293962577e+01,3.281072564839833916e+01,-1.000000000000000000e+02,-8.183144894172693640e+00,-6.784752504496043457e+01
-9.885737382636276038e+01,9.345757254667546476e+00,-1.000000000000000000e+02,6.208399196232981865e+01,-7.137395101364755590e+01,-1.125965518034853119e+01,-6.031015846546813464e+01,-7.389217232398841873e+01,-4.828265677914997411e+01,-1.000000000000000000e+02
-1.000000000000000000e+02,7.413087171501275918e+01,-1.000000000000000000e+02,2.492885268293944279e+01,-8.448330365125991648e+01,-7.043542978971015600e+01,-6.262184452899144560e+01,2.310766565468330214e+01,-1.000000000000000000e+02,-2.968574918452235067e+01
-8.768322719648936925e+01,-5.666169299334149656e+01,-1.000000000000000000e+02,1.000000000000000000e+02,-1.000000000000000000e+02,-1.000000000000000000e+02,-1.000000000000000000e+02,-3.249611062699484876e+01,-5.018688004316493334e+01,2.809946300527659702e+00
-9.815344300972236624e+01,-9.898753491029422946e+01,1.437282116732718151e+01,-1.000000000000000000e+02,-1.000000000000000000e+02,-1.000000000000000000e+02,9.992971986454254818e+01,-1.000000000000000000e+02,-1.000000000000000000e+02,-1.000000000000000000e+02
-3.850846008164396039e+01,-9.625537451935338140e+01,-6.136567718453371789e-01,-1.000000000000000000e+02,-8.664214937104100045e+01,-7.562546875059770457e+01,-9.163854312861406015e+01,-9.800279904277921617e+01,3.102768708153789134e-01,1.735301983774175127e+01
-9.491367961311871682e+01,-9.807426493448498661e+01,-1.000000000000000000e+02,1.036982871562778641e+01,-2.000000000000000000e+01,-1.000000000000000000e+02,6.474146876463149169e+01,-1.000000000000000000e+02,-9.992971986454257660e+01,-1.000000000000000000e+02
-6.642672774831193294e+01,-3.203385984666904562e+01,-3.338300208964597715e+01,-1.751565600359611352e+01,-8.742560884448809588e+01,2.502490038102735070e+00,4.714233353086423506e+01,-1.000000000000000000e+02,6.620408068101384913e+01,7.768008234726857530e+00
-5.145850428524469322e+01,-2.972713015637843625e+01,-6.681218485364698267e+01,2.391827551220853110e+00,-6.445150831467333319e+01,-1.304158378767616000e+01,9.936231464540736624e+01,-1.000000000000000000e+02,-4.576772500720931447e+00,-5.951453758707722841e+01
-1.000000000000000000e+02,-8.730974149492867298e+01,7.709990001474288590e+00,-1.000000000000000000e+02,-9.992971986454257660e+01,-1.000000000000000000e+02,-1.514706324330849085e+01,-1.000000000000000000e+02,-2.866068267761331256e+01,-1.000000000000000000e+02
-1.000000000000000000e+02,9.402608809457733230e+01,-1.000000000000000000e+02,-4.062328110673777815e+01,-3.110330258493742406e+01,9.951194739709889348e+01,-1.000000000000000000e+02,-9.992971986454257660e+01,-1.000000000000000000e+02,1.000000000000000000e+02
