-3.026283479249989954e-05,-4.386438107585549726e-04,-3.898047634093373699e-04,1.755655910856863955e-05,9.024263955755768615e-04,2.645413778146885790e-04,4.187695124777818245e-05,4.854060997840511601e-04,-9.418017350312055287e-04,-2.815736017711530591e-04,-3.624505952134766517e-04,-2.810152542511883730e-04,-2.115018073809020504e-04,-6.513538691584531319e-04,-7.183951977988366992e-04,-3.666821182971528458e-04,1.181284075453814530e-03,9.574374812364965090e-04,-1.357548251399198855e-03,7.026696404729597736e-04,-1.797160618134392533e-04,-4.416503675133971849e-04,8.906298772988177799e-04,-2.229638247930677602e-04,7.274292904973425752e-04,-7.313725439091390656e-14,-1.000000000000000000e+02,8.916890380810298357e-07,-6.133296863770018432e-14,-1.000000000000000000e+02
4.263942077740977016e-04,1.819759534328775077e-04,1.159611388248919404e-03,1.913371472754538778e-04,7.744582322827936981e-04,6.754058562444667296e-04,-6.382783105353741519e-04,-6.375367488859976645e-04,2.138462976425406178e-04,1.381274802496129921e-03,-1.378389940311010200e-04,1.933868852692683001e-04,-2.658318703534520255e-04,5.532376553183976798e-04,-9.494781016632600776e-04,-6.105965136056003576e-04,5.266402146157209054e-04,-2.645148323102979211e-04,-2.699640887892588558e-04,8.521791902307095492e-04,1.079391073230304924e-04,1.095685553471900577e-03,1.260192560307507462e-04,1.213717691317451860e-03,-1.280581075066532237e-04,4.867258343720916812e-04,2.628900158082161714e-04,-4.825441602102607005e-04,2.106216156320760584e-13,-1.000000000000000000e+02
4.027715898334000141e-04,-4.100930947619518038e-04,1.228368670601921731e-04,9.336565551437856977e-04,6.704193315632810688e-04,7.485610937596866646e-04,-9.249633009211958396e-04,-2.474790134027950346e-04,-1.683917369201823680e-04,1.438096478698304773e-03,-3.561994967227745347e-04,-5.226712187239753978e-04,-2.051746967314216591e-04,-1.059923637550228264e-03,-7.269883356305327244e-04,-2.757136084860126830e-04,2.356967473914040566e-04,1.292195921697319701e-03,6.676020891616517988e-04,8.856848035460281911e-04,4.795850566248515464e-05,-1.103142498177104918e-04,7.740328183063923924e-04,9.400200796476124686e-04,1.046458192832290610e-03,6.608978127902541801e-04,-1.308991409776772644e-03,2.479010364198592315e-04,3.325958380569665324e-13,-1.000000000000000000e+02
-4.375007517198295677e-05,-6.829028129787732652e-04,3.615215187585580389e-04,8.772853040393439406e-04,1.065464039375698777e-13,-1.000000000000000000e+02,7.087797176302057937e-06,-7.358860632515738407e-04,-3.017439949767050720e-04,-7.485725686333371143e-04,6.583794303555235762e-06,2.634986021563778509e-04,-3.854356420409097480e-04,8.900056231981061036e-05,3.677125902408742079e-04,-8.137477754029425652e-04,7.062010864383302857e-04,5.341656121987476075e-04,-2.709278859056144005e-04,1.644351733572065998e-03,-4.410581537794011913e-04,-5.591975201232667145e-04,-7.456305029624437763e-04,5.302802420037188748e-04,-1.185709244793223954e-03,1.132630989970371659e-03,5.439811018747371836e-04,-6.150786770386754707e-04,6.802262627534497782e-04,3.606630565861175183e-04
-8.848580961987320085e-04,-7.674369774286221189e-04,2.121990445911541663e-04,2.035087841743062499e-04,2.887808151851012622e-05,-1.034631448759648197e-03,2.310502499492520293e-04,-4.280887294893456914e-04,-2.868659657964698967e-04,-1.193261183824855225e-03,1.200053309591338430e-03,-2.747420449172085360e-05,2.704776279032801304e-04,-3.836051992951346190e-04,-1.270314165800731252e-03,-1.137255092530592773e-03,-1.462980539129831283e-03,-7.643722245620599527e-04,-1.399769010017819833e-03,-1.632350700733198106e-03,-4.490786628707101437e-04,2.971299728996054765e-04,6.915696558810961302e-04,-1.096991737478722907e-03,-8.271580044124694515e-04,-3.461576549134922926e-05,9.448287469390071608e-04,8.432572458766003642e-04,2.560611989833372132e-04,-1.066411397267238818e-03
-1.865561329022282899e-03,1.501561417349540992e-03,1.567230563380879894e-03,-3.583138637563787823e-04,3.695289158398621081e-04,1.341175396512475203e-03,6.943786829551435542e-04,6.949689746817292249e-04,-4.858578080839275385e-04,-6.142946897768049395e-04,-5.921786161586033680e-04,-1.380495657262359802e-03,1.191954563086876449e-03,-3.539146256148658883e-04,1.346123604362036612e-03,6.827817746772146638e-05,-2.476609131536267939e-04,-2.134217177086186312e-03,1.321416108443176918e-03,3.481335832502991138e-04,1.364318157608504587e-03,-6.166442049784981103e-04,-3.950854809059615265e-04,9.454953599674045979e-05,1.746571743760183580e-03,5.838425218249529295e-04,-2.401786834092777532e-04,1.504940421530398444e-03,-1.324893771433181605e-03,-1.016438791905257665e-03
-2.769685475661341940e-04,3.435406418710593764e-04,-1.866221984334720768e-04,1.446656569425253201e-03,1.332958642409666234e-03,-6.045986252109719974e-04,-1.563571518587770093e-03,-9.449709283069920949e-04,-6.606296109973570181e-04,1.347899689676143511e-03,-1.370584065619788244e-03,-1.290050583596992397e-03,-6.723392314016128574e-14,-1.000000000000000000e+02,-4.414793139699532595e-06,-1.960001505026123195e-04,-7.581118417867443744e-04,5.592515259814211537e-04,5.802362035109695027e-04,-1.126518702838774557e-03,-7.033280007696816806e-05,8.639213763851331549e-04,6.280917916953282195e-04,8.912447755344600226e-04,7.419134261860623218e-04,-2.340405569699940264e-04,-1.108970618192471743e-03,-1.162924236060676507e-03,4.857232165714095396e-04,5.347346033020184027e-04
1.119376541493725561e-03,1.431549170722445138e-03,1.443130841644920141e-03,2.143564784986491428e-05,1.435244047107954272e-03,2.330197009522297445e-04,-1.670848600752804442e-03,4.821661969001026860e-04,8.400475176569980121e-04,-9.217381872046826537e-05,-7.900791867959906312e-04,2.554238936128116338e-04,-1.091627329070921516e-03,9.280812905511252669e-05,-6.256705160876784976e-04,7.404010490041773584e-04,1.430973908100624417e-04,-3.373206534983495125e-04,-4.114874190046192894e-05,1.228889054737859364e-03,-7.623157424411264359e-04,-6.728818456344952187e-04,2.398336793948992532e-03,-1.052358768473652968e-04,-5.873433985549980771e-04,6.504602849046615520e-04,-3.966180953289793597e-04,-5.623156229733561415e-04,-1.215010265721298830e-12,-1.000000000000000000e+02
-5.888285634772626870e-04,-1.048764498579075476e-04,2.201936182045615819e-04,-5.724887315564910692e-06,-9.843656929587887242e-04,-3.305518051579103421e-04,-4.715416146803218505e-04,5.062290587040457149e-05,-2.999446099593108296e-04,1.439491628446741469e-04,4.254553129990625796e-04,-7.542649400910810854e-05,2.098888701265214877e-04,-9.307962443045348375e-04,-8.442991180153983045e-04,1.957421356357681307e-04,-3.075935891472806509e-05,-2.140370176133193697e-04,-2.193474662279284418e-04,-6.727189196040969654e-04,5.571249589783745619e-04,6.231048302924546657e-04,4.807484992178505693e-04,2.788787455521381286e-04,-9.795575669022181346e-05,-8.057148853010814848e-04,3.601421590205602648e-04,-5.545249450469975049e-04,-3.149970003202598469e-06,-3.164243061381129957e-03
-9.689248948030739980e-04,-1.687658547301057043e-04,-5.506445878856974611e-04,1.168460456170289114e-03,-5.799497060190642430e-04,3.859577271899000163e-04,-1.388327623951741475e-04,4.541990346628814717e-04,-1.627662646149618392e-04,-1.644685536049279071e-13,-1.000000000000000000e+02,1.152917487984703942e-05,1.382499249121880384e-03,1.069985607991181783e-03,5.288760113129541097e-04,-6.147303503390264164e-04,1.838756701896879578e-03,-2.266641846015418540e-04,-2.060854885951964770e-04,1.032431181988365237e-03,-7.217153734452055837e-04,-1.821191406261534612e-03,1.005442049846681091e-03,-8.141948199309571865e-06,-1.130925117122160784e-05,7.670043008382456491e-04,2.302059657374909895e-04,-1.379155792204851162e-03,1.921643381678818439e-13,-1.000000000000000000e+02
4.733677114845836337e-04,-3.771052492363479521e-04,-1.773355395931607709e-04,1.561084788287366715e-03,-2.282882250237589297e-03,-7.960261686959284539e-04,-3.381507246201327296e-04,-1.753410322383032981e-03,-1.753933588072122303e-03,5.884440601617397723e-05,1.276070046353151594e-03,-5.268613368530760278e-04,1.899757487668112237e-03,-1.663328826109195641e-04,-4.906590369631424597e-04,5.832690162774971203e-04,-8.574098358228037127e-04,7.824455816516154294e-04,6.780401203805310438e-04,-1.962820327719870441e-04,5.824341145099038927e-05,-1.526038158851448015e-03,2.186264327479842335e-04,3.606743156976756608e-03,9.092851932368058079e-04,5.179881865414821731e-04,1.173214632421303158e-03,-2.169543446806585993e-03,-7.479707019038489904e-05,9.151521070586917522e-03
-9.418769566780882223e-04,2.951730666724758367e-04,1.310427674065034118e-03,-3.451881346976711645e-04,6.503103214683469231e-04,1.002865756999561913e-03,-1.416777951041499654e-04,8.780867310868985210e-04,5.219577520783605026e-04,1.025561279009173758e-03,4.956329842952559520e-04,-5.505279536109446408e-04,1.474129487034210562e-05,-7.765965279117499620e-04,1.544844407104428100e-04,1.213334814265256778e-04,-1.233274813615534669e-03,5.595150616220583798e-04,-1.345004776916031413e-03,-4.577919923736138751e-04,7.587660287944822260e-04,-2.602992546836708230e-04,-1.229926161907637960e-04,9.041582886591507939e-04,8.526796404564246151e-04,7.786076750596740209e-04,-5.237162528345484618e-05,-1.192262377181711568e-03,-9.607113922853612563e-05,1.799915092934378531e-03
-5.002645225569837340e-04,9.495411076210505614e-04,3.201983965493228920e-04,3.719712165689409693e-04,3.755137711578296583e-04,-5.419499474106947209e-04,-1.717430261860624589e-04,-7.217663777360378572e-04,-5.145722860842996205e-04,-1.883839170102232104e-04,-3.261925474098533915e-04,5.449715332204463098e-04,5.441927759278046301e-04,1.965172880762267754e-04,-8.043257509629140808e-04,1.073784972409834421e-04,2.816953327039765031e-04,-1.486653079255403995e-04,4.121478850739742576e-05,-2.118380898407107988e-04,2.988783650455344165e-04,-6.096070549233823226e-04,-3.291070735501173093e-05,-7.036837918514128685e-04,5.581596255358237894e-05,-1.856709986744580745e-04,-3.806374550456235995e-04,6.216395452262010496e-05,-1.488678891436152440e-05,1.188721818533972053e-04
4.184089720696760510e-04,-7.005875113141079354e-04,-2.887007416261498389e-04,-3.479908371953095042e-04,4.720059299914733213e-04,-3.184935332787098075e-04,-3.414066180462414579e-14,-1.000000000000000000e+02,3.716626991055326596e-07,-1.010937581832354351e-04,-4.288671155443477294e-04,-8.398116266122455844e-04,2.484536431045111468e-04,-1.480324738330364822e-05,2.555742360321581769e-05,-2.814235876294062270e-04,3.500337225136117931e-04,3.279175956792947880e-04,4.746549081656311025e-04,6.127671767602444180e-04,-2.229529269102512197e-04,-2.660373349659891917e-04,-1.719672959732878182e-04,-8.595230604465791150e-05,-6.281287846569031871e-04,-4.298577718433268429e-04,-7.265442404718971438e-04,7.611588984180047649e-04,-3.312516839238794069e-04,1.271955234009478856e-03
8.571734011972916706e-04,2.214016775566482638e-03,-9.619610091290203488e-04,-1.260898437617211879e-03,3.535968014637214194e-04,3.239349444387813314e-03,-1.419892695267393860e-03,1.646230293271161091e-03,1.904170529666682427e-03,7.844786211484481263e-04,1.683035393816962808e-03,-5.322584039726529354e-04,-3.853953136214850837e-04,4.573737439315686505e-04,3.570510840295679114e-04,2.239067046919839942e-03,-1.961483099426223145e-04,-2.044665260563604620e-12,-1.000000000000000000e+02,9.156977011327954951e-07,3.479607873852822689e-05,2.106037325963343830e-03,-2.595685139926070216e-03,1.117343712074303627e-03,9.171114541735830416e-04,1.630607913067402132e-07,-1.722463636999458855e-03,-4.239916567628168251e-03,-3.766670585579971189e-04,-2.897863847799074521e-03
-1.052917352331394856e-04,4.174973590527290677e-05,-2.162933270095609474e-04,8.261534531714843227e-05,1.976479366699157971e-04,1.761835135047381108e-04,8.892495768037929848e-05,-3.827984970733023357e-04,-3.450134483618169916e-04,-1.498981337729790564e-04,-2.100712346254471515e-04,-1.730601845769871850e-04,-1.190124325857477589e-06,4.550716939205429147e-04,-1.376256550547454703e-04,-3.332044163155136688e-04,1.453202058672429012e-04,-1.031009255405778390e-04,2.800961080704911644e-04,3.139473754039646632e-04,-1.547549125354970388e-04,1.438078755913548197e-04,9.014538596539617074e-05,4.149629966030440702e-05,-3.232728561178624654e-04,-4.377402122288284172e-04,-5.005183750432131004e-04,-2.350211336588672298e-04,1.264352479144338346e-14,-1.000000000000000000e+02
-1.960477720400464509e-04,5.142348459219435192e-04,-5.079772803947986935e-04,6.347449390057761497e-04,-2.617237213957377979e-04,-9.840171477763764302e-04,-3.618190270550083933e-04,9.888907426081670980e-04,1.932645222726695139e-04,3.060230266973282612e-05,6.229076591437767145e-05,3.407574733132885366e-04,-2.592044236878309881e-04,1.693500666814695601e-04,-5.214533072934010756e-04,-1.840704792142319811e-04,7.191293160801399183e-04,4.269934274535494134e-04,-2.755961305151228202e-04,-5.649293091705147492e-04,4.674180419943717822e-05,-7.792008866205814982e-05,-3.471034935037437571e-04,3.589647196671316340e-04,-1.124262690856533335e-04,-6.702149123663342064e-04,-2.156389309023512817e-04,-1.942505835625844639e-04,7.436910604516227576e-04,4.522042199559153479e-04
8.953874691550530070e-04,-1.727358777157260330e-04,-3.002062475489686473e-04,8.227932556695777885e-04,-1.326260769531621047e-05,-1.458039264557843898e-04,1.894420451383347541e-04,1.612387483854825629e-04,-7.259131869687623180e-04,7.533468247152676558e-04,-7.332979638761880081e-04,-1.668748844980336415e-04,8.723875059775895464e-04,4.897358825071101811e-04,3.715060723036463231e-05,-1.351452607092136059e-03,-4.558611880903978082e-04,-1.104352776312438229e-04,-1.211524396367223829e-03,2.974283229622565194e-04,-4.782560514593771746e-05,-5.119825122424815776e-05,-8.479646878680653383e-04,5.876587470618839428e-04,-2.679545573853570430e-04,1.067588755699981932e-03,5.993563325254012020e-04,-6.933931488707877067e-04,-1.871208015659924385e-04,-2.906483574160695620e-03
-2.537918320833878246e-04,7.464526422686028730e-04,-1.098250756487864291e-04,-6.313305980578994697e-04,6.901667273524661039e-05,2.657648002151915762e-13,-1.000000000000000000e+02,8.012917131281750015e-07,2.448529181775661433e-04,1.645451817140842002e-04,4.517830290220467906e-04,3.535405227642521406e-04,6.867169157103129992e-04,-6.276248870647222616e-04,4.006242766637082512e-04,-9.470846162597289578e-05,-6.103925835259528922e-04,6.507503963260862770e-04,-9.981971057627375275e-05,-4.022216670832243495e-04,-2.358773087763121955e-04,-1.295496789056376158e-04,-5.608204073423242193e-04,-6.377421403328115135e-04,1.242686419137551659e-04,7.320573292361150838e-04,6.643197444273885683e-04,-8.431170965184214545e-05,2.739080596219085461e-04,2.358726783626559700e-03
-5.039765816241040773e-04,-5.258574160815804484e-04,-2.493891776815753791e-04,9.940380412250550933e-04,6.050697563256264393e-04,2.820881717951380114e-04,4.217455829203602645e-04,8.089616083669104191e-04,-5.068951497543851530e-05,-2.420688319287772920e-04,-6.818919431986296669e-04,-4.614455095324330623e-04,-2.300194674226266811e-04,9.391231598227902429e-04,5.597794320854705338e-04,6.463070361898497727e-04,-4.156956384296135341e-04,-6.378532811031358517e-04,2.578076531569350929e-04,9.749374661025031041e-04,-1.007063084095756634e-04,-1.165268261165213978e-04,-2.831947862999449270e-04,2.965711298701046101e-04,1.166353922566622480e-04,-8.906411782039546981e-04,3.051086863485869666e-04,-7.423553489688977138e-04,-3.665988838064699468e-04,-4.231870028974306667e-04
-1.335858706929420481e-03,-4.253521154836198350e-04,3.406695665932967898e-04,-6.910963129799146469e-13,-1.000000000000000000e+02,-7.064910350562348102e-06,-1.149536490409165581e-03,-6.479952890140053875e-04,1.619393854542011593e-04,-7.306190369659444715e-04,3.453365748542428903e-05,-7.267755375491703577e-04,-7.761072842499786451e-04,1.278374034654390992e-03,2.876212981300798168e-04,4.918420704084812758e-04,-4.336803744593152078e-04,4.338949532062155007e-04,-1.082000273413768847e-04,-5.531914842468195872e-04,1.427475700883506658e-04,3.666501730865810325e-04,-1.107384853746973827e-03,-1.041553595767827616e-03,1.078664121611460497e-03,-1.864446686922816335e-04,9.300745280826411190e-04,-7.027720635034719575e-04,-1.375849178804419992e-13,-1.000000000000000000e+02
1.716622339396941654e-03,9.879922740592460371e-04,1.926145388894392151e-03,2.470474255668419009e-03,-3.783810769339280948e-04,-2.112076178536664676e-03,8.815640356626668755e-04,-2.041800538747789301e-03,3.689400005971882075e-04,-4.216283735480137219e-03,1.328461997866461084e-03,-1.013593744762922473e-03,-1.558602704496663775e-03,8.422927477784317510e-04,-4.011075962670996101e-03,1.856007856072678904e-03,-6.289533082404360174e-04,1.526157433965166961e-03,7.830950348871370528e-04,-8.155427728802262279e-04,1.703746881026164256e-03,-7.620261175124141452e-04,3.137740048022880784e-04,-2.550233391117373571e-03,2.141570777658475134e-03,-3.836645489829983938e-03,3.031799000423364421e-03,-2.631702168106745190e-03,2.050607856137315853e-04,-4.817346907680479517e-04
-1.663189809362181255e-03,-1.498784137408130848e-03,2.477216834051069278e-04,-1.168372876064970554e-03,7.796033506931930417e-04,-5.485300871466327732e-04,4.128007751226622953e-05,1.840207048585740853e-04,1.493871676367078578e-03,7.961374001134423079e-04,8.372420970467269689e-04,-2.689490069985972205e-04,1.171288749700391974e-03,-1.553506489533599058e-03,3.634412833864007633e-04,3.310172487700510733e-04,7.770161273355654340e-04,-1.209467321837643002e-03,-2.994606895378774079e-04,2.215191932296177359e-04,7.075294200824081307e-04,1.749183295203774260e-03,1.842843267045287184e-05,6.623426889947074334e-04,-1.225342593926513363e-04,-4.460526862810978727e-04,1.504249738637032652e-03,1.493540625030932191e-03,-9.873494528394833551e-04,-2.203782733582053226e-03
1.817810666606763277e-04,-1.403084258941104641e-04,-5.399351886303251861e-05,-4.543940501023938593e-04,6.895883559478732661e-04,-4.889328976563933095e-04,1.872403544544686005e-04,-5.122990170759549305e-04,-1.663614964935819941e-04,-2.350993942029575554e-04,4.445883899078463455e-04,-1.474383422008440029e-04,-1.497889040011922998e-04,-5.802951343466511945e-04,4.882818803851791695e-04,-3.107404992350182305e-04,-2.287931736887362482e-04,2.280749471312082182e-04,-3.720273443818578095e-04,-7.720491062893269701e-04,3.092667153393925282e-04,-3.224740627065588068e-04,6.817968910120419555e-04,-7.226070407556977552e-04,-1.006722422084423661e-03,3.100933905868419500e-04,-2.015950514363143518e-04,-1.249138891403820230e-04,-6.671879321131684096e-05,-2.690150458625207566e-04
2.815653684810687425e-04,5.953759908233793819e-04,-2.033624124497725866e-04,6.588185747905205523e-04,-5.707915828852612884e-04,5.804637438533361612e-04,-8.000269613540119274e-04,8.585697903914352429e-04,1.925690922942089158e-04,8.778805161932436846e-05,5.897562695849917908e-07,-2.731555457384298932e-05,-3.156901676702066929e-05,1.748276518410397072e-04,-2.132950028789680702e-04,1.988298088634401790e-04,-1.950142714725525269e-04,-1.037178199344417637e-04,9.050462974403809813e-04,5.573302466571365341e-04,5.075832627239061970e-05,3.396325982576439760e-04,-1.014419990014180789e-03,-9.445455031683052836e-04,1.241150050385243829e-03,-1.805314791771640360e-04,2.414831733634356322e-04,-2.346256410888353629e-04,-9.959869113859959387e-14,-1.000000000000000000e+02
-1.303991243661773488e-03,1.249736744585208149e-03,-2.084999734979116337e-04,5.608287417647479095e-04,-1.429871721652613628e-03,-4.396761488231937416e-04,1.165200412578903250e-03,2.193776296428746604e-04,-2.025714679579493013e-03,4.330012001304855583e-04,9.184470364744373727e-04,5.859981897054362921e-05,-6.882835228919908111e-04,1.310352663533398019e-03,5.961270666353546844e-04,1.388831812747586339e-03,-1.711829890663255603e-04,-6.770242220495064148e-04,-3.454725251581434141e-04,2.181696810458008001e-04,6.568269547207409437e-04,-9.120926934529805657e-04,1.004458526895523045e-03,1.080680653724996540e-03,-1.792352616512661763e-03,3.728990065392390890e-04,-2.888175985418014319e-07,1.540181743362612084e-04,1.835089557568654259e-03,-1.632621736510778479e-05
1.455265336307432064e-04,3.458579223807182242e-04,4.358147699468330953e-04,1.958064061854176865e-04,1.745366818935454646e-04,7.911415656268880802e-04,2.287775980533375336e-05,2.993894843966000909e-04,1.919160107845587762e-04,1.967692918719129904e-04,-1.292938420296804074e-04,-3.036676371169081521e-05,-3.863096481601549330e-04,1.754132215875363473e-04,-2.793716611099034131e-04,-5.220955205133666560e-05,-2.956204162958656371e-04,-1.020246037716551334e-04,-3.496732475130804501e-04,-1.261788038149182830e-04,4.379636877328595742e-04,9.616070810430698895e-05,2.505502873478946020e-07,5.855272012380950556e-04,-2.154711519837819076e-04,1.899370420309254466e-04,1.301640223242666716e-04,-5.556503558947072400e-04,-1.246606457620123203e-04,-5.464111421062980934e-04
1.237573386480365131e-03,-4.894629325174160118e-04,2.869882047428366821e-04,-1.103341127066126588e-03,-5.910236867084748972e-04,1.990949696485102768e-05,5.490438969681091979e-04,1.177797953427169638e-04,5.101772073835613916e-05,3.033993091547283879e-04,-1.420472393899228870e-04,5.603593323884700121e-05,-9.422089533840099108e-04,8.778521675615110365e-04,-2.598820169310968949e-04,-1.824377990725628128e-04,4.834185928767780523e-04,-3.618017737518821469e-04,8.146742392985275400e-05,1.218779416417539496e-04,4.210587443182996822e-04,-7.346998073851623151e-04,7.049326678520062475e-04,3.989243295640106752e-05,1.708597848507467697e-04,-3.088075320737415381e-04,4.331652834638046248e-04,2.129920011190109810e-04,5.311165320965485535e-14,-1.000000000000000000e+02
1.035872856758284291e-03,-6.103179858464959952e-04,5.968918463987935019e-04,4.486217829344400581e-05,4.613124875118911712e-05,4.611809932781735233e-04,-2.199866980984507142e-04,2.164329307549849024e-04,-2.984762348694783513e-04,-1.112844122252707509e-04,-8.303648969315308853e-05,-3.159760845922650351e-04,-1.272628267398549090e-03,5.030307552511732467e-04,-1.070111370819327610e-03,-1.104670050268934285e-03,-2.450403934515079990e-04,-1.074399980910285124e-04,-5.882314568305537861e-04,1.279526228143845626e-04,5.289854476359900611e-04,-1.324727273403852445e-03,1.286312124761846863e-04,-8.902620434576456396e-05,-8.997735919884490173e-04,1.233713284181130394e-04,-1.109250895177456677e-03,5.615194263793916616e-05,-1.888578202095565235e-14,-1.000000000000000000e+02
-1.000000000000000000e+02,7.465939728750364117e-07,6.114980945366418940e-04,-4.687171779605453395e-05,1.193253451440692359e-04,-2.934282371004584447e-04,4.322622570993722713e-05,-3.856955855968446288e-05,4.151065775391136396e-04,2.500676516970632606e-04,-1.417884112889019211e-04,-2.903054636041361254e-04,-3.610212134359046905e-04,3.606985923341960235e-04,-3.273480528272595860e-04,5.617644600828554640e-05,-4.475745695526433371e-04,-5.357079623900368702e-04,3.238133417837465934e-04,3.741181139010731418e-04,-1.136789405945289727e-04,-3.115584555152359106e-04,-1.870196167960648992e-04,5.309274171741496570e-04,1.745823861042376693e-04,-3.686554642148227911e-04,1.926182357769050033e-04,-6.023771486944233880e-04,5.573190601794325853e-05,-3.275250778946514011e-04
