-1.301909197114538748e-05,-1.000000000000000000e+02,-9.999999999999987210e+01,-1.000000000000000000e+02,-1.000000000000000000e+02,-1.000000000000000000e+02,-1.000000000000000000e+02,-9.999999999999997158e+01,-1.000000000000000000e+02,-1.000000000000000000e+02,-1.000000000000000000e+02,-1.000000000000000000e+02,-1.000000000000000000e+02,-1.000000000000000000e+02,-9.999999999999995737e+01,-9.999999999999995737e+01,-1.000000000000000000e+02,-1.000000000000000000e+02,-1.000000000000000000e+02,-1.000000000000000000e+02,-1.000000000000000000e+02,-9.999999999999990052e+01,-1.000000000000000000e+02,-1.000000000000000000e+02,-1.000000000000000000e+02,-1.000000000000000000e+02,-9.999999999999977263e+01,-1.000000000000000000e+02,-9.999999999999975842e+01,-9.999999999999984368e+01
-2.820618831737644104e-06,-1.000000000000000000e+02,-1.000000000000000000e+02,-1.000000000000000000e+02,-1.000000000000000000e+02,-9.999999999999980105e+01,-9.999999999999982947e+01,-1.000000000000000000e+02,-1.000000000000000000e+02,-1.000000000000000000e+02,-1.000000000000000000e+02,-9.999999999999980105e+01,-1.000000000000000000e+02,-1.000000000000000000e+02,-9.999999999999990052e+01,-9.999999999999992895e+01,-9.999999999999987210e+01,-1.000000000000000000e+02,-1.000000000000000000e+02,-1.000000000000000000e+02,-9.999999999999995737e+01,-1.000000000000000000e+02,-1.000000000000000000e+02,-1.000000000000000000e+02,-1.000000000000000000e+02,-9.999999999999998579e+01,-1.000000000000000000e+02,-9.999999999999981526e+01,-9.999999999999991473e+01,-1.000000000000000000e+02
1.445109431381563389e-05,-9.999999999999995737e+01,-1.000000000000000000e+02,-1.000000000000000000e+02,-1.000000000000000000e+02,-1.000000000000000000e+02,-9.999999999999990052e+01,-9.999999999999997158e+01,-1.000000000000000000e+02,-9.999999999999970157e+01,-1.000000000000000000e+02,-1.000000000000000000e+02,-1.000000000000000000e+02,-9.999999999999998579e+01,-9.999999999999994316e+01,-1.000000000000000000e+02,-9.999999999999992895e+01,-1.000000000000000000e+02,-9.999999999999991473e+01,-9.999999999999998579e+01,-9.999999999999987210e+01,-9.999999999999991473e+01,-9.999999999999995737e+01,-1.000000000000000000e+02,-1.000000000000000000e+02,-9.999999999999975842e+01,-9.999999999999998579e+01,-9.999999999999987210e+01,-9.999999999999992895e+01,-9.999999999999980105e+01
-6.742111407013019936e-07,-9.999999999999991473e+01,-1.000000000000000000e+02,-9.999999999999984368e+01,-9.999999999999987210e+01,-1.000000000000000000e+02,-1.000000000000000000e+02,-1.000000000000000000e+02,-1.000000000000000000e+02,-1.000000000000000000e+02,-1.000000000000000000e+02,-1.000000000000000000e+02,-1.000000000000000000e+02,-9.999999999999995737e+01,-9.999999999999988631e+01,-1.000000000000000000e+02,-1.000000000000000000e+02,-1.000000000000000000e+02,-1.000000000000000000e+02,-9.999999999999995737e+01,-9.999999999999988631e+01,-1.000000000000000000e+02,-9.999999999999992895e+01,-1.000000000000000000e+02,-1.000000000000000000e+02,-9.999999999999972999e+01,-9.999999999999987210e+01,-9.999999999999974420e+01,-1.000000000000000000e+02,-1.000000000000000000e+02
6.996885120767280667e-06,-1.000000000000000000e+02,-9.999999999999988631e+01,-9.999999999999975842e+01,-1.000000000000000000e+02,-1.000000000000000000e+02,-1.000000000000000000e+02,-1.000000000000000000e+02,-1.000000000000000000e+02,-9.999999999999975842e+01,-9.999999999999994316e+01,-1.000000000000000000e+02,-1.000000000000000000e+02,-1.000000000000000000e+02,-1.000000000000000000e+02,-1.000000000000000000e+02,-9.999999999999991473e+01,-1.000000000000000000e+02,-1.000000000000000000e+02,-9.999999999999991473e+01,-9.999999999999991473e+01,-9.999999999999988631e+01,-9.999999999999998579e+01,-9.999999999999997158e+01,-1.000000000000000000e+02,-9.999999999999992895e+01,-1.000000000000000000e+02,-9.999999999999981526e+01,-9.999999999999972999e+01,-9.999999999999968736e+01
-1.596334473823237543e-06,-9.999999999999977263e+01,-1.000000000000000000e+02,-1.000000000000000000e+02,-9.999999999999945999e+01,-1.000000000000000000e+02,-1.000000000000000000e+02,-1.000000000000000000e+02,-1.000000000000000000e+02,-1.000000000000000000e+02,-1.000000000000000000e+02,-1.000000000000000000e+02,-1.000000000000000000e+02,-1.000000000000000000e+02,-9.999999999999991473e+01,-1.000000000000000000e+02,-1.000000000000000000e+02,-9.999999999999997158e+01,-9.999999999999987210e+01,-1.000000000000000000e+02,-1.000000000000000000e+02,-1.000000000000000000e+02,-1.000000000000000000e+02,-9.999999999999988631e+01,-9.999999999999990052e+01,-9.999999999999974420e+01,-1.000000000000000000e+02,-9.999999999999995737e+01,-1.000000000000000000e+02,-9.999999999999997158e+01
-9.512480676704809101e-06,-1.000000000000000000e+02,-1.000000000000000000e+02,-9.999999999999970157e+01,-1.000000000000000000e+02,-1.000000000000000000e+02,-1.000000000000000000e+02,-1.000000000000000000e+02,-1.000000000000000000e+02,-9.999999999999998579e+01,-1.000000000000000000e+02,-1.000000000000000000e+02,-9.999999999999961631e+01,-1.000000000000000000e+02,-1.000000000000000000e+02,-1.000000000000000000e+02,-1.000000000000000000e+02,-1.000000000000000000e+02,-1.000000000000000000e+02,-1.000000000000000000e+02,-1.000000000000000000e+02,-1.000000000000000000e+02,-1.000000000000000000e+02,-1.000000000000000000e+02,-1.000000000000000000e+02,-1.000000000000000000e+02,-1.000000000000000000e+02,-1.000000000000000000e+02,-1.000000000000000000e+02,-9.999999999999974420e+01
1.015980753052787994e-05,-1.000000000000000000e+02,-9.999999999999998579e+01,-9.999999999999988631e+01,-9.999999999999997158e+01,-1.000000000000000000e+02,-1.000000000000000000e+02,-1.000000000000000000e+02,-9.999999999999981526e+01,-1.000000000000000000e+02,-1.000000000000000000e+02,-9.999999999999975842e+01,-1.000000000000000000e+02,-9.999999999999988631e+01,-9.999999999999987210e+01,-9.999999999999994316e+01,-9.999999999999995737e+01,-1.000000000000000000e+02,-9.999999999999988631e+01,-9.999999999999995737e+01,-1.000000000000000000e+02,-9.999999999999995737e+01,-9.999999999999987210e+01,-1.000000000000000000e+02,-1.000000000000000000e+02,-1.000000000000000000e+02,-1.000000000000000000e+02,-9.999999999999974420e+01,-9.999999999999987210e+01,-9.999999999999975842e+01
1.629720686299786168e-05,-9.999999999999994316e+01,-9.999999999999992895e+01,-1.000000000000000000e+02,-9.999999999999992895e+01,-1.000000000000000000e+02,-1.000000000000000000e+02,-1.000000000000000000e+02,-1.000000000000000000e+02,-9.999999999999991473e+01,-9.999999999999941735e+01,-9.999999999999990052e+01,-9.999999999999995737e+01,-9.999999999999987210e+01,-1.000000000000000000e+02,-1.000000000000000000e+02,-9.999999999999988631e+01,-1.000000000000000000e+02,-1.000000000000000000e+02,-1.000000000000000000e+02,-1.000000000000000000e+02,-9.999999999999995737e+01,-9.999999999999997158e+01,-1.000000000000000000e+02,-1.000000000000000000e+02,-1.000000000000000000e+02,-1.000000000000000000e+02,-9.999999999999980105e+01,-9.999999999999971578e+01,-9.999999999999997158e+01
-6.453482177420781573e-06,-1.000000000000000000e+02,-1.000000000000000000e+02,-1.000000000000000000e+02,-1.000000000000000000e+02,-9.999999999999980105e+01,-1.000000000000000000e+02,-1.000000000000000000e+02,-1.000000000000000000e+02,-1.000000000000000000e+02,-9.999999999999995737e+01,-9.999999999999980105e+01,-1.000000000000000000e+02,-1.000000000000000000e+02,-9.999999999999995737e+01,-1.000000000000000000e+02,-1.000000000000000000e+02,-1.000000000000000000e+02,-9.999999999999988631e+01,-9.999999999999987210e+01,-1.000000000000000000e+02,-1.000000000000000000e+02,-1.000000000000000000e+02,-1.000000000000000000e+02,-9.999999999999992895e+01,-9.999999999999981526e+01,-1.000000000000000000e+02,-1.000000000000000000e+02,-1.000000000000000000e+02,-1.000000000000000000e+02
-1.724231586087707255e-06,-1.000000000000000000e+02,-1.000000000000000000e+02,-9.999999999999994316e+01,-9.999999999999985789e+01,-1.000000000000000000e+02,-9.999999999999985789e+01,-9.999999999999988631e+01,-1.000000000000000000e+02,-9.999999999999987210e+01,-1.000000000000000000e+02,-1.000000000000000000e+02,-1.000000000000000000e+02,-1.000000000000000000e+02,-9.999999999999991473e+01,-1.000000000000000000e+02,-9.999999999999988631e+01,-9.999999999999991473e+01,-9.999999999999987210e+01,-9.999999999999987210e+01,-9.999999999999995737e+01,-9.999999999999987210e+01,-1.000000000000000000e+02,-9.999999999999988631e+01,-1.000000000000000000e+02,-9.999999999999975842e+01,-1.000000000000000000e+02,-9.999999999999985789e+01,-1.000000000000000000e+02,-9.999999999999974420e+01
-2.827831681631654380e-06,-9.999999999999961631e+01,-9.999999999999994316e+01,-1.000000000000000000e+02,-1.000000000000000000e+02,-1.000000000000000000e+02,-1.000000000000000000e+02,-9.999999999999997158e+01,-1.000000000000000000e+02,-1.000000000000000000e+02,-1.000000000000000000e+02,-1.000000000000000000e+02,-9.999999999999998579e+01,-9.999999999999992895e+01,-1.000000000000000000e+02,-9.999999999999995737e+01,-9.999999999999988631e+01,-9.999999999999998579e+01,-9.999999999999997158e+01,-9.999999999999958789e+01,-9.999999999999984368e+01,-1.000000000000000000e+02,-9.999999999999988631e+01,-9.999999999999988631e+01,-1.000000000000000000e+02,-9.999999999999981526e+01,-9.999999999999971578e+01,-1.000000000000000000e+02,-9.999999999999978684e+01,-9.999999999999995737e+01
1.099241749137916246e-05,-1.000000000000000000e+02,-1.000000000000000000e+02,-1.000000000000000000e+02,-9.999999999999940314e+01,-1.000000000000000000e+02,-1.000000000000000000e+02,-1.000000000000000000e+02,-1.000000000000000000e+02,-1.000000000000000000e+02,-1.000000000000000000e+02,-1.000000000000000000e+02,-1.000000000000000000e+02,-9.999999999999997158e+01,-1.000000000000000000e+02,-1.000000000000000000e+02,-1.000000000000000000e+02,-1.000000000000000000e+02,-1.000000000000000000e+02,-9.999999999999997158e+01,-9.999999999999994316e+01,-9.999999999999988631e+01,-1.000000000000000000e+02,-9.999999999999990052e+01,-1.000000000000000000e+02,-9.999999999999978684e+01,-1.000000000000000000e+02,-9.999999999999997158e+01,-1.000000000000000000e+02,-1.000000000000000000e+02
-1.131104431268535089e-05,-9.999999999999988631e+01,-1.000000000000000000e+02,-1.000000000000000000e+02,-1.000000000000000000e+02,-1.000000000000000000e+02,-9.999999999999972999e+01,-9.999999999999982947e+01,-1.000000000000000000e+02,-1.000000000000000000e+02,-1.000000000000000000e+02,-9.999999999999997158e+01,-1.000000000000000000e+02,-9.999999999999992895e+01,-1.000000000000000000e+02,-1.000000000000000000e+02,-1.000000000000000000e+02,-9.999999999999997158e+01,-1.000000000000000000e+02,-1.000000000000000000e+02,-9.999999999999992895e+01,-9.999999999999998579e+01,-1.000000000000000000e+02,-9.999999999999988631e+01,-1.000000000000000000e+02,-9.999999999999984368e+01,-9.999999999999972999e+01,-9.999999999999982947e+01,-1.000000000000000000e+02,-1.000000000000000000e+02
-9.070525477019940642e-06,-1.000000000000000000e+02,-9.999999999999998579e+01,-1.000000000000000000e+02,-9.999999999999997158e+01,-1.000000000000000000e+02,-1.000000000000000000e+02,-1.000000000000000000e+02,-9.999999999999994316e+01,-1.000000000000000000e+02,-9.999999999999988631e+01,-1.000000000000000000e+02,-9.999999999999965894e+01,-1.000000000000000000e+02,-9.999999999999990052e+01,-1.000000000000000000e+02,-9.999999999999988631e+01,-1.000000000000000000e+02,-9.999999999999994316e+01,-1.000000000000000000e+02,-9.999999999999995737e+01,-9.999999999999987210e+01,-1.000000000000000000e+02,-1.000000000000000000e+02,-9.999999999999995737e+01,-9.999999999999974420e+01,-9.999999999999972999e+01,-9.999999999999990052e+01,-9.999999999999974420e+01,-9.999999999999968736e+01
-1.370582524709977362e-05,-1.000000000000000000e+02,-1.000000000000000000e+02,-9.999999999999994316e+01,-1.000000000000000000e+02,-1.000000000000000000e+02,-1.000000000000000000e+02,-9.999999999999985789e+01,-1.000000000000000000e+02,-9.999999999999980105e+01,-9.999999999999918998e+01,-1.000000000000000000e+02,-1.000000000000000000e+02,-9.999999999999998579e+01,-1.000000000000000000e+02,-9.999999999999998579e+01,-1.000000000000000000e+02,-9.999999999999992895e+01,-9.999999999999994316e+01,-1.000000000000000000e+02,-9.999999999999990052e+01,-9.999999999999987210e+01,-1.000000000000000000e+02,-9.999999999999988631e+01,-9.999999999999990052e+01,-9.999999999999981526e+01,-9.999999999999978684e+01,-1.000000000000000000e+02,-9.999999999999975842e+01,-1.000000000000000000e+02
3.766632050540997903e-06,-1.000000000000000000e+02,-9.999999999999995737e+01,-1.000000000000000000e+02,-1.000000000000000000e+02,-9.999999999999990052e+01,-1.000000000000000000e+02,-1.000000000000000000e+02,-1.000000000000000000e+02,-1.000000000000000000e+02,-9.999999999999990052e+01,-9.999999999999997158e+01,-9.999999999999988631e+01,-9.999999999999998579e+01,-9.999999999999995737e+01,-1.000000000000000000e+02,-9.999999999999995737e+01,-1.000000000000000000e+02,-9.999999999999998579e+01,-9.999999999999987210e+01,-9.999999999999992895e+01,-9.999999999999987210e+01,-9.999999999999994316e+01,-9.999999999999997158e+01,-9.999999999999991473e+01,-1.000000000000000000e+02,-1.000000000000000000e+02,-9.999999999999981526e+01,-9.999999999999991473e+01,-1.000000000000000000e+02
-3.913441384658685715e-06,-1.000000000000000000e+02,-1.000000000000000000e+02,-1.000000000000000000e+02,-1.000000000000000000e+02,-9.999999999999990052e+01,-1.000000000000000000e+02,-1.000000000000000000e+02,-1.000000000000000000e+02,-1.000000000000000000e+02,-1.000000000000000000e+02,-1.000000000000000000e+02,-1.000000000000000000e+02,-9.999999999999984368e+01,-1.000000000000000000e+02,-9.999999999999994316e+01,-1.000000000000000000e+02,-9.999999999999995737e+01,-1.000000000000000000e+02,-1.000000000000000000e+02,-9.999999999999992895e+01,-1.000000000000000000e+02,-1.000000000000000000e+02,-9.999999999999992895e+01,-1.000000000000000000e+02,-1.000000000000000000e+02,-1.000000000000000000e+02,-9.999999999999974420e+01,-9.999999999999972999e+01,-1.000000000000000000e+02
-9.605203603744746522e-06,-9.999999999999997158e+01,-9.999999999999990052e+01,-1.000000000000000000e+02,-1.000000000000000000e+02,-9.999999999999997158e+01,-1.000000000000000000e+02,-1.000000000000000000e+02,-1.000000000000000000e+02,-1.000000000000000000e+02,-9.999999999999965894e+01,-1.000000000000000000e+02,-1.000000000000000000e+02,-1.000000000000000000e+02,-1.000000000000000000e+02,-9.999999999999992895e+01,-9.999999999999987210e+01,-9.999999999999991473e+01,-9.999999999999992895e+01,-9.999999999999987210e+01,-9.999999999999988631e+01,-9.999999999999997158e+01,-1.000000000000000000e+02,-1.000000000000000000e+02,-1.000000000000000000e+02,-1.000000000000000000e+02,-9.999999999999980105e+01,-9.999999999999995737e+01,-9.999999999999991473e+01,-9.999999999999971578e+01
5.915978845366349378e-06,-9.999999999999997158e+01,-9.999999999999982947e+01,-1.000000000000000000e+02,-1.000000000000000000e+02,-1.000000000000000000e+02,-1.000000000000000000e+02,-1.000000000000000000e+02,-1.000000000000000000e+02,-9.999999999999988631e+01,-1.000000000000000000e+02,-1.000000000000000000e+02,-1.000000000000000000e+02,-9.999999999999990052e+01,-1.000000000000000000e+02,-9.999999999999977263e+01,-9.999999999999988631e+01,-9.999999999999990052e+01,-1.000000000000000000e+02,-9.999999999999990052e+01,-9.999999999999998579e+01,-9.999999999999990052e+01,-9.999999999999987210e+01,-9.999999999999987210e+01,-9.999999999999987210e+01,-9.999999999999995737e+01,-1.000000000000000000e+02,-9.999999999999982947e+01,-1.000000000000000000e+02,-1.000000000000000000e+02
-8.609655746061216028e-06,-1.000000000000000000e+02,-1.000000000000000000e+02,-1.000000000000000000e+02,-1.000000000000000000e+02,-9.999999999999951683e+01,-1.000000000000000000e+02,-1.000000000000000000e+02,-9.999999999999955946e+01,-9.999999999999997158e+01,-1.000000000000000000e+02,-9.999999999999992895e+01,-1.000000000000000000e+02,-9.999999999999998579e+01,-9.999999999999992895e+01,-9.999999999999988631e+01,-1.000000000000000000e+02,-9.999999999999998579e+01,-9.999999999999988631e+01,-9.999999999999998579e+01,-9.999999999999988631e+01,-9.999999999999991473e+01,-1.000000000000000000e+02,-1.000000000000000000e+02,-9.999999999999992895e+01,-1.000000000000000000e+02,-1.000000000000000000e+02,-9.999999999999975842e+01,-9.999999999999995737e+01,-1.000000000000000000e+02
-4.686491333774791781e-06,-1.000000000000000000e+02,-9.999999999999994316e+01,-9.999999999999994316e+01,-1.000000000000000000e+02,-9.999999999999998579e+01,-1.000000000000000000e+02,-1.000000000000000000e+02,-1.000000000000000000e+02,-9.999999999999971578e+01,-1.000000000000000000e+02,-1.000000000000000000e+02,-1.000000000000000000e+02,-9.999999999999995737e+01,-1.000000000000000000e+02,-9.999999999999991473e+01,-9.999999999999941735e+01,-9.999999999999980105e+01,-1.000000000000000000e+02,-1.000000000000000000e+02,-9.999999999999998579e+01,-9.999999999999987210e+01,-9.999999999999991473e+01,-1.000000000000000000e+02,-1.000000000000000000e+02,-1.000000000000000000e+02,-9.999999999999974420e+01,-9.999999999999971578e+01,-9.999999999999985789e+01,-9.999999999999977263e+01
-5.943175706902271227e-06,-1.000000000000000000e+02,-1.000000000000000000e+02,-9.999999999999967315e+01,-1.000000000000000000e+02,-1.000000000000000000e+02,-1.000000000000000000e+02,-9.999999999999997158e+01,-9.999999999999998579e+01,-1.000000000000000000e+02,-1.000000000000000000e+02,-1.000000000000000000e+02,-1.000000000000000000e+02,-1.000000000000000000e+02,-9.999999999999995737e+01,-1.000000000000000000e+02,-9.999999999999992895e+01,-9.999999999999994316e+01,-9.999999999999990052e+01,-1.000000000000000000e+02,-1.000000000000000000e+02,-1.000000000000000000e+02,-1.000000000000000000e+02,-9.999999999999994316e+01,-9.999999999999995737e+01,-9.999999999999992895e+01,-9.999999999999981526e+01,-9.999999999999971578e+01,-9.999999999999970157e+01,-9.999999999999970157e+01
-2.824410902252185809e-06,-1.000000000000000000e+02,-9.999999999999978684e+01,-1.000000000000000000e+02,-1.000000000000000000e+02,-1.000000000000000000e+02,-1.000000000000000000e+02,-9.999999999999980105e+01,-1.000000000000000000e+02,-1.000000000000000000e+02,-1.000000000000000000e+02,-1.000000000000000000e+02,-1.000000000000000000e+02,-9.999999999999990052e+01,-1.000000000000000000e+02,-1.000000000000000000e+02,-1.000000000000000000e+02,-9.999999999999994316e+01,-9.999999999999991473e+01,-9.999999999999965894e+01,-9.999999999999985789e+01,-9.999999999999988631e+01,-1.000000000000000000e+02,-1.000000000000000000e+02,-1.000000000000000000e+02,-1.000000000000000000e+02,-1.000000000000000000e+02,-1.000000000000000000e+02,-9.999999999999975842e+01,-1.000000000000000000e+02
3.625858443838705350e-06,-1.000000000000000000e+02,-1.000000000000000000e+02,-1.000000000000000000e+02,-9.999999999999945999e+01,-1.000000000000000000e+02,-1.000000000000000000e+02,-1.000000000000000000e+02,-1.000000000000000000e+02,-9.999999999999997158e+01,-1.000000000000000000e+02,-9.999999999999998579e+01,-1.000000000000000000e+02,-9.999999999999991473e+01,-9.999999999999997158e+01,-9.999999999999987210e+01,-9.999999999999990052e+01,-9.999999999999987210e+01,-1.000000000000000000e+02,-9.999999999999988631e+01,-1.000000000000000000e+02,-1.000000000000000000e+02,-1.000000000000000000e+02,-9.999999999999991473e+01,-1.000000000000000000e+02,-9.999999999999994316e+01,-9.999999999999985789e+01,-9.999999999999971578e+01,-9.999999999999985789e+01,-1.000000000000000000e+02
1.559464188219548402e-05,-1.000000000000000000e+02,-1.000000000000000000e+02,-1.000000000000000000e+02,-9.999999999999994316e+01,-9.999999999999991473e+01,-1.000000000000000000e+02,-1.000000000000000000e+02,-1.000000000000000000e+02,-1.000000000000000000e+02,-1.000000000000000000e+02,-1.000000000000000000e+02,-9.999999999999980105e+01,-1.000000000000000000e+02,-1.000000000000000000e+02,-1.000000000000000000e+02,-1.000000000000000000e+02,-9.999999999999988631e+01,-9.999999999999997158e+01,-9.999999999999995737e+01,-9.999999999999997158e+01,-9.999999999999991473e+01,-1.000000000000000000e+02,-1.000000000000000000e+02,-9.999999999999998579e+01,-1.000000000000000000e+02,-1.000000000000000000e+02,-1.000000000000000000e+02,-9.999999999999982947e+01,-9.999999999999984368e+01
-1.457688919360141395e-05,-1.000000000000000000e+02,-1.000000000000000000e+02,-1.000000000000000000e+02,-1.000000000000000000e+02,-1.000000000000000000e+02,-1.000000000000000000e+02,-9.999999999999998579e+01,-9.999999999999987210e+01,-1.000000000000000000e+02,-1.000000000000000000e+02,-1.000000000000000000e+02,-1.000000000000000000e+02,-9.999999999999957367e+01,-1.000000000000000000e+02,-9.999999999999992895e+01,-9.999999999999995737e+01,-9.999999999999995737e+01,-9.999999999999994316e+01,-1.000000000000000000e+02,-1.000000000000000000e+02,-1.000000000000000000e+02,-1.000000000000000000e+02,-9.999999999999988631e+01,-1.000000000000000000e+02,-9.999999999999995737e+01,-1.000000000000000000e+02,-9.999999999999984368e+01,-1.000000000000000000e+02,-9.999999999999975842e+01
2.245247466927377977e-06,-9.999999999999985789e+01,-1.000000000000000000e+02,-9.999999999999967315e+01,-1.000000000000000000e+02,-9.999999999999991473e+01,-1.000000000000000000e+02,-1.000000000000000000e+02,-1.000000000000000000e+02,-9.999999999999998579e+01,-1.000000000000000000e+02,-1.000000000000000000e+02,-1.000000000000000000e+02,-1.000000000000000000e+02,-9.999999999999988631e+01,-1.000000000000000000e+02,-1.000000000000000000e+02,-1.000000000000000000e+02,-1.000000000000000000e+02,-9.999999999999992895e+01,-9.999999999999987210e+01,-1.000000000000000000e+02,-1.000000000000000000e+02,-1.000000000000000000e+02,-1.000000000000000000e+02,-1.000000000000000000e+02,-9.999999999999988631e+01,-1.000000000000000000e+02,-9.999999999999975842e+01,-1.000000000000000000e+02
-1.323088927400348351e-05,-1.000000000000000000e+02,-9.999999999999995737e+01,-1.000000000000000000e+02,-1.000000000000000000e+02,-1.000000000000000000e+02,-1.000000000000000000e+02,-9.999999999999980105e+01,-9.999999999999980105e+01,-9.999999999999980105e+01,-9.999999999999994316e+01,-9.999999999999997158e+01,-1.000000000000000000e+02,-1.000000000000000000e+02,-9.999999999999990052e+01,-1.000000000000000000e+02,-9.999999999999995737e+01,-1.000000000000000000e+02,-9.999999999999997158e+01,-1.000000000000000000e+02,-1.000000000000000000e+02,-1.000000000000000000e+02,-1.000000000000000000e+02,-1.000000000000000000e+02,-1.000000000000000000e+02,-1.000000000000000000e+02,-9.999999999999982947e+01,-9.999999999999972999e+01,-1.000000000000000000e+02,-9.999999999999988631e+01
-5.633742334813243523e-06,-1.000000000000000000e+02,-1.000000000000000000e+02,-1.000000000000000000e+02,-1.000000000000000000e+02,-1.000000000000000000e+02,-1.000000000000000000e+02,-1.000000000000000000e+02,-1.000000000000000000e+02,-1.000000000000000000e+02,-1.000000000000000000e+02,-1.000000000000000000e+02,-1.000000000000000000e+02,-1.000000000000000000e+02,-1.000000000000000000e+02,-1.000000000000000000e+02,-9.999999999999995737e+01,-1.000000000000000000e+02,-1.000000000000000000e+02,-1.000000000000000000e+02,-1.000000000000000000e+02,-1.000000000000000000e+02,-1.000000000000000000e+02,-1.000000000000000000e+02,-9.999999999999988631e+01,-9.999999999999974420e+01,-1.000000000000000000e+02,-9.999999999999981526e+01,-9.999999999999972999e+01,-1.000000000000000000e+02
