-1.513296157678814188e-02,-1.314350623228536519e-01,1.513270234548651921e-02,1.304721231008454385e-01,-2.548274664436550596e-02,-1.294534736805109387e-01,2.557094468538954890e-02,-1.298088074923580693e-01,-2.814918253568946330e-02,1.292881498627793946e-01
-1.024081594221862013e-01,8.375747853027144807e-02,-1.024238333905174714e-01,-8.405777820905789566e-02,-1.021311277425824143e-01,8.410630108305651442e-02,-1.023996910424223999e-01,8.376734186304592156e-02,-1.023096351417218525e-01,-8.311877051848608200e-02
-8.993351469123439523e-02,-9.728484203822633514e-02,-8.975028124296506593e-02,-9.689395159677618996e-02,-8.855745345673866897e-02,-1.115516204466316108e-01,7.202344235622680502e-02,-1.363384783546057466e-01,-2.416811810739142793e-02,1.301204440225250947e-01
-7.915702316707960706e-02,1.141588005951703066e-01,6.686083265201599179e-02,1.287111686863843529e-01,2.473975703801066517e-02,-1.322404766473314064e-01,-2.983721378252006916e-03,1.310496565884987918e-01,-2.732415876580584005e-02,-1.288632116266487659e-01
5.206530798032459745e-02,1.216170512013044352e-01,-5.795512723704075719e-02,1.194211075502552150e-01,5.694762857204010292e-02,-1.194196682182662311e-01,3.880903198118697967e-02,-1.264811108509467652e-01,-3.923110036449470317e-02,1.263597894281708600e-01
2.362201279830575956e-02,1.314103701968460935e-01,-1.894655803454705495e-02,-1.281343625676345799e-01,4.551780530925285395e-02,-1.242677251141075384e-01,4.556008398878576976e-02,-1.154706617162795240e-01,-6.432709669170913469e-02,-1.156026990043369645e-01
3.541968690176261481e-02,-1.043317743199037723e-01,-8.255849305822510198e-02,-1.045921746667175106e-01,-8.136524454805216244e-02,1.146199646789305693e-01,-6.747081846575217479e-02,1.180598135173321350e-01,-2.589045902467392024e-02,-1.325862994947436813e-01
-1.254378079141894864e-01,4.210188773743673424e-02,-1.254257987078249426e-01,-4.548233839695433461e-02,1.242386357674367670e-01,-4.550082079491895443e-02,1.241438030327144948e-01,4.767764236330111760e-02,1.234109781378814746e-01,4.781054695615482436e-02
4.907660228271074065e-02,-1.236787793621041132e-01,4.699299184917672678e-02,-1.236725812106779093e-01,-5.164128211987936007e-02,-1.217099377231942448e-01,-7.486093453165301725e-02,1.111168006499578531e-01,1.075671302368548521e-01,7.620535034046410638e-02
9.452075180540971166e-05,-1.322902673439989574e-01,2.435218791732953782e-03,-1.322794824496922594e-01,-1.898950670456058020e-03,1.322904001605452462e-01,-1.849974526197229992e-03,-1.322790781692075313e-01,-2.551005239930259107e-03,1.322782345185834485e-01
-1.057361080112774188e-01,7.965339236945424839e-02,1.049462742895792694e-01,-7.801390440177202734e-02,-1.068695287730934002e-01,1.040057296190117220e-01,8.164801615289056513e-02,-1.039603708773440688e-01,8.173284923483659092e-02,1.037072957073456592e-01
-7.398610172021892473e-02,1.140009781145692319e-01,-6.656270223676413744e-02,-1.163123541449655879e-01,-6.156539851238117256e-02,-1.245386007273784346e-01,9.608776920817820727e-03,1.316458007564152710e-01,1.244053547440109563e-02,1.321721545004088672e-01
1.322262629767032294e-01,4.536425500885941410e-03,1.321231860681382764e-01,6.903824135378448280e-03,-1.322780731824781120e-01,2.582856125975793293e-03,-1.322959118214530605e-01,-1.395899882091866271e-03,-1.322972461657888343e-01,1.117723324128220294e-03
1.301220149683495475e-01,2.394004881400142032e-02,1.301193217705884364e-01,-6.602093375947287041e-03,1.321340544691100294e-01,5.249653992702264967e-03,-1.322028821621373806e-01,-4.991978262299631881e-03,1.322314192881418604e-01,4.355274474171614424e-03
-1.335117384780496741e-01,6.376651946992367009e-03,1.322529211034910168e-01,-8.943090743009373539e-03,-1.337131209129871212e-01,-2.402760474801572330e-02,1.288590270489431977e-01,-1.027663559777321038e-02,1.309132553731012227e-01,-1.496773343680274718e-02
1.322904916961815669e-01,-1.696501790321562099e-03,1.322920304599532193e-01,1.732984255774226798e-03,-1.322880064028994773e-01,1.872671357280546959e-03,1.322904862246466196e-01,-1.956995008073971615e-03,1.322913139275394556e-01,1.790077552628614472e-03
-1.314580066986684725e-01,1.404181341836023382e-02,1.315523051729839688e-01,-1.422869439675544627e-02,1.315441479840928907e-01,-1.414804612748935680e-02,-1.319111395777736451e-01,1.018672064768194781e-02,1.321247158128351640e-01,6.822078767650287603e-03
-5.464428451152798794e-02,1.206673747156772752e-01,6.399309629891994367e-02,5.563584696327800172e-02,-1.201809918083016210e-01,-6.374694646369237494e-02,1.162175241900968298e-01,-6.751110093449458338e-02,1.138789087676392725e-01,-6.931278210414103247e-02
9.608640676993945862e-02,1.089480466746170773e-01,6.811912560607730205e-02,-1.130918396475727311e-01,6.817611397527696682e-02,-1.133554471702697686e-01,-4.884129232612970800e-02,1.229012567972602998e-01,5.143752179812443454e-02,-1.217229545351302816e-01
1.298364371601949396e-01,-2.319133066064160004e-02,1.302562336465147574e-01,-2.036748098603243656e-02,-1.307244432598167749e-01,-2.036573941191394468e-02,1.306057023869488520e-01,-2.112363768414475887e-02,-1.306010412296244316e-01,2.152422091798136469e-02
1.031313098348761031e-01,-8.287646137221535425e-02,1.023743628577121895e-01,-8.379212011095658885e-02,-9.393036742618857127e-02,-9.331965999230183717e-02,9.379627912757242114e-02,-9.327436778102626835e-02,-9.437619620268797305e-02,-9.177857044653771335e-02
2.659038959261632654e-02,-1.296026683859514139e-01,2.656110718204496290e-02,1.302224946424799523e-01,3.648923631679012146e-03,-1.322529867092618050e-01,4.827860742817694298e-03,-1.322132019369161859e-01,-4.909100472299211468e-03,-1.322118954579850625e-01
2.071817749849410098e-02,1.307535656230078558e-01,-2.018712155680906992e-02,-1.309353217254910495e-01,5.239745027298420288e-02,-1.214288625321400805e-01,-5.256540547998517221e-02,-1.214307592108746364e-01,5.089896259825044122e-02,-1.221375557693873126e-01
4.201546273571372947e-02,-1.246115573258087805e-01,-4.152808792323847004e-02,1.316896148948051570e-01,-2.441752750288879795e-02,-7.187791964535658606e-02,1.144300961487558776e-01,5.656531994238651884e-02,-1.193394443644379410e-01,-5.737585475540692842e-02
1.321376629919075452e-01,-6.449255463308528787e-03,1.321540295652251784e-01,-5.113815633214067839e-03,-1.326297263148228101e-01,1.162935151190676482e-02,-1.318165274987208313e-01,-2.226134274660456977e-02,1.306136844177488154e-01,-2.125005340794365594e-02
-1.115927260035856350e-01,7.049940523090944544e-02,1.120737116962113172e-01,-7.043991738619115317e-02,-1.172076574935512205e-01,-6.172014461137462910e-02,-1.191075164675254178e-01,-5.758137331425959571e-02,-1.190922385662043365e-01,5.044701059435036106e-02
-3.653243286851393795e-02,1.273773983574155999e-01,3.576313180433920297e-02,-1.274165384998364736e-01,3.476645927750973003e-02,1.276536418457459576e-01,-3.476759561595839376e-02,-1.276535782577036815e-01,-2.979391745452670062e-02,-1.288991384873906798e-01
8.341711412264932179e-02,-1.026929586839709502e-01,-9.697665491055230957e-02,8.999826250191773902e-02,-9.697681269910175816e-02,5.196206009122230490e-02,-1.220613647067069069e-01,5.103910533584001680e-02,1.221410581874809026e-01,-5.350438428645621497e-03
-3.635370327117478512e-02,-1.269305692531752794e-01,-3.739281386417206421e-02,1.267767442129956457e-01,-3.783621487784880055e-02,-5.431903105811878435e-02,1.206426100185248457e-01,5.433499332852208263e-02,1.210414810953790582e-01,-5.341302832733264838e-02
-8.290580339356812267e-03,-1.320234300000112382e-01,-1.386237470931548504e-02,-1.316112042169135521e-01,1.325414277857252937e-02,1.316327783095687654e-01,-1.332187488227772748e-02,1.316348339135461620e-01,2.734885370112154906e-02,-1.295129596730338062e-01
