-1.000000000000000000e+02,-8.168138414675745196e+01,-9.738802211193321057e+01,-1.000000000000000000e+02,-1.000000000000000000e+02,-4.712493282357549873e+01,-4.712399817177300321e+01,-9.424400924010747360e+01,-9.738635966612224593e+01,-5.969145669792145981e+01,-1.000000000000000000e+02,-1.000000000000000000e+02,-1.000000000000000000e+02,-1.000000000000000000e+02,-1.000000000000000000e+02,-1.000000000000000000e+02,-1.000000000000000000e+02,-9.738884220522571411e+01,-1.000000000000000000e+02,-5.969142014219992376e+01,-1.000000000000000000e+02,-1.000000000000000000e+02,-9.739025335598779520e+01,-1.000000000000000000e+02,-7.225481869046156191e+01,-1.884747244484437800e+01,-9.425685613689203990e+00,-3.141237369111402611e+00,-2.457036871196164804e-03,9.479714418138675356e-05
-1.000000000000000000e+02,-9.738803292136604739e+01,-1.000000000000000000e+02,-8.482210422786795334e+01,-9.424625262422074456e+01,-1.000000000000000000e+02,-1.000000000000000000e+02,-1.000000000000000000e+02,-1.000000000000000000e+02,-1.000000000000000000e+02,-1.000000000000000000e+02,-2.827461249726007608e+01,-1.884861937996361902e+01,-1.570852025598595070e+01,-3.455705983723761676e+01,-1.000000000000000000e+02,-1.000000000000000000e+02,-1.000000000000000000e+02,-1.000000000000000000e+02,-5.026690498549517372e+01,-1.000000000000000000e+02,-1.000000000000000000e+02,-9.738803291148178687e+01,-1.000000000000000000e+02,-1.000000000000000000e+02,-1.000000000000000000e+02,-1.000000000000000000e+02,-3.141591020689121549e+01,-1.884755503463139803e+01,1.314657896276590237e-08
-1.000000000000000000e+02,-9.739170747862904420e+01,-1.000000000000000000e+02,-1.000000000000000000e+02,-6.597135459271042635e+01,-3.141095014197940216e+01,-2.512849232061260807e+01,-1.570847063200980109e+01,-1.000000000000000000e+02,-9.738502412400323749e+01,-1.000000000000000000e+02,-1.000000000000000000e+02,-1.000000000000000000e+02,-8.168058838835582947e+01,-3.141834831872627376e+01,-5.968992882038926240e+01,-9.999999999974754417e+01,-1.000000000000000000e+02,-6.911256008340603785e+01,-3.770097437973461041e+01,-3.141483156832429557e+01,-9.428325385849879225e+00,-2.513300421070883317e+01,-1.000000000000000000e+02,-1.000000000000000000e+02,-1.000000000000000000e+02,-3.455797954651072956e+01,-4.084065871398544800e+01,-4.084023328517331919e+01,-1.000000000000000000e+02
-1.000000000000000000e+02,-1.000000000000000000e+02,-1.000000000000000000e+02,-9.738769459147407304e+01,-8.796356417729430177e+01,-1.000000000000000000e+02,-1.000000000000000000e+02,-1.000000000000000000e+02,-5.654900349605245680e+01,-6.911396375412360271e+01,-9.738743763286721844e+01,-1.000000000000000000e+02,-1.000000000000000000e+02,-5.654730755327089753e+01,-2.199275907588835821e+01,-3.769822503444814998e+01,-7.539624617352052383e+01,-1.000000000000000000e+02,-1.000000000000000000e+02,-1.000000000000000000e+02,-1.000000000000000000e+02,-6.911384187269933932e+01,-5.026627862123279300e+01,-1.000000000000000000e+02,-1.000000000000000000e+02,-7.853798225909440589e+01,-4.712174485498823628e+01,3.137222436862720620e+00,-3.140181207498839999e+00,3.137704673351049411e+00
-1.000000000000000000e+02,-1.000000000000000000e+02,-1.000000000000000000e+02,-5.654714864701626453e+01,-4.398528155147585039e+01,-2.826878979334950159e+01,-4.397785093719585348e+01,-1.000000000000000000e+02,-4.712555591988897419e+01,-6.282666571147700552e+01,-5.654458724552159765e+01,-5.968641839932450210e+01,-7.854059206282020966e+01,-1.000000000000000000e+02,-1.000000000000000000e+02,-9.738520899960859367e+01,-8.796320390214214058e+01,-1.000000000000000000e+02,-1.000000000000000000e+02,-1.000000000000000000e+02,-1.000000000000000000e+02,-1.000000000000000000e+02,-8.168112273065734996e+01,-9.738258079037977666e+01,-9.110757488504022206e+01,-1.000000000000000000e+02,-6.597325592604885003e+01,-5.026825980632529678e+01,-1.000000000000000000e+02,2.826887289433298633e+01
-1.000000000000000000e+02,-1.000000000000000000e+02,-8.817239531400633723e+01,-4.675621406364692234e+01,-3.789738967830199101e+01,-5.343429035287367412e+01,-9.179048865609532015e+01,-1.000000000000000000e+02,-1.000000000000000000e+02,-1.553432311190261572e+01,-3.131626012112162982e+01,-1.000000000000000000e+02,-1.000000000000000000e+02,-1.000000000000000000e+02,-1.000000000000000000e+02,-1.000000000000000000e+02,-9.140721414846990456e+01,-1.000000000000000000e+02,-9.081585407450192804e+01,-1.000000000000000000e+02,-6.603345966856572602e+01,-1.000000000000000000e+02,-1.000000000000000000e+02,-1.000000000000000000e+02,-1.000000000000000000e+02,-1.000000000000000000e+02,-9.093240946438773165e+01,-1.000000000000000000e+02,-1.000000000000000000e+02,9.232756317062786877e+00
-1.000000000000000000e+02,-1.000000000000000000e+02,-7.853936663668919493e+01,-1.000000000000000000e+02,-1.000000000000000000e+02,-4.084108781412870570e+01,-4.083862111072723167e+01,-2.827607229283792023e+01,-1.000000000000000000e+02,-3.770009473835656877e+01,-4.712359738909351847e+01,-1.000000000000000000e+02,-1.000000000000000000e+02,-9.738803312006540125e+01,-1.000000000000000000e+02,-1.000000000000000000e+02,-1.000000000000000000e+02,-9.738803215475239483e+01,-1.000000000000000000e+02,-1.000000000000000000e+02,-4.398423558106528475e+01,-1.000000000000000000e+02,-1.000000000000000000e+02,-1.000000000000000000e+02,-8.796340792070206760e+01,-8.796341035519809282e+01,-1.000000000000000000e+02,-1.000000000000000000e+02,-3.769808478576933197e+01,6.282273495588448498e+00
-1.000000000000000000e+02,-8.482222622154981195e+01,-1.000000000000000000e+02,-1.000000000000000000e+02,-1.000000000000000000e+02,-5.968891057021046720e+01,-3.141619571802574029e+01,-3.769732997051924173e+01,-3.769826149192950027e+01,-5.026327069418535132e+01,-4.398053051300232141e+01,-3.141744482568342534e+01,-1.000000000000000000e+02,-1.000000000000000000e+02,-6.911513487665531841e+01,-1.000000000000000000e+02,-1.000000000000000000e+02,-1.000000000000000000e+02,-1.000000000000000000e+02,-1.000000000000000000e+02,-9.110511745229786129e+01,-1.000000000000000000e+02,-1.000000000000000000e+02,-1.000000000000000000e+02,-4.398210556186990061e+01,-3.455818489011210914e+01,-7.539623961365117566e+01,-1.000000000000000000e+02,-6.283034011888391746e+01,-3.141344274668858816e+01
-9.999999999916698812e+01,-6.597159926637549177e+01,-2.513247672896667595e+01,-1.570707462603500559e+01,-1.256537952095169608e+01,-1.256538677686256378e+01,-1.570650444714203431e+01,-1.884965358494018162e+01,-4.712278610258055522e+01,-1.000000000000000000e+02,-5.968959024758780885e+01,-5.026581466408678267e+01,-1.000000000000000000e+02,-1.000000000000000000e+02,-1.000000000000000000e+02,-1.000000000000000000e+02,-6.597373334777228138e+01,-1.000000000000000000e+02,-1.000000000000000000e+02,-1.000000000000000000e+02,-1.000000000000000000e+02,-1.000000000000000000e+02,-9.738804273857229532e+01,-1.000000000000000000e+02,-9.738801999676863375e+01,-1.000000000000000000e+02,-1.000000000000000000e+02,-1.000000000000000000e+02,-9.424658411078183917e+01,-1.000000000000000000e+02
-1.000000000000000000e+02,-1.000000000000000000e+02,-1.000000000000000000e+02,-1.000000000000000000e+02,-9.383755185807333987e+01,-5.995883003019328328e+01,-1.000000000000000000e+02,-5.671857573083808290e+01,-6.300069491690816648e+01,-4.026487628148920095e+01,-1.589882432706086668e+01,-1.000000000000000000e+02,-4.669907785309236203e+01,-1.570331338975365121e+01,-1.552707832091136453e+01,-4.724281639881043304e+01,-1.000000000000000000e+02,-9.160359428499687340e+01,-1.000000000000000000e+02,-7.514388160650665327e+01,-1.000000000000000000e+02,-1.000000000000000000e+02,-7.899386319249352084e+01,-1.000000000000000000e+02,-6.272129026435813159e+01,-1.000000000000000000e+02,-1.000000000000000000e+02,-1.000000000000000000e+02,-1.000000000000000000e+02,6.040899008931415182e+00
-1.000000000000000000e+02,-1.000000000000000000e+02,-1.000000000000000000e+02,-4.400537896159193707e+01,-6.274360839761523323e+01,-3.147018012360330630e+01,-6.293444805916836415e+00,-1.256423062324891404e+01,-3.461595123787568440e+01,-4.711001360559365025e+01,-1.000000000000000000e+02,-1.000000000000000000e+02,-1.000000000000000000e+02,-9.101296621585660773e+01,-1.000000000000000000e+02,-5.961039542012665038e+01,-1.000000000000000000e+02,-1.000000000000000000e+02,-1.000000000000000000e+02,-5.968298845573561096e+01,-1.000000000000000000e+02,-1.000000000000000000e+02,-7.546163896889051159e+01,-1.000000000000000000e+02,-1.000000000000000000e+02,-1.000000000000000000e+02,-1.000000000000000000e+02,-1.000000000000000000e+02,-6.180478417186439977e+00,-1.255680966018969968e+01
-1.000000000000000000e+02,-2.827646107729188074e+01,-1.000000000000000000e+02,-4.712699885148854406e+01,-9.424127635363737454e+01,-1.885237040094161287e+01,-1.570724172190373125e+01,-2.199082972395840585e+01,-4.084103685180659937e+01,-1.000000000000000000e+02,-1.000000000000000000e+02,-1.000000000000000000e+02,-1.000000000000000000e+02,-5.026860793355358936e+01,-9.110331002264406663e+01,-1.000000000000000000e+02,-1.000000000000000000e+02,-3.456211643334371786e+01,-6.597177702288114176e+01,-1.000000000000000000e+02,-6.283018836053359735e+01,-1.000000000000000000e+02,-1.000000000000000000e+02,-1.000000000000000000e+02,-7.225800710003350957e+01,-1.000000000000000000e+02,-1.000000000000000000e+02,-1.000000000000000000e+02,-6.911302569250145211e+01,-9.424322890836508648e+00
-1.000000000000000000e+02,-1.000000000000000000e+02,-6.284353424472017835e+00,-3.143911768003979201e+00,-9.424419810768714711e+00,-3.455682511724881323e+01,-1.000000000000000000e+02,-9.738803658377611328e+01,-1.000000000000000000e+02,-1.000000000000000000e+02,-1.000000000000000000e+02,-8.482232161076393595e+01,-1.000000000000000000e+02,-1.000000000000000000e+02,-5.968903719441360067e+01,-3.770076104522416216e+01,-1.000000000000000000e+02,-1.000000000000000000e+02,-1.000000000000000000e+02,-5.026382755262316948e+01,-6.288111435409028616e+00,-5.968741524989040670e+01,-7.225401033928326910e+01,-4.398359886134790031e+01,-1.000000000000000000e+02,-5.340816358093006500e+01,-1.000000000000000000e+02,-3.141603384997258885e+01,-2.198951246234098988e+01,1.256352252681895365e+01
-1.000000000000000000e+02,-7.221282147501833037e+01,-1.000000000000000000e+02,-4.092642777321037073e+01,-4.404520085032147847e+01,-1.000000000000000000e+02,-4.081696891498984314e+01,-1.000000000000000000e+02,-1.000000000000000000e+02,-3.456492705127229215e+01,-1.874106584627491756e+01,-4.710093274617459969e+01,-4.081131155957669421e+01,-9.124055349646644686e+01,-1.000000000000000000e+02,-1.000000000000000000e+02,-6.596565905404715124e+01,-1.000000000000000000e+02,-7.856072841819572261e+01,-6.286009900563860242e+01,-1.000000000000000000e+02,-3.145568336674793741e+01,6.268544955217756787e+00,-3.247538894230815654e+00,-3.131922559200262413e+00,-9.427915086970553205e+01,-1.000000000000000000e+02,-5.019678004572367058e+01,-1.000000000000000000e+02,-2.827177635542280854e+01
-1.000000000000000000e+02,-1.000000000000000000e+02,-1.000000000000000000e+02,-1.000000000000000000e+02,-1.000000000000000000e+02,-1.000000000000000000e+02,-1.000000000000000000e+02,-1.000000000000000000e+02,-1.000000000000000000e+02,-1.000000000000000000e+02,-1.000000000000000000e+02,-9.110511676538465053e+01,-1.000000000000000000e+02,-4.712331187889916606e+01,-3.141587032305354654e+01,-4.084061325608209359e+01,-1.000000000000000000e+02,-9.738803292926129984e+01,-1.000000000000000000e+02,-1.000000000000000000e+02,-1.000000000000000000e+02,-1.000000000000000000e+02,-8.796326668554259243e+01,-8.168052701338287136e+01,-1.000000000000000000e+02,-1.000000000000000000e+02,-1.000000000000000000e+02,-1.000000000000000000e+02,-1.000000000000000000e+02,3.141418223460963777e+00
-1.000000000000000000e+02,-6.911360554003027801e+01,-4.398349043250040324e+01,-1.000000000000000000e+02,-1.000000000000000000e+02,-9.738803291955363761e+01,-1.000000000000000000e+02,-1.000000000000000000e+02,-1.000000000000000000e+02,-7.853936612036450526e+01,-1.000000000000000000e+02,-1.000000000000000000e+02,-1.000000000000000000e+02,-1.000000000000000000e+02,-7.225550694069850977e+01,-5.968783736531806028e+01,-1.885181055355452884e+01,-3.769575712782555144e+01,-2.199157590156200826e+01,-3.141612290576382804e+01,-1.000000000000000000e+02,-1.000000000000000000e+02,-1.000000000000000000e+02,-1.000000000000000000e+02,-1.000000000000000000e+02,-1.000000000000000000e+02,-9.738803290159616211e+01,-1.000000000000000000e+02,-1.000000000000000000e+02,-1.000000000000000000e+02
-1.000000000000000000e+02,-1.000000000000000000e+02,-1.000000000000000000e+02,-1.000000000000000000e+02,-1.000000000000000000e+02,-1.000000000000000000e+02,-1.000000000000000000e+02,-1.000000000000000000e+02,-3.769994914658209950e+01,-4.397981879650245673e+01,-2.827422433559278403e+01,-3.455771958473562222e+01,-9.424516608742757739e+01,-1.000000000000000000e+02,-1.000000000000000000e+02,-1.000000000000000000e+02,-1.000000000000000000e+02,-1.000000000000000000e+02,-9.110511675694783662e+01,-1.000000000000000000e+02,-1.000000000000000000e+02,-1.000000000000000000e+02,-6.597346574423291088e+01,-8.796289337740137171e+01,-1.000000000000000000e+02,-1.000000000000000000e+02,-1.000000000000000000e+02,-5.654961117566834616e+01,-1.000000000000000000e+02,2.632490629419656110e-08
-1.000000000000000000e+02,-8.162102308927667593e+01,-1.000000000000000000e+02,-6.592819016075429772e+01,-5.647602338034539571e+01,-4.716406986337610618e+01,-1.000000000000000000e+02,-1.000000000000000000e+02,-7.533164217646175587e+01,-8.190727712841881214e+01,-1.000000000000000000e+02,-6.285421687021275261e+01,-9.404438193154850012e+01,-1.000000000000000000e+02,-4.395684184791323901e+01,-2.507339895403311303e+01,-3.459434350267947167e+01,-5.017801098432674678e+01,-1.000000000000000000e+02,-5.986102494857874490e+01,-7.842225486518054822e+01,-1.000000000000000000e+02,-1.000000000000000000e+02,-6.293110607472480922e+01,-1.550254009914926101e+01,-1.252256068062940386e+01,-4.395277947057070378e+01,-1.000000000000000000e+02,-8.792338974446938948e+01,1.576128907489452580e+01
-1.000000000000000000e+02,-5.654955602938521508e+01,-9.738710453025218783e+01,-1.000000000000000000e+02,-1.000000000000000000e+02,-4.712556602299120811e+01,-1.000000000000000000e+02,-8.168079289483792138e+01,-1.000000000000000000e+02,-1.000000000000000000e+02,-7.225653640727196603e+01,-1.000000000000000000e+02,-9.110511668857807877e+01,-1.000000000000000000e+02,-9.738803297468439268e+01,-1.000000000000000000e+02,-1.000000000000000000e+02,-1.000000000000000000e+02,-1.000000000000000000e+02,-4.084291603070103349e+01,-1.000000000000000000e+02,-6.283166460375721840e+01,-7.225559790829967710e+01,-1.000000000000000000e+02,-1.000000000000000000e+02,-3.455762430985111422e+01,-2.513144221227808472e+01,-1.884997463346260815e+01,-3.455383385673388830e+01,1.256447226693362751e+01
-1.000000000000000000e+02,-1.000000000000000000e+02,-1.000000000000000000e+02,-4.091143308056629735e+01,-2.508209518840225982e+01,-6.286060140814234920e+00,-1.000000000000000000e+02,-1.000000000000000000e+02,-1.000000000000000000e+02,-5.026452297938721614e+01,-1.000000000000000000e+02,-1.000000000000000000e+02,-1.000000000000000000e+02,-9.105517643796709137e+01,-1.000000000000000000e+02,-1.000000000000000000e+02,-6.277525390070314160e+01,-5.966224184086176052e+01,-5.344580964334441120e+01,-1.000000000000000000e+02,-1.000000000000000000e+02,-1.000000000000000000e+02,-4.737793844104501773e+01,-3.141627392447829337e+01,-1.000000000000000000e+02,-1.000000000000000000e+02,-1.000000000000000000e+02,-5.024677348048148673e+01,-1.892947417917932640e+01,-9.452756394325140477e+00
-1.000000000000000000e+02,-1.000000000000000000e+02,-2.513335425562353009e+01,-1.884801041046853953e+01,-1.256577309505905227e+01,-1.256679345407390258e+01,-3.141344610074320087e+01,-3.455570979651852781e+01,-3.141552459741971148e+01,-4.712331381373574146e+01,-1.000000000000000000e+02,-1.000000000000000000e+02,-1.000000000000000000e+02,-1.000000000000000000e+02,-1.000000000000000000e+02,-5.654961581291306771e+01,-1.000000000000000000e+02,-1.000000000000000000e+02,-1.000000000000000000e+02,-9.738803257201179520e+01,-1.000000000000000000e+02,-1.000000000000000000e+02,-9.424657458474990790e+01,-1.000000000000000000e+02,-1.000000000000000000e+02,-1.000000000000000000e+02,-7.853936268483649030e+01,-1.000000000000000000e+02,-1.000000000000000000e+02,-2.466255695759866809e-06
-1.000000000000000000e+02,-7.225653629096895258e+01,-1.000000000000000000e+02,-1.000000000000000000e+02,-8.796366845846334570e+01,-1.000000000000000000e+02,-5.340670497134343009e+01,-4.712425861215507439e+01,-1.000000000000000000e+02,-1.000000000000000000e+02,-1.000000000000000000e+02,-1.000000000000000000e+02,-1.000000000000000000e+02,-1.000000000000000000e+02,-1.000000000000000000e+02,-7.225653629886292606e+01,-1.000000000000000000e+02,-5.654961117024304684e+01,-1.000000000000000000e+02,-1.000000000000000000e+02,-9.738765236589570407e+01,-8.168073719560690904e+01,-1.000000000000000000e+02,-1.000000000000000000e+02,-1.000000000000000000e+02,-7.853917014174929534e+01,-9.110345742766236299e+01,-4.712538179283365025e+01,-1.000000000000000000e+02,-9.424256688631039935e+00
-1.000000000000000000e+02,-1.000000000000000000e+02,-1.000000000000000000e+02,-1.000000000000000000e+02,-9.110429363563284255e+01,-7.853724905705534809e+01,-1.000000000000000000e+02,-1.000000000000000000e+02,-5.654611761073278586e+01,-3.769583670982031265e+01,-4.712392431692472883e+01,-1.000000000000000000e+02,-1.000000000000000000e+02,-9.738642399065246025e+01,-4.084102756456464078e+01,-4.712323553479809135e+01,-6.910718568317413713e+01,-1.000000000000000000e+02,-5.969090127739444540e+01,-1.000000000000000000e+02,-8.482704993505731750e+01,-1.000000000000000000e+02,-1.000000000000000000e+02,-4.083902257691580218e+01,-1.885181230673701691e+01,-5.654125380910529941e+01,-1.000000000000000000e+02,-6.282531388517940485e+01,-5.026433090488929167e+01,-3.139314130027775818e+00
-1.000000000000000000e+02,-6.597587713846482416e+01,-9.738634531479380030e+01,-1.000000000000000000e+02,-9.424390603584872395e+01,-9.738981152093168703e+01,-1.000000000000000000e+02,-7.539555669456109399e+01,-6.597511231014385658e+01,-1.000000000000000000e+02,-1.000000000000000000e+02,-1.000000000000000000e+02,-9.110517017373975079e+01,-9.739129361175589850e+01,-1.000000000000000000e+02,-1.000000000000000000e+02,-1.000000000000000000e+02,-1.000000000000000000e+02,-5.654406177757989127e+01,-2.827588997341077715e+01,-3.769793030095459585e+01,-1.000000000000000000e+02,9.420542487539249166e+00,-9.426163802302360395e+00,-3.769937058870198143e+01,-1.000000000000000000e+02,-9.110448297421710606e+01,-2.827334314553671746e+01,-3.455610156753194673e+01,-4.712235175230821937e+01
-1.000000000000000000e+02,-1.000000000000000000e+02,-1.000000000000000000e+02,-1.000000000000000000e+02,-1.000000000000000000e+02,-9.738803289447726286e+01,-1.000000000000000000e+02,-1.000000000000000000e+02,-1.000000000000000000e+02,-1.000000000000000000e+02,-1.000000000000000000e+02,-5.654873032634393581e+01,-6.597258104672084755e+01,-1.000000000000000000e+02,-1.000000000000000000e+02,-1.000000000000000000e+02,-1.000000000000000000e+02,-1.000000000000000000e+02,-5.969097823805366687e+01,-1.000000000000000000e+02,-1.000000000000000000e+02,-1.000000000000000000e+02,-1.000000000000000000e+02,-9.738744734458030905e+01,-7.225647974829031739e+01,-1.000000000000000000e+02,-1.000000000000000000e+02,-1.000000000000000000e+02,-1.000000000000000000e+02,-1.457703827638220621e-08
-1.000000000000000000e+02,-3.770099478898838186e+01,-7.225486466907851479e+01,-1.000000000000000000e+02,-9.738803293195492472e+01,-1.000000000000000000e+02,-1.000000000000000000e+02,-8.482222706156382230e+01,-1.000000000000000000e+02,-1.000000000000000000e+02,-6.283128240770124506e+01,-5.968999934241086436e+01,-1.000000000000000000e+02,-1.000000000000000000e+02,-1.000000000000000000e+02,-8.796366845281842473e+01,-1.000000000000000000e+02,-1.000000000000000000e+02,-8.482196443826590837e+01,-8.796333861181309999e+01,-1.000000000000000000e+02,-1.000000000000000000e+02,-6.911389649053558060e+01,-5.340747368221094149e+01,-1.000000000000000000e+02,-1.000000000000000000e+02,-1.000000000000000000e+02,-1.000000000000000000e+02,-1.000000000000000000e+02,-1.000000000000000000e+02
-1.000000000000000000e+02,-1.000000000000000000e+02,-1.000000000000000000e+02,-1.000000000000000000e+02,-1.000000000000000000e+02,-1.000000000000000000e+02,-1.000000000000000000e+02,-7.539648884117015371e+01,-5.340604113160336652e+01,-5.026521375780128409e+01,-1.000000000000000000e+02,-1.000000000000000000e+02,-3.455663624504222753e+01,-9.428671821992514523e+00,-5.968833068930488395e+01,-9.738701371374583005e+01,-1.000000000000000000e+02,-1.000000000000000000e+02,-5.340826528457990463e+01,-1.000000000000000000e+02,-6.911398071411308308e+01,-5.654795502654958739e+01,-5.968983574738150111e+01,-1.000000000000000000e+02,-9.738791778050973846e+01,-9.110494623185806518e+01,-1.000000000000000000e+02,-5.340571855308863292e+01,-2.198966538817166594e+01,-3.141035754689756487e+00
-1.000000000000000000e+02,-4.084012534330544497e+01,-2.199229356101067268e+01,-4.084012531900906851e+01,-1.000000000000000000e+02,-1.000000000000000000e+02,-1.000000000000000000e+02,-1.000000000000000000e+02,-1.000000000000000000e+02,-1.000000000000000000e+02,-7.225602855117209344e+01,-7.853870871022520816e+01,-1.000000000000000000e+02,-1.000000000000000000e+02,-1.000000000000000000e+02,-6.911500670996534268e+01,-9.424590202878161449e+01,-1.000000000000000000e+02,-1.000000000000000000e+02,-4.712449240336803769e+01,-5.968877455777814589e+01,-7.225550683758756065e+01,-1.000000000000000000e+02,-6.283157287887300413e+01,-6.911418143815200210e+01,-1.000000000000000000e+02,-1.000000000000000000e+02,-1.000000000000000000e+02,-3.455689626214586951e+01,-1.256447225618894414e+01
-1.000000000000000000e+02,-1.000000000000000000e+02,-1.000000000000000000e+02,-1.000000000000000000e+02,-1.000000000000000000e+02,-7.539632283252240086e+01,-3.769894480115203805e+01,-3.455836327163385846e+01,-1.000000000000000000e+02,-1.000000000000000000e+02,-1.000000000000000000e+02,-1.000000000000000000e+02,-5.969097823002332603e+01,-1.000000000000000000e+02,-1.000000000000000000e+02,-7.225653632028965490e+01,-1.000000000000000000e+02,-1.000000000000000000e+02,-1.000000000000000000e+02,-9.424657167437597138e+01,-1.000000000000000000e+02,-8.482222707275229823e+01,-1.000000000000000000e+02,-1.000000000000000000e+02,-1.000000000000000000e+02,-1.000000000000000000e+02,-8.482222704772283350e+01,-1.000000000000000000e+02,-1.884945960048521485e+01,-3.140679576076932378e+00
-1.000000000000000000e+02,-1.000000000000000000e+02,-4.667570474720147189e+01,-5.654836522810588662e+01,-1.000000000000000000e+02,-7.866233638838369302e+01,-3.775047974990911825e+01,-1.590179283146333944e+01,-1.238870289499923771e+01,-1.243173697563725533e+01,-4.403048489263326815e+01,-2.826136659401510087e+01,-6.921557612023930517e+01,-9.090674055848542423e+01,-8.460936450192336622e+01,-1.000000000000000000e+02,-9.998969099707480268e+01,-9.128064806262509023e+01,-9.134543534181909763e+01,-1.000000000000000000e+02,-3.718549571218224514e+01,-4.725408104643499030e+01,-1.000000000000000000e+02,-9.729471930430767657e+01,-1.000000000000000000e+02,-6.279291604232702184e+01,-3.145906606182349918e+01,-4.710083698630663207e+01,-6.658512502796797961e+00,3.041280083905412823e+00
