7.097651761857708351e-13,-7.530924302762984020e-06,-1.000000000000000000e+02,-1.000000000000000000e+02,-1.000000000000000000e+02,1.000000000000000000e+02,-1.000000000000000000e+02,-1.000000000000000000e+02,-1.000000000000000000e+02,-1.000000000000000000e+02,-1.000000000000000000e+02,-1.000000000000000000e+02,-1.000000000000000000e+02,-1.000000000000000000e+02,-1.000000000000000000e+02,-1.000000000000000000e+02,-1.000000000000000000e+02,-1.000000000000000000e+02,-1.000000000000000000e+02,-1.000000000000000000e+02,-1.000000000000000000e+02,-1.000000000000000000e+02,-1.000000000000000000e+02,-1.000000000000000000e+02,-1.000000000000000000e+02,-1.000000000000000000e+02,-1.000000000000000000e+02,-1.000000000000000000e+02,-1.000000000000000000e+02,-1.000000000000000000e+02
9.049334012550813711e-07,-1.000000000000000000e+02,-1.000000000000000000e+02,-1.000000000000000000e+02,-1.000000000000000000e+02,-1.000000000000000000e+02,-1.000000000000000000e+02,-1.000000000000000000e+02,-1.000000000000000000e+02,-1.000000000000000000e+02,-1.000000000000000000e+02,-1.000000000000000000e+02,-1.000000000000000000e+02,-1.000000000000000000e+02,-1.000000000000000000e+02,-1.000000000000000000e+02,-1.000000000000000000e+02,-1.000000000000000000e+02,-1.000000000000000000e+02,-1.000000000000000000e+02,-1.000000000000000000e+02,-1.000000000000000000e+02,-1.000000000000000000e+02,-1.000000000000000000e+02,-1.000000000000000000e+02,-1.000000000000000000e+02,-1.000000000000000000e+02,-1.000000000000000000e+02,-1.000000000000000000e+02,-1.000000000000000000e+02
-1.098916323714440387e-14,-3.955212787792877641e-06,-1.000000000000000000e+02,-1.000000000000000000e+02,-1.000000000000000000e+02,-1.000000000000000000e+02,-1.000000000000000000e+02,-1.000000000000000000e+02,-1.000000000000000000e+02,-1.000000000000000000e+02,-1.000000000000000000e+02,-1.000000000000000000e+02,-1.000000000000000000e+02,-1.000000000000000000e+02,-1.000000000000000000e+02,-1.000000000000000000e+02,-1.000000000000000000e+02,-1.000000000000000000e+02,-1.000000000000000000e+02,-1.000000000000000000e+02,-1.000000000000000000e+02,-1.000000000000000000e+02,-1.000000000000000000e+02,-1.000000000000000000e+02,-1.000000000000000000e+02,-1.000000000000000000e+02,-1.000000000000000000e+02,-1.000000000000000000e+02,-1.000000000000000000e+02,-1.000000000000000000e+02
-1.078363767472128149e-12,-1.732765989136623292e-05,-1.000000000000000000e+02,-1.000000000000000000e+02,-1.000000000000000000e+02,-1.000000000000000000e+02,-1.000000000000000000e+02,-1.000000000000000000e+02,-1.000000000000000000e+02,-1.000000000000000000e+02,-1.000000000000000000e+02,-1.000000000000000000e+02,-1.000000000000000000e+02,-1.000000000000000000e+02,-1.000000000000000000e+02,-1.000000000000000000e+02,-1.000000000000000000e+02,-1.000000000000000000e+02,-1.000000000000000000e+02,-1.000000000000000000e+02,-1.000000000000000000e+02,-1.000000000000000000e+02,-1.000000000000000000e+02,-1.000000000000000000e+02,-1.000000000000000000e+02,-1.000000000000000000e+02,-1.000000000000000000e+02,-1.000000000000000000e+02,-1.000000000000000000e+02,-1.000000000000000000e+02
-4.322565176884811270e-13,-1.858031311504302339e-05,-1.000000000000000000e+02,-1.000000000000000000e+02,-1.000000000000000000e+02,-1.000000000000000000e+02,-1.000000000000000000e+02,-1.000000000000000000e+02,-1.000000000000000000e+02,-1.000000000000000000e+02,-1.000000000000000000e+02,-1.000000000000000000e+02,-1.000000000000000000e+02,-1.000000000000000000e+02,-1.000000000000000000e+02,-1.000000000000000000e+02,-1.000000000000000000e+02,-1.000000000000000000e+02,-1.000000000000000000e+02,-1.000000000000000000e+02,-1.000000000000000000e+02,-1.000000000000000000e+02,-1.000000000000000000e+02,-1.000000000000000000e+02,-1.000000000000000000e+02,-1.000000000000000000e+02,-1.000000000000000000e+02,-1.000000000000000000e+02,-1.000000000000000000e+02,-1.000000000000000000e+02
-1.000000000000000000e+02,-1.000000000000000000e+02,-2.129372842278000214e-20,-4.363325853052320468e-13,-1.145695896537117732e-05,-1.000000000000000000e+02,-1.000000000000000000e+02,-1.000000000000000000e+02,-1.000000000000000000e+02,-1.000000000000000000e+02,-1.000000000000000000e+02,-1.000000000000000000e+02,-1.000000000000000000e+02,-1.000000000000000000e+02,-1.000000000000000000e+02,-1.000000000000000000e+02,-1.000000000000000000e+02,-1.000000000000000000e+02,-1.000000000000000000e+02,-1.000000000000000000e+02,-1.000000000000000000e+02,-1.000000000000000000e+02,-1.000000000000000000e+02,-1.000000000000000000e+02,-1.000000000000000000e+02,-1.000000000000000000e+02,-1.000000000000000000e+02,-1.000000000000000000e+02,-1.000000000000000000e+02,1.000000000000000000e+02
-4.093298151784914001e-20,-4.991272119145206346e-13,-1.013723098998615618e-05,-1.000000000000000000e+02,-1.000000000000000000e+02,-1.000000000000000000e+02,-1.000000000000000000e+02,-1.000000000000000000e+02,-1.000000000000000000e+02,-1.000000000000000000e+02,-1.000000000000000000e+02,-1.000000000000000000e+02,-1.000000000000000000e+02,-1.000000000000000000e+02,-1.000000000000000000e+02,-1.000000000000000000e+02,-1.000000000000000000e+02,-1.000000000000000000e+02,-1.000000000000000000e+02,-1.000000000000000000e+02,-1.000000000000000000e+02,-1.000000000000000000e+02,-1.000000000000000000e+02,-1.000000000000000000e+02,-1.000000000000000000e+02,-1.000000000000000000e+02,-1.000000000000000000e+02,-1.000000000000000000e+02,-1.000000000000000000e+02,-1.000000000000000000e+02
-1.000000000000000000e+02,-1.000000000000000000e+02,-1.000000000000000000e+02,-1.000000000000000000e+02,-1.000000000000000000e+02,-1.000000000000000000e+02,-1.000000000000000000e+02,-1.000000000000000000e+02,-1.000000000000000000e+02,-1.000000000000000000e+02,-1.000000000000000000e+02,-1.000000000000000000e+02,-1.000000000000000000e+02,-1.000000000000000000e+02,-1.000000000000000000e+02,-1.000000000000000000e+02,-1.000000000000000000e+02,-1.000000000000000000e+02,-1.000000000000000000e+02,-1.000000000000000000e+02,-1.000000000000000000e+02,-1.000000000000000000e+02,-1.000000000000000000e+02,-1.000000000000000000e+02,-1.000000000000000000e+02,-1.000000000000000000e+02,-1.000000000000000000e+02,-1.000000000000000000e+02,-1.000000000000000000e+02,-1.000000000000000000e+02
3.092322136050457823e-20,-7.343278015486029773e-13,-1.055373869906469992e-05,-1.000000000000000000e+02,-1.000000000000000000e+02,-1.000000000000000000e+02,-1.000000000000000000e+02,-1.000000000000000000e+02,-1.000000000000000000e+02,-1.000000000000000000e+02,-1.000000000000000000e+02,-1.000000000000000000e+02,-1.000000000000000000e+02,-1.000000000000000000e+02,-1.000000000000000000e+02,-1.000000000000000000e+02,-1.000000000000000000e+02,-1.000000000000000000e+02,-1.000000000000000000e+02,-1.000000000000000000e+02,-1.000000000000000000e+02,-1.000000000000000000e+02,-1.000000000000000000e+02,-1.000000000000000000e+02,-1.000000000000000000e+02,-1.000000000000000000e+02,-1.000000000000000000e+02,-1.000000000000000000e+02,-1.000000000000000000e+02,-1.000000000000000000e+02
8.786008887147684406e-06,-1.000000000000000000e+02,-1.000000000000000000e+02,-1.000000000000000000e+02,-1.000000000000000000e+02,-1.000000000000000000e+02,-1.000000000000000000e+02,-1.000000000000000000e+02,-1.000000000000000000e+02,-1.000000000000000000e+02,-1.000000000000000000e+02,-1.000000000000000000e+02,-1.000000000000000000e+02,-1.000000000000000000e+02,-1.000000000000000000e+02,-1.000000000000000000e+02,-1.000000000000000000e+02,-1.000000000000000000e+02,-1.000000000000000000e+02,-1.000000000000000000e+02,-1.000000000000000000e+02,-1.000000000000000000e+02,-1.000000000000000000e+02,-1.000000000000000000e+02,-1.000000000000000000e+02,-1.000000000000000000e+02,-1.000000000000000000e+02,-1.000000000000000000e+02,-1.000000000000000000e+02,-1.000000000000000000e+02
-3.342587990934732869e-06,-1.000000000000000000e+02,-1.000000000000000000e+02,-1.000000000000000000e+02,-1.000000000000000000e+02,-1.000000000000000000e+02,-1.000000000000000000e+02,-1.000000000000000000e+02,-1.000000000000000000e+02,-1.000000000000000000e+02,-1.000000000000000000e+02,-1.000000000000000000e+02,-1.000000000000000000e+02,-1.000000000000000000e+02,-1.000000000000000000e+02,-1.000000000000000000e+02,-1.000000000000000000e+02,-1.000000000000000000e+02,-1.000000000000000000e+02,-1.000000000000000000e+02,-1.000000000000000000e+02,-1.000000000000000000e+02,-1.000000000000000000e+02,-1.000000000000000000e+02,-1.000000000000000000e+02,-1.000000000000000000e+02,-1.000000000000000000e+02,-1.000000000000000000e+02,-1.000000000000000000e+02,-1.000000000000000000e+02
-1.761424244823569336e-06,-1.000000000000000000e+02,-1.000000000000000000e+02,-1.000000000000000000e+02,-1.000000000000000000e+02,-1.000000000000000000e+02,-1.000000000000000000e+02,-1.000000000000000000e+02,-1.000000000000000000e+02,-1.000000000000000000e+02,-1.000000000000000000e+02,-1.000000000000000000e+02,-1.000000000000000000e+02,-1.000000000000000000e+02,-1.000000000000000000e+02,-1.000000000000000000e+02,-1.000000000000000000e+02,-1.000000000000000000e+02,-1.000000000000000000e+02,-1.000000000000000000e+02,-1.000000000000000000e+02,-1.000000000000000000e+02,-1.000000000000000000e+02,-1.000000000000000000e+02,-1.000000000000000000e+02,-1.000000000000000000e+02,-1.000000000000000000e+02,-1.000000000000000000e+02,-1.000000000000000000e+02,-1.000000000000000000e+02
1.093230684834203045e-12,-1.594144506359067932e-05,-1.000000000000000000e+02,-1.000000000000000000e+02,-1.000000000000000000e+02,-1.000000000000000000e+02,-1.000000000000000000e+02,-1.000000000000000000e+02,-1.000000000000000000e+02,-1.000000000000000000e+02,-1.000000000000000000e+02,-1.000000000000000000e+02,-1.000000000000000000e+02,-1.000000000000000000e+02,-1.000000000000000000e+02,-1.000000000000000000e+02,-1.000000000000000000e+02,-1.000000000000000000e+02,-1.000000000000000000e+02,-1.000000000000000000e+02,-1.000000000000000000e+02,-1.000000000000000000e+02,-1.000000000000000000e+02,-1.000000000000000000e+02,-1.000000000000000000e+02,-1.000000000000000000e+02,-1.000000000000000000e+02,-1.000000000000000000e+02,-1.000000000000000000e+02,-1.000000000000000000e+02
-1.000000000000000000e+02,-1.000000000000000000e+02,-1.000000000000000000e+02,-1.000000000000000000e+02,-1.000000000000000000e+02,-1.000000000000000000e+02,-1.000000000000000000e+02,-1.000000000000000000e+02,-1.000000000000000000e+02,-1.000000000000000000e+02,-1.000000000000000000e+02,-1.000000000000000000e+02,-1.000000000000000000e+02,-1.000000000000000000e+02,-1.000000000000000000e+02,-1.000000000000000000e+02,-1.000000000000000000e+02,-1.000000000000000000e+02,-1.000000000000000000e+02,-1.000000000000000000e+02,-1.000000000000000000e+02,-1.000000000000000000e+02,-1.000000000000000000e+02,-1.000000000000000000e+02,-1.000000000000000000e+02,-1.000000000000000000e+02,-1.000000000000000000e+02,-1.000000000000000000e+02,-1.000000000000000000e+02,-1.000000000000000000e+02
2.828681957344619802e-06,-1.000000000000000000e+02,-1.000000000000000000e+02,-1.000000000000000000e+02,-1.000000000000000000e+02,-1.000000000000000000e+02,-1.000000000000000000e+02,-1.000000000000000000e+02,-1.000000000000000000e+02,-1.000000000000000000e+02,-1.000000000000000000e+02,-1.000000000000000000e+02,-1.000000000000000000e+02,-1.000000000000000000e+02,-1.000000000000000000e+02,-1.000000000000000000e+02,-1.000000000000000000e+02,-1.000000000000000000e+02,-1.000000000000000000e+02,-1.000000000000000000e+02,-1.000000000000000000e+02,-1.000000000000000000e+02,-1.000000000000000000e+02,-1.000000000000000000e+02,-1.000000000000000000e+02,-1.000000000000000000e+02,-1.000000000000000000e+02,-1.000000000000000000e+02,-1.000000000000000000e+02,-1.000000000000000000e+02
-3.579500254220862263e-20,-5.617225318527608181e-13,-8.577364108032416862e-06,-1.000000000000000000e+02,-1.000000000000000000e+02,-1.000000000000000000e+02,-1.000000000000000000e+02,-1.000000000000000000e+02,-1.000000000000000000e+02,-1.000000000000000000e+02,-1.000000000000000000e+02,-1.000000000000000000e+02,-1.000000000000000000e+02,-1.000000000000000000e+02,-1.000000000000000000e+02,-1.000000000000000000e+02,-1.000000000000000000e+02,-1.000000000000000000e+02,-1.000000000000000000e+02,-1.000000000000000000e+02,-1.000000000000000000e+02,-1.000000000000000000e+02,-1.000000000000000000e+02,-1.000000000000000000e+02,-1.000000000000000000e+02,-1.000000000000000000e+02,-1.000000000000000000e+02,-1.000000000000000000e+02,-1.000000000000000000e+02,1.000000000000000000e+02
3.236779070907997789e-21,-4.919336687051424180e-13,-1.162047528362548574e-05,-1.000000000000000000e+02,-1.000000000000000000e+02,-1.000000000000000000e+02,-1.000000000000000000e+02,-1.000000000000000000e+02,-1.000000000000000000e+02,-1.000000000000000000e+02,-1.000000000000000000e+02,-1.000000000000000000e+02,-1.000000000000000000e+02,-1.000000000000000000e+02,-1.000000000000000000e+02,-1.000000000000000000e+02,-1.000000000000000000e+02,-1.000000000000000000e+02,-1.000000000000000000e+02,-1.000000000000000000e+02,-1.000000000000000000e+02,-1.000000000000000000e+02,-1.000000000000000000e+02,-1.000000000000000000e+02,-1.000000000000000000e+02,-1.000000000000000000e+02,-1.000000000000000000e+02,-1.000000000000000000e+02,-1.000000000000000000e+02,-1.000000000000000000e+02
4.761631119666395646e-20,-6.183950686626959444e-13,-8.948651754360668832e-06,-1.000000000000000000e+02,-1.000000000000000000e+02,-1.000000000000000000e+02,-1.000000000000000000e+02,-1.000000000000000000e+02,-1.000000000000000000e+02,-1.000000000000000000e+02,-1.000000000000000000e+02,-1.000000000000000000e+02,-1.000000000000000000e+02,-1.000000000000000000e+02,-1.000000000000000000e+02,-1.000000000000000000e+02,1.000000000000000000e+02,-1.000000000000000000e+02,-1.000000000000000000e+02,-1.000000000000000000e+02,-1.000000000000000000e+02,-1.000000000000000000e+02,-1.000000000000000000e+02,-1.000000000000000000e+02,-1.000000000000000000e+02,-1.000000000000000000e+02,-1.000000000000000000e+02,-1.000000000000000000e+02,-1.000000000000000000e+02,-1.000000000000000000e+02
7.720095846664061512e-07,-1.000000000000000000e+02,-1.000000000000000000e+02,-1.000000000000000000e+02,-1.000000000000000000e+02,-1.000000000000000000e+02,-1.000000000000000000e+02,-1.000000000000000000e+02,-1.000000000000000000e+02,-1.000000000000000000e+02,-1.000000000000000000e+02,-1.000000000000000000e+02,-1.000000000000000000e+02,-1.000000000000000000e+02,-1.000000000000000000e+02,-1.000000000000000000e+02,-1.000000000000000000e+02,-1.000000000000000000e+02,-1.000000000000000000e+02,-1.000000000000000000e+02,-1.000000000000000000e+02,-1.000000000000000000e+02,-1.000000000000000000e+02,-1.000000000000000000e+02,-1.000000000000000000e+02,-1.000000000000000000e+02,-1.000000000000000000e+02,-1.000000000000000000e+02,-1.000000000000000000e+02,-1.000000000000000000e+02
-1.119701429925159674e-05,-1.000000000000000000e+02,-1.000000000000000000e+02,-1.000000000000000000e+02,-1.000000000000000000e+02,-1.000000000000000000e+02,-1.000000000000000000e+02,-1.000000000000000000e+02,-1.000000000000000000e+02,-1.000000000000000000e+02,-1.000000000000000000e+02,-1.000000000000000000e+02,-1.000000000000000000e+02,-1.000000000000000000e+02,-1.000000000000000000e+02,-1.000000000000000000e+02,-1.000000000000000000e+02,-1.000000000000000000e+02,-1.000000000000000000e+02,-1.000000000000000000e+02,-1.000000000000000000e+02,-1.000000000000000000e+02,-1.000000000000000000e+02,-1.000000000000000000e+02,-1.000000000000000000e+02,-1.000000000000000000e+02,-1.000000000000000000e+02,-1.000000000000000000e+02,-1.000000000000000000e+02,-1.000000000000000000e+02
-7.679628317166648780e-13,-2.027498611290482291e-05,-1.000000000000000000e+02,-1.000000000000000000e+02,-1.000000000000000000e+02,-1.000000000000000000e+02,-1.000000000000000000e+02,-1.000000000000000000e+02,-1.000000000000000000e+02,-1.000000000000000000e+02,-1.000000000000000000e+02,-1.000000000000000000e+02,-1.000000000000000000e+02,-1.000000000000000000e+02,-1.000000000000000000e+02,-1.000000000000000000e+02,-1.000000000000000000e+02,-1.000000000000000000e+02,-1.000000000000000000e+02,-1.000000000000000000e+02,-1.000000000000000000e+02,-1.000000000000000000e+02,-1.000000000000000000e+02,-1.000000000000000000e+02,-1.000000000000000000e+02,-1.000000000000000000e+02,-1.000000000000000000e+02,-1.000000000000000000e+02,-1.000000000000000000e+02,-1.000000000000000000e+02
9.747213345207006441e-07,-1.000000000000000000e+02,-1.000000000000000000e+02,-1.000000000000000000e+02,-1.000000000000000000e+02,-1.000000000000000000e+02,-1.000000000000000000e+02,-1.000000000000000000e+02,-1.000000000000000000e+02,-1.000000000000000000e+02,-1.000000000000000000e+02,-1.000000000000000000e+02,-1.000000000000000000e+02,-1.000000000000000000e+02,-1.000000000000000000e+02,-1.000000000000000000e+02,-1.000000000000000000e+02,-1.000000000000000000e+02,-1.000000000000000000e+02,-1.000000000000000000e+02,-1.000000000000000000e+02,-1.000000000000000000e+02,-1.000000000000000000e+02,-1.000000000000000000e+02,-1.000000000000000000e+02,-1.000000000000000000e+02,-1.000000000000000000e+02,-1.000000000000000000e+02,-1.000000000000000000e+02,-1.000000000000000000e+02
-8.377456732988619592e-06,-1.000000000000000000e+02,-1.000000000000000000e+02,-1.000000000000000000e+02,-1.000000000000000000e+02,-1.000000000000000000e+02,-1.000000000000000000e+02,-1.000000000000000000e+02,-1.000000000000000000e+02,-1.000000000000000000e+02,-1.000000000000000000e+02,-1.000000000000000000e+02,-1.000000000000000000e+02,-1.000000000000000000e+02,-1.000000000000000000e+02,-1.000000000000000000e+02,-1.000000000000000000e+02,-1.000000000000000000e+02,-1.000000000000000000e+02,-1.000000000000000000e+02,-1.000000000000000000e+02,-1.000000000000000000e+02,-1.000000000000000000e+02,-1.000000000000000000e+02,-1.000000000000000000e+02,-1.000000000000000000e+02,-1.000000000000000000e+02,-1.000000000000000000e+02,-1.000000000000000000e+02,-1.000000000000000000e+02
-8.114318564385599889e-14,-2.482458837782270528e-06,-1.000000000000000000e+02,-1.000000000000000000e+02,-1.000000000000000000e+02,-1.000000000000000000e+02,-1.000000000000000000e+02,-1.000000000000000000e+02,-1.000000000000000000e+02,-1.000000000000000000e+02,-1.000000000000000000e+02,-1.000000000000000000e+02,-1.000000000000000000e+02,-1.000000000000000000e+02,-1.000000000000000000e+02,-1.000000000000000000e+02,-1.000000000000000000e+02,-1.000000000000000000e+02,-1.000000000000000000e+02,-1.000000000000000000e+02,-1.000000000000000000e+02,-1.000000000000000000e+02,-1.000000000000000000e+02,-1.000000000000000000e+02,-1.000000000000000000e+02,-1.000000000000000000e+02,-1.000000000000000000e+02,-1.000000000000000000e+02,-1.000000000000000000e+02,-1.000000000000000000e+02
4.299410637566844842e-06,-1.000000000000000000e+02,-1.000000000000000000e+02,-1.000000000000000000e+02,-1.000000000000000000e+02,-1.000000000000000000e+02,-1.000000000000000000e+02,-1.000000000000000000e+02,-1.000000000000000000e+02,-1.000000000000000000e+02,-1.000000000000000000e+02,-1.000000000000000000e+02,-1.000000000000000000e+02,-1.000000000000000000e+02,-1.000000000000000000e+02,-1.000000000000000000e+02,-1.000000000000000000e+02,-1.000000000000000000e+02,-1.000000000000000000e+02,-1.000000000000000000e+02,-1.000000000000000000e+02,-1.000000000000000000e+02,-1.000000000000000000e+02,-1.000000000000000000e+02,-1.000000000000000000e+02,-1.000000000000000000e+02,-1.000000000000000000e+02,-1.000000000000000000e+02,-1.000000000000000000e+02,-1.000000000000000000e+02
9.521765092043721346e-06,-1.000000000000000000e+02,-1.000000000000000000e+02,-1.000000000000000000e+02,-1.000000000000000000e+02,-1.000000000000000000e+02,-1.000000000000000000e+02,-1.000000000000000000e+02,-1.000000000000000000e+02,-1.000000000000000000e+02,-1.000000000000000000e+02,-1.000000000000000000e+02,-1.000000000000000000e+02,-1.000000000000000000e+02,-1.000000000000000000e+02,-1.000000000000000000e+02,-1.000000000000000000e+02,-1.000000000000000000e+02,-1.000000000000000000e+02,-1.000000000000000000e+02,-1.000000000000000000e+02,-1.000000000000000000e+02,-1.000000000000000000e+02,-1.000000000000000000e+02,-1.000000000000000000e+02,-1.000000000000000000e+02,-1.000000000000000000e+02,-1.000000000000000000e+02,-1.000000000000000000e+02,-1.000000000000000000e+02
-1.885790817760749777e-06,-1.000000000000000000e+02,-1.000000000000000000e+02,-1.000000000000000000e+02,-1.000000000000000000e+02,-1.000000000000000000e+02,-1.000000000000000000e+02,-1.000000000000000000e+02,-1.000000000000000000e+02,-1.000000000000000000e+02,-1.000000000000000000e+02,-1.000000000000000000e+02,-1.000000000000000000e+02,-1.000000000000000000e+02,-1.000000000000000000e+02,-1.000000000000000000e+02,-1.000000000000000000e+02,-1.000000000000000000e+02,-1.000000000000000000e+02,-1.000000000000000000e+02,-1.000000000000000000e+02,-1.000000000000000000e+02,-1.000000000000000000e+02,-1.000000000000000000e+02,-1.000000000000000000e+02,-1.000000000000000000e+02,-1.000000000000000000e+02,-1.000000000000000000e+02,-1.000000000000000000e+02,-1.000000000000000000e+02
4.694202362393680352e-06,-1.000000000000000000e+02,-1.000000000000000000e+02,-1.000000000000000000e+02,-1.000000000000000000e+02,-1.000000000000000000e+02,-1.000000000000000000e+02,-1.000000000000000000e+02,-1.000000000000000000e+02,-1.000000000000000000e+02,-1.000000000000000000e+02,-1.000000000000000000e+02,-1.000000000000000000e+02,-1.000000000000000000e+02,-1.000000000000000000e+02,-1.000000000000000000e+02,-1.000000000000000000e+02,-1.000000000000000000e+02,-1.000000000000000000e+02,-1.000000000000000000e+02,-1.000000000000000000e+02,-1.000000000000000000e+02,-1.000000000000000000e+02,-1.000000000000000000e+02,-1.000000000000000000e+02,-1.000000000000000000e+02,-1.000000000000000000e+02,-1.000000000000000000e+02,-1.000000000000000000e+02,-1.000000000000000000e+02
5.367796636623900497e-06,-1.000000000000000000e+02,-1.000000000000000000e+02,-1.000000000000000000e+02,-1.000000000000000000e+02,-1.000000000000000000e+02,-1.000000000000000000e+02,-1.000000000000000000e+02,-1.000000000000000000e+02,-1.000000000000000000e+02,-1.000000000000000000e+02,-1.000000000000000000e+02,-1.000000000000000000e+02,-1.000000000000000000e+02,-1.000000000000000000e+02,-1.000000000000000000e+02,-1.000000000000000000e+02,-1.000000000000000000e+02,-1.000000000000000000e+02,-1.000000000000000000e+02,-1.000000000000000000e+02,-1.000000000000000000e+02,-1.000000000000000000e+02,-1.000000000000000000e+02,-1.000000000000000000e+02,-1.000000000000000000e+02,-1.000000000000000000e+02,-1.000000000000000000e+02,-1.000000000000000000e+02,-1.000000000000000000e+02
-5.801422523994381139e-27,-3.015737532629321836e-20,-1.171619699527870548e-12,-1.101170578238232608e-05,-1.000000000000000000e+02,-1.000000000000000000e+02,-1.000000000000000000e+02,-1.000000000000000000e+02,-1.000000000000000000e+02,-1.000000000000000000e+02,-1.000000000000000000e+02,-1.000000000000000000e+02,-1.000000000000000000e+02,-1.000000000000000000e+02,-1.000000000000000000e+02,-1.000000000000000000e+02,-1.000000000000000000e+02,-1.000000000000000000e+02,-1.000000000000000000e+02,-1.000000000000000000e+02,-1.000000000000000000e+02,-1.000000000000000000e+02,-1.000000000000000000e+02,-1.000000000000000000e+02,-1.000000000000000000e+02,-1.000000000000000000e+02,-1.000000000000000000e+02,-1.000000000000000000e+02,-1.000000000000000000e+02,-1.000000000000000000e+02
