-1.000000000000000000e+02,-1.000000000000000000e+02,-1.000000000000000000e+02,-1.000000000000000000e+02,-1.000000000000000000e+02,-1.000000000000000000e+02,-1.000000000000000000e+02,-1.000000000000000000e+02,-1.000000000000000000e+02,-1.000000000000000000e+02,-1.000000000000000000e+02,-1.000000000000000000e+02,-1.000000000000000000e+02,-1.000000000000000000e+02,-1.000000000000000000e+02,-1.000000000000000000e+02,-1.000000000000000000e+02,-1.000000000000000000e+02,-1.000000000000000000e+02,-1.000000000000000000e+02,-1.000000000000000000e+02,-1.000000000000000000e+02,-1.000000000000000000e+02,-1.000000000000000000e+02,-1.000000000000000000e+02,-1.000000000000000000e+02,-1.000000000000000000e+02,-1.000000000000000000e+02,-1.000000000000000000e+02,-1.000000000000000000e+02
-1.000000000000000000e+02,-1.000000000000000000e+02,-1.000000000000000000e+02,-1.000000000000000000e+02,-1.000000000000000000e+02,-1.000000000000000000e+02,-1.000000000000000000e+02,-1.000000000000000000e+02,-1.000000000000000000e+02,-1.000000000000000000e+02,-1.000000000000000000e+02,-1.000000000000000000e+02,-1.000000000000000000e+02,-1.000000000000000000e+02,-1.000000000000000000e+02,-1.000000000000000000e+02,-1.000000000000000000e+02,-1.000000000000000000e+02,-1.000000000000000000e+02,-1.000000000000000000e+02,-1.000000000000000000e+02,-1.000000000000000000e+02,-1.000000000000000000e+02,-1.000000000000000000e+02,-1.000000000000000000e+02,-1.000000000000000000e+02,-1.000000000000000000e+02,-1.000000000000000000e+02,-1.000000000000000000e+02,-1.000000000000000000e+02
-1.000000000000000000e+02,-1.000000000000000000e+02,-1.000000000000000000e+02,-1.000000000000000000e+02,-1.000000000000000000e+02,-1.000000000000000000e+02,-1.000000000000000000e+02,-1.000000000000000000e+02,-1.000000000000000000e+02,-1.000000000000000000e+02,-1.000000000000000000e+02,-1.000000000000000000e+02,-1.000000000000000000e+02,-1.000000000000000000e+02,-1.000000000000000000e+02,-1.000000000000000000e+02,-1.000000000000000000e+02,-1.000000000000000000e+02,-1.000000000000000000e+02,-1.000000000000000000e+02,-1.000000000000000000e+02,-1.000000000000000000e+02,-1.000000000000000000e+02,-1.000000000000000000e+02,-1.000000000000000000e+02,-1.000000000000000000e+02,-1.000000000000000000e+02,-1.000000000000000000e+02,-1.000000000000000000e+02,-1.000000000000000000e+02
-1.000000000000000000e+02,-1.000000000000000000e+02,-1.000000000000000000e+02,-1.000000000000000000e+02,-1.000000000000000000e+02,-1.000000000000000000e+02,-1.000000000000000000e+02,-1.000000000000000000e+02,-1.000000000000000000e+02,-1.000000000000000000e+02,-1.000000000000000000e+02,-1.000000000000000000e+02,-1.000000000000000000e+02,-1.000000000000000000e+02,-1.000000000000000000e+02,-1.000000000000000000e+02,-1.000000000000000000e+02,-1.000000000000000000e+02,-1.000000000000000000e+02,-1.000000000000000000e+02,-1.000000000000000000e+02,-1.000000000000000000e+02,-1.000000000000000000e+02,-1.000000000000000000e+02,-1.000000000000000000e+02,-1.000000000000000000e+02,-1.000000000000000000e+02,-1.000000000000000000e+02,-1.000000000000000000e+02,-1.000000000000000000e+02
-1.000000000000000000e+02,-1.000000000000000000e+02,-1.000000000000000000e+02,-1.000000000000000000e+02,-1.000000000000000000e+02,-1.000000000000000000e+02,-1.000000000000000000e+02,-1.000000000000000000e+02,-1.000000000000000000e+02,-1.000000000000000000e+02,-1.000000000000000000e+02,-1.000000000000000000e+02,-1.000000000000000000e+02,-1.000000000000000000e+02,-1.000000000000000000e+02,-1.000000000000000000e+02,-1.000000000000000000e+02,-1.000000000000000000e+02,-1.000000000000000000e+02,-1.000000000000000000e+02,-1.000000000000000000e+02,-1.000000000000000000e+02,-1.000000000000000000e+02,-1.000000000000000000e+02,-1.000000000000000000e+02,-1.000000000000000000e+02,-1.000000000000000000e+02,-1.000000000000000000e+02,-1.000000000000000000e+02,-1.000000000000000000e+02
-1.000000000000000000e+02,-1.000000000000000000e+02,-1.000000000000000000e+02,-1.000000000000000000e+02,-1.000000000000000000e+02,-1.000000000000000000e+02,-1.000000000000000000e+02,-1.000000000000000000e+02,-1.000000000000000000e+02,-1.000000000000000000e+02,-1.000000000000000000e+02,-1.000000000000000000e+02,-1.000000000000000000e+02,-1.000000000000000000e+02,-1.000000000000000000e+02,-1.000000000000000000e+02,-1.000000000000000000e+02,-1.000000000000000000e+02,-1.000000000000000000e+02,-1.000000000000000000e+02,-1.000000000000000000e+02,-1.000000000000000000e+02,-1.000000000000000000e+02,-1.000000000000000000e+02,-1.000000000000000000e+02,-1.000000000000000000e+02,1.000000000000000000e+02,-1.000000000000000000e+02,-1.000000000000000000e+02,-1.000000000000000000e+02
-1.000000000000000000e+02,-1.000000000000000000e+02,-1.000000000000000000e+02,-1.000000000000000000e+02,-1.000000000000000000e+02,-1.000000000000000000e+02,-1.000000000000000000e+02,-1.000000000000000000e+02,-1.000000000000000000e+02,-1.000000000000000000e+02,-1.000000000000000000e+02,-1.000000000000000000e+02,-1.000000000000000000e+02,-1.000000000000000000e+02,-1.000000000000000000e+02,-1.000000000000000000e+02,-1.000000000000000000e+02,-1.000000000000000000e+02,-1.000000000000000000e+02,-1.000000000000000000e+02,-1.000000000000000000e+02,-1.000000000000000000e+02,-1.000000000000000000e+02,-1.000000000000000000e+02,-1.000000000000000000e+02,-1.000000000000000000e+02,-1.000000000000000000e+02,-1.000000000000000000e+02,-1.000000000000000000e+02,-1.000000000000000000e+02
-1.000000000000000000e+02,-1.000000000000000000e+02,-1.000000000000000000e+02,-1.000000000000000000e+02,-1.000000000000000000e+02,-1.000000000000000000e+02,-1.000000000000000000e+02,-1.000000000000000000e+02,-1.000000000000000000e+02,-1.000000000000000000e+02,-1.000000000000000000e+02,-1.000000000000000000e+02,-1.000000000000000000e+02,-1.000000000000000000e+02,-1.000000000000000000e+02,-1.000000000000000000e+02,-1.000000000000000000e+02,-1.000000000000000000e+02,-1.000000000000000000e+02,-1.000000000000000000e+02,-1.000000000000000000e+02,-1.000000000000000000e+02,-1.000000000000000000e+02,-1.000000000000000000e+02,-1.000000000000000000e+02,-1.000000000000000000e+02,-1.000000000000000000e+02,-1.000000000000000000e+02,-1.000000000000000000e+02,-1.000000000000000000e+02
-1.000000000000000000e+02,-1.000000000000000000e+02,-1.000000000000000000e+02,-1.000000000000000000e+02,-1.000000000000000000e+02,-1.000000000000000000e+02,-1.000000000000000000e+02,-1.000000000000000000e+02,-1.000000000000000000e+02,-1.000000000000000000e+02,-1.000000000000000000e+02,-1.000000000000000000e+02,-1.000000000000000000e+02,-1.000000000000000000e+02,-1.000000000000000000e+02,-1.000000000000000000e+02,-1.000000000000000000e+02,-1.000000000000000000e+02,-1.000000000000000000e+02,-1.000000000000000000e+02,-1.000000000000000000e+02,-1.000000000000000000e+02,-1.000000000000000000e+02,-1.000000000000000000e+02,-1.000000000000000000e+02,-1.000000000000000000e+02,-1.000000000000000000e+02,-1.000000000000000000e+02,-1.000000000000000000e+02,-1.000000000000000000e+02
-1.000000000000000000e+02,-1.000000000000000000e+02,-1.000000000000000000e+02,-1.000000000000000000e+02,-1.000000000000000000e+02,-1.000000000000000000e+02,-1.000000000000000000e+02,-1.000000000000000000e+02,-1.000000000000000000e+02,-1.000000000000000000e+02,-1.000000000000000000e+02,-1.000000000000000000e+02,-1.000000000000000000e+02,-1.000000000000000000e+02,-1.000000000000000000e+02,-1.000000000000000000e+02,-1.000000000000000000e+02,-1.000000000000000000e+02,-1.000000000000000000e+02,-1.000000000000000000e+02,-1.000000000000000000e+02,-1.000000000000000000e+02,-1.000000000000000000e+02,-1.000000000000000000e+02,-1.000000000000000000e+02,-1.000000000000000000e+02,-1.000000000000000000e+02,-1.000000000000000000e+02,-1.000000000000000000e+02,-1.000000000000000000e+02
-1.000000000000000000e+02,-1.000000000000000000e+02,-1.000000000000000000e+02,-1.000000000000000000e+02,-1.000000000000000000e+02,-1.000000000000000000e+02,-1.000000000000000000e+02,-1.000000000000000000e+02,-1.000000000000000000e+02,-1.000000000000000000e+02,-1.000000000000000000e+02,-1.000000000000000000e+02,-1.000000000000000000e+02,-1.000000000000000000e+02,-1.000000000000000000e+02,-1.000000000000000000e+02,-1.000000000000000000e+02,-1.000000000000000000e+02,-1.000000000000000000e+02,-1.000000000000000000e+02,-1.000000000000000000e+02,-1.000000000000000000e+02,-1.000000000000000000e+02,-1.000000000000000000e+02,-1.000000000000000000e+02,-1.000000000000000000e+02,-1.000000000000000000e+02,-1.000000000000000000e+02,-1.000000000000000000e+02,-1.000000000000000000e+02
-1.000000000000000000e+02,-1.000000000000000000e+02,-1.000000000000000000e+02,-1.000000000000000000e+02,-1.000000000000000000e+02,-1.000000000000000000e+02,-1.000000000000000000e+02,-1.000000000000000000e+02,-1.000000000000000000e+02,-1.000000000000000000e+02,-1.000000000000000000e+02,-1.000000000000000000e+02,-1.000000000000000000e+02,-1.000000000000000000e+02,-1.000000000000000000e+02,-1.000000000000000000e+02,-1.000000000000000000e+02,-1.000000000000000000e+02,-1.000000000000000000e+02,-1.000000000000000000e+02,-1.000000000000000000e+02,-1.000000000000000000e+02,-1.000000000000000000e+02,-1.000000000000000000e+02,-1.000000000000000000e+02,-1.000000000000000000e+02,-1.000000000000000000e+02,-1.000000000000000000e+02,-1.000000000000000000e+02,-1.000000000000000000e+02
-1.000000000000000000e+02,-1.000000000000000000e+02,-1.000000000000000000e+02,-1.000000000000000000e+02,-1.000000000000000000e+02,-1.000000000000000000e+02,-1.000000000000000000e+02,-1.000000000000000000e+02,-1.000000000000000000e+02,-1.000000000000000000e+02,-1.000000000000000000e+02,-1.000000000000000000e+02,-1.000000000000000000e+02,-1.000000000000000000e+02,-1.000000000000000000e+02,-1.000000000000000000e+02,-1.000000000000000000e+02,-1.000000000000000000e+02,-1.000000000000000000e+02,-1.000000000000000000e+02,-1.000000000000000000e+02,-1.000000000000000000e+02,-1.000000000000000000e+02,-1.000000000000000000e+02,-1.000000000000000000e+02,-1.000000000000000000e+02,-1.000000000000000000e+02,-1.000000000000000000e+02,-1.000000000000000000e+02,-1.000000000000000000e+02
-1.000000000000000000e+02,-1.000000000000000000e+02,-1.000000000000000000e+02,-1.000000000000000000e+02,-1.000000000000000000e+02,-1.000000000000000000e+02,-1.000000000000000000e+02,-1.000000000000000000e+02,-1.000000000000000000e+02,-1.000000000000000000e+02,-1.000000000000000000e+02,-1.000000000000000000e+02,-1.000000000000000000e+02,-1.000000000000000000e+02,-1.000000000000000000e+02,-1.000000000000000000e+02,-1.000000000000000000e+02,-1.000000000000000000e+02,-1.000000000000000000e+02,-1.000000000000000000e+02,-1.000000000000000000e+02,-1.000000000000000000e+02,-1.000000000000000000e+02,-1.000000000000000000e+02,-1.000000000000000000e+02,-1.000000000000000000e+02,-1.000000000000000000e+02,-1.000000000000000000e+02,-1.000000000000000000e+02,-1.000000000000000000e+02
-1.000000000000000000e+02,-1.000000000000000000e+02,-1.000000000000000000e+02,-1.000000000000000000e+02,-1.000000000000000000e+02,-1.000000000000000000e+02,-1.000000000000000000e+02,-1.000000000000000000e+02,-1.000000000000000000e+02,-1.000000000000000000e+02,-1.000000000000000000e+02,-1.000000000000000000e+02,-1.000000000000000000e+02,-1.000000000000000000e+02,-1.000000000000000000e+02,-1.000000000000000000e+02,-1.000000000000000000e+02,-1.000000000000000000e+02,-1.000000000000000000e+02,-1.000000000000000000e+02,-1.000000000000000000e+02,-1.000000000000000000e+02,-1.000000000000000000e+02,-1.000000000000000000e+02,-1.000000000000000000e+02,-1.000000000000000000e+02,-1.000000000000000000e+02,-1.000000000000000000e+02,-1.000000000000000000e+02,-1.000000000000000000e+02
-1.000000000000000000e+02,-1.000000000000000000e+02,-1.000000000000000000e+02,-1.000000000000000000e+02,-1.000000000000000000e+02,-1.000000000000000000e+02,-1.000000000000000000e+02,-1.000000000000000000e+02,-1.000000000000000000e+02,-1.000000000000000000e+02,-1.000000000000000000e+02,-1.000000000000000000e+02,-1.000000000000000000e+02,-1.000000000000000000e+02,-1.000000000000000000e+02,-1.000000000000000000e+02,-1.000000000000000000e+02,-1.000000000000000000e+02,-1.000000000000000000e+02,-1.000000000000000000e+02,-1.000000000000000000e+02,-1.000000000000000000e+02,-1.000000000000000000e+02,-1.000000000000000000e+02,-1.000000000000000000e+02,-1.000000000000000000e+02,-1.000000000000000000e+02,-1.000000000000000000e+02,-1.000000000000000000e+02,-1.000000000000000000e+02
-1.000000000000000000e+02,-1.000000000000000000e+02,-1.000000000000000000e+02,-1.000000000000000000e+02,-1.000000000000000000e+02,-1.000000000000000000e+02,-1.000000000000000000e+02,-1.000000000000000000e+02,-1.000000000000000000e+02,-1.000000000000000000e+02,-1.000000000000000000e+02,-1.000000000000000000e+02,-1.000000000000000000e+02,-1.000000000000000000e+02,-1.000000000000000000e+02,-1.000000000000000000e+02,-1.000000000000000000e+02,-1.000000000000000000e+02,-1.000000000000000000e+02,-1.000000000000000000e+02,-1.000000000000000000e+02,-1.000000000000000000e+02,-1.000000000000000000e+02,-1.000000000000000000e+02,-1.000000000000000000e+02,-1.000000000000000000e+02,-1.000000000000000000e+02,-1.000000000000000000e+02,-1.000000000000000000e+02,-1.000000000000000000e+02
-1.000000000000000000e+02,-1.000000000000000000e+02,-1.000000000000000000e+02,-1.000000000000000000e+02,-1.000000000000000000e+02,-1.000000000000000000e+02,-1.000000000000000000e+02,-1.000000000000000000e+02,-1.000000000000000000e+02,-1.000000000000000000e+02,-1.000000000000000000e+02,-1.000000000000000000e+02,-1.000000000000000000e+02,-1.000000000000000000e+02,-1.000000000000000000e+02,-1.000000000000000000e+02,-1.000000000000000000e+02,-1.000000000000000000e+02,-1.000000000000000000e+02,-1.000000000000000000e+02,-1.000000000000000000e+02,-1.000000000000000000e+02,-1.000000000000000000e+02,-1.000000000000000000e+02,-1.000000000000000000e+02,-1.000000000000000000e+02,-1.000000000000000000e+02,-1.000000000000000000e+02,-1.000000000000000000e+02,-1.000000000000000000e+02
-1.000000000000000000e+02,-1.000000000000000000e+02,-1.000000000000000000e+02,-1.000000000000000000e+02,-1.000000000000000000e+02,-1.000000000000000000e+02,-1.000000000000000000e+02,-1.000000000000000000e+02,-1.000000000000000000e+02,-1.000000000000000000e+02,-1.000000000000000000e+02,-1.000000000000000000e+02,-1.000000000000000000e+02,-1.000000000000000000e+02,-1.000000000000000000e+02,-1.000000000000000000e+02,-1.000000000000000000e+02,-1.000000000000000000e+02,-1.000000000000000000e+02,-1.000000000000000000e+02,-1.000000000000000000e+02,-1.000000000000000000e+02,-1.000000000000000000e+02,-1.000000000000000000e+02,-1.000000000000000000e+02,-1.000000000000000000e+02,-1.000000000000000000e+02,-1.000000000000000000e+02,-1.000000000000000000e+02,-1.000000000000000000e+02
-1.000000000000000000e+02,-1.000000000000000000e+02,-1.000000000000000000e+02,-1.000000000000000000e+02,-1.000000000000000000e+02,-1.000000000000000000e+02,-1.000000000000000000e+02,-1.000000000000000000e+02,-1.000000000000000000e+02,-1.000000000000000000e+02,-1.000000000000000000e+02,-1.000000000000000000e+02,-1.000000000000000000e+02,-1.000000000000000000e+02,-1.000000000000000000e+02,-1.000000000000000000e+02,-1.000000000000000000e+02,-1.000000000000000000e+02,-1.000000000000000000e+02,-1.000000000000000000e+02,-1.000000000000000000e+02,-1.000000000000000000e+02,-1.000000000000000000e+02,-1.000000000000000000e+02,-1.000000000000000000e+02,-1.000000000000000000e+02,-1.000000000000000000e+02,-1.000000000000000000e+02,-1.000000000000000000e+02,-1.000000000000000000e+02
-1.000000000000000000e+02,-1.000000000000000000e+02,-1.000000000000000000e+02,-1.000000000000000000e+02,-1.000000000000000000e+02,-1.000000000000000000e+02,-1.000000000000000000e+02,-1.000000000000000000e+02,-1.000000000000000000e+02,-1.000000000000000000e+02,-1.000000000000000000e+02,-1.000000000000000000e+02,-1.000000000000000000e+02,-1.000000000000000000e+02,-1.000000000000000000e+02,-1.000000000000000000e+02,-1.000000000000000000e+02,-1.000000000000000000e+02,-1.000000000000000000e+02,-1.000000000000000000e+02,-1.000000000000000000e+02,-1.000000000000000000e+02,-1.000000000000000000e+02,-1.000000000000000000e+02,-1.000000000000000000e+02,-1.000000000000000000e+02,-1.000000000000000000e+02,-1.000000000000000000e+02,-1.000000000000000000e+02,-1.000000000000000000e+02
-1.000000000000000000e+02,-1.000000000000000000e+02,-1.000000000000000000e+02,-1.000000000000000000e+02,-1.000000000000000000e+02,-1.000000000000000000e+02,-1.000000000000000000e+02,-1.000000000000000000e+02,-1.000000000000000000e+02,-1.000000000000000000e+02,-1.000000000000000000e+02,-1.000000000000000000e+02,-1.000000000000000000e+02,-1.000000000000000000e+02,-1.000000000000000000e+02,-1.000000000000000000e+02,-1.000000000000000000e+02,-1.000000000000000000e+02,-1.000000000000000000e+02,-1.000000000000000000e+02,-1.000000000000000000e+02,-1.000000000000000000e+02,-1.000000000000000000e+02,-1.000000000000000000e+02,-1.000000000000000000e+02,-1.000000000000000000e+02,-1.000000000000000000e+02,-1.000000000000000000e+02,-1.000000000000000000e+02,-3.463363221694426008e-01
-1.000000000000000000e+02,-1.000000000000000000e+02,-1.000000000000000000e+02,-1.000000000000000000e+02,-1.000000000000000000e+02,-1.000000000000000000e+02,-1.000000000000000000e+02,-1.000000000000000000e+02,-1.000000000000000000e+02,-1.000000000000000000e+02,-1.000000000000000000e+02,-1.000000000000000000e+02,-1.000000000000000000e+02,-1.000000000000000000e+02,-1.000000000000000000e+02,-1.000000000000000000e+02,-1.000000000000000000e+02,-1.000000000000000000e+02,-1.000000000000000000e+02,-1.000000000000000000e+02,-1.000000000000000000e+02,-1.000000000000000000e+02,-1.000000000000000000e+02,-1.000000000000000000e+02,-1.000000000000000000e+02,-1.000000000000000000e+02,-1.000000000000000000e+02,-1.000000000000000000e+02,-1.000000000000000000e+02,-1.000000000000000000e+02
-1.000000000000000000e+02,-1.000000000000000000e+02,-1.000000000000000000e+02,-1.000000000000000000e+02,-1.000000000000000000e+02,-1.000000000000000000e+02,-1.000000000000000000e+02,-1.000000000000000000e+02,-1.000000000000000000e+02,-1.000000000000000000e+02,-1.000000000000000000e+02,-1.000000000000000000e+02,-1.000000000000000000e+02,-1.000000000000000000e+02,-1.000000000000000000e+02,-1.000000000000000000e+02,-1.000000000000000000e+02,-1.000000000000000000e+02,-1.000000000000000000e+02,-1.000000000000000000e+02,-1.000000000000000000e+02,-1.000000000000000000e+02,-1.000000000000000000e+02,-1.000000000000000000e+02,-1.000000000000000000e+02,-1.000000000000000000e+02,-1.000000000000000000e+02,-1.000000000000000000e+02,-1.000000000000000000e+02,3.463363498681674701e-01
-1.000000000000000000e+02,-1.000000000000000000e+02,-1.000000000000000000e+02,-1.000000000000000000e+02,-1.000000000000000000e+02,-1.000000000000000000e+02,-1.000000000000000000e+02,-1.000000000000000000e+02,-1.000000000000000000e+02,-1.000000000000000000e+02,-1.000000000000000000e+02,-1.000000000000000000e+02,-1.000000000000000000e+02,-1.000000000000000000e+02,-1.000000000000000000e+02,-1.000000000000000000e+02,-1.000000000000000000e+02,-1.000000000000000000e+02,-1.000000000000000000e+02,-1.000000000000000000e+02,-1.000000000000000000e+02,-1.000000000000000000e+02,-1.000000000000000000e+02,-1.000000000000000000e+02,-1.000000000000000000e+02,-1.000000000000000000e+02,-1.000000000000000000e+02,-1.000000000000000000e+02,-1.000000000000000000e+02,-1.000000000000000000e+02
-1.000000000000000000e+02,-1.000000000000000000e+02,-1.000000000000000000e+02,-1.000000000000000000e+02,-1.000000000000000000e+02,-1.000000000000000000e+02,-1.000000000000000000e+02,-1.000000000000000000e+02,-1.000000000000000000e+02,-1.000000000000000000e+02,-1.000000000000000000e+02,-1.000000000000000000e+02,-1.000000000000000000e+02,-1.000000000000000000e+02,-1.000000000000000000e+02,-1.000000000000000000e+02,-1.000000000000000000e+02,-1.000000000000000000e+02,-1.000000000000000000e+02,-1.000000000000000000e+02,-1.000000000000000000e+02,-1.000000000000000000e+02,-1.000000000000000000e+02,-1.000000000000000000e+02,-1.000000000000000000e+02,-1.000000000000000000e+02,-1.000000000000000000e+02,-1.000000000000000000e+02,-1.000000000000000000e+02,-1.000000000000000000e+02
-1.000000000000000000e+02,-1.000000000000000000e+02,-1.000000000000000000e+02,-1.000000000000000000e+02,-1.000000000000000000e+02,-1.000000000000000000e+02,-1.000000000000000000e+02,-1.000000000000000000e+02,-1.000000000000000000e+02,-1.000000000000000000e+02,-1.000000000000000000e+02,-1.000000000000000000e+02,-1.000000000000000000e+02,-1.000000000000000000e+02,-1.000000000000000000e+02,-1.000000000000000000e+02,-1.000000000000000000e+02,-1.000000000000000000e+02,-1.000000000000000000e+02,-1.000000000000000000e+02,-1.000000000000000000e+02,-1.000000000000000000e+02,-1.000000000000000000e+02,-1.000000000000000000e+02,-1.000000000000000000e+02,-1.000000000000000000e+02,-1.000000000000000000e+02,-1.000000000000000000e+02,-1.000000000000000000e+02,1.000000000000000000e+02
-1.000000000000000000e+02,-1.000000000000000000e+02,-1.000000000000000000e+02,-1.000000000000000000e+02,-1.000000000000000000e+02,-1.000000000000000000e+02,-1.000000000000000000e+02,-1.000000000000000000e+02,-1.000000000000000000e+02,-1.000000000000000000e+02,-1.000000000000000000e+02,-1.000000000000000000e+02,-1.000000000000000000e+02,-1.000000000000000000e+02,-1.000000000000000000e+02,-1.000000000000000000e+02,-1.000000000000000000e+02,-1.000000000000000000e+02,-1.000000000000000000e+02,-1.000000000000000000e+02,-1.000000000000000000e+02,-1.000000000000000000e+02,-1.000000000000000000e+02,-1.000000000000000000e+02,-1.000000000000000000e+02,-1.000000000000000000e+02,-1.000000000000000000e+02,-1.000000000000000000e+02,-1.000000000000000000e+02,-1.000000000000000000e+02
-1.000000000000000000e+02,-1.000000000000000000e+02,-1.000000000000000000e+02,-1.000000000000000000e+02,-1.000000000000000000e+02,-1.000000000000000000e+02,-1.000000000000000000e+02,-1.000000000000000000e+02,-1.000000000000000000e+02,-1.000000000000000000e+02,-1.000000000000000000e+02,-1.000000000000000000e+02,-1.000000000000000000e+02,-1.000000000000000000e+02,-1.000000000000000000e+02,-1.000000000000000000e+02,-1.000000000000000000e+02,-1.000000000000000000e+02,-1.000000000000000000e+02,-1.000000000000000000e+02,-1.000000000000000000e+02,-1.000000000000000000e+02,-1.000000000000000000e+02,-1.000000000000000000e+02,-1.000000000000000000e+02,-1.000000000000000000e+02,-1.000000000000000000e+02,-1.000000000000000000e+02,-1.000000000000000000e+02,3.463363433916805123e-01
-1.000000000000000000e+02,-1.000000000000000000e+02,-1.000000000000000000e+02,-1.000000000000000000e+02,-1.000000000000000000e+02,-1.000000000000000000e+02,-1.000000000000000000e+02,-1.000000000000000000e+02,-1.000000000000000000e+02,-1.000000000000000000e+02,-1.000000000000000000e+02,-1.000000000000000000e+02,-1.000000000000000000e+02,-1.000000000000000000e+02,-1.000000000000000000e+02,-1.000000000000000000e+02,-1.000000000000000000e+02,-1.000000000000000000e+02,-1.000000000000000000e+02,-1.000000000000000000e+02,-1.000000000000000000e+02,-1.000000000000000000e+02,-1.000000000000000000e+02,-1.000000000000000000e+02,-1.000000000000000000e+02,-1.000000000000000000e+02,-1.000000000000000000e+02,-1.000000000000000000e+02,-1.000000000000000000e+02,-1.000000000000000000e+02
