-9.693212739427438385e-02,6.421067642062200376e-02,1.168148223920010137e-01,-5.362955716333460410e-02,-1.318295290974894896e-01,8.940606068956739871e-03,-1.320062299427200714e-01,2.897444766617734979e-02,-1.275067342825079997e-01,3.634657745522998362e-02
-1.018216734738261464e-01,-8.355679432703166931e-02,1.045117437931312454e-01,-8.000049230514275078e-02,1.131743002250182595e-01,-5.261229930096079921e-02,-1.043548953736485457e-01,-7.936158794743276845e-02,-1.018699447538456287e-01,8.650937560374985513e-02
-9.939790424542811753e-02,-8.170520474904113817e-02,-9.290658457986218643e-02,8.670390398546043431e-02,-1.001015490821129672e-01,8.354487764263415772e-02,-1.021593112541947929e-01,6.104463739393332922e-02,-1.176446997055077548e-01,6.083298653442693188e-02
1.357132356993767108e-01,-1.910318368762494584e-02,1.308244289139621208e-01,-2.539063732560174411e-02,1.239517312107076413e-01,4.324985060268216053e-02,1.250804166065672407e-01,-2.615172239024936632e-02,1.267709957541398591e-01,-3.310449197806047961e-02
-1.152318652513493746e-01,-5.829320882659522196e-02,-1.141468803598827964e-01,6.338023450846952400e-02,-1.155257081896456234e-01,7.632785111962542279e-02,8.972406818392486549e-02,9.225474712673545352e-02,8.973092735631132966e-02,9.835526392079241287e-02
-1.270410077149341510e-01,-4.904794978191152899e-02,1.219938037883770421e-01,5.714241765533509959e-02,1.248987218300575686e-01,-5.519558752034252336e-02,-1.276469913966648828e-01,-2.428627207424505913e-02,-1.219327429575863264e-01,5.037628640715625938e-02
6.991382556115230407e-02,9.913859602602191623e-02,8.684107098959711890e-02,9.888462511018410173e-02,8.288670523823235547e-02,-1.037719037846074055e-01,1.272974385575049994e-01,3.598200708643826962e-02,1.270008766385992138e-01,-3.739501348888951693e-02
-1.122642526650946687e-01,-7.196562388961942613e-02,1.183816263528739282e-01,5.158074664913360474e-02,-1.276217229699903311e-01,-3.038505915441459121e-02,-1.289409333172378269e-01,-1.153121887124476837e-02,-1.319421114727965250e-01,-2.523652006890823168e-02
-8.630049347835389018e-02,-1.011349871370359060e-01,8.523794579205716537e-02,1.016193518827118170e-01,9.057577025985638630e-02,1.010804232359717725e-01,-1.202330087757150223e-01,-2.295983010218433790e-02,-1.306888085984115322e-01,9.027093037605750381e-02
-1.011583578701419212e-01,7.907805763927210074e-02,-1.049794663478364337e-01,-2.039745569462677460e-03,-1.194829758075372228e-01,-5.432518550420389197e-02,1.288492405228751081e-01,2.317153535294551661e-02,1.239529764109333215e-01,-3.341169293568435616e-02
1.368742001178298306e-02,-1.191879488737974668e-01,-7.270692359837022112e-02,-1.104111659586577143e-01,6.565337568337016594e-02,1.246084779239000073e-01,-3.146733416406177763e-02,-1.293623856881294665e-01,-3.772974774620470317e-02,1.266778755581783877e-01
-2.958792945563696111e-02,-1.283087732038972195e-01,-3.171653725879815949e-02,-1.323135235979970570e-01,9.843211060091609788e-03,-1.369208760127100244e-01,9.531496832728001550e-03,-1.313296920008467927e-01,2.108085440522915882e-02,1.381377545063299794e-01
1.203877203491893200e-01,5.919183921513826441e-02,-1.131489705222282205e-01,6.644503668822904219e-02,-1.163882699994625153e-01,-6.291974445212937528e-02,-1.331200738601480971e-01,1.377999206127610878e-02,-1.322394380167218053e-01,-8.738563334781904168e-02
-1.004707471416408648e-01,3.630630389341660269e-02,-1.244895153569384183e-01,-4.567639280876395480e-02,1.075327811002794176e-01,8.743766236159927763e-02,9.838422082162981419e-02,8.782508140769429428e-02,9.932107298482026336e-02,-8.437959798587416071e-02
2.290025856609577762e-02,1.301311565975338536e-01,3.235076082069084785e-02,-1.282610042948572338e-01,-2.428154385022278372e-02,-1.299001789632160120e-01,-3.510717279320940687e-02,-1.332657574099958275e-01,1.231308106400770888e-02,-1.297514816910279034e-01
1.249321617020068415e-01,4.285660992635974970e-02,1.169427043703543390e-01,1.054333620222127899e-01,9.732679575900834990e-02,-8.048613121462025455e-02,1.060920899965822894e-01,7.931663480259068533e-02,-1.054728431800042443e-01,-7.121734979815215472e-02
7.438252042885978854e-02,9.337375685615631471e-02,-8.826388554564096323e-02,1.309334523117037241e-01,2.062976500556149700e-02,1.265714044993959120e-01,3.859375399424540276e-02,-1.309312041312619135e-01,-4.008295231781332235e-02,-1.325970544261751982e-01
-6.230802775561636309e-03,1.313815658741317727e-01,-3.831250909718753733e-02,-1.260582920018042674e-01,-4.262898994593125601e-02,-1.287098508761088667e-01,3.105880555969228393e-02,-1.296276322402669656e-01,-3.099028219485328028e-02,1.275345020622142278e-01
1.265556285330131370e-01,6.927897124383919358e-02,9.326087999085355684e-02,9.010946464790924038e-02,-9.664206722275986428e-02,-9.044843612076901296e-02,-1.026664427700582360e-01,8.841001419561760055e-02,1.013520325422286317e-01,-8.318742461229210183e-02
3.971279592287298155e-02,-1.261371235771327759e-01,4.890864297027311403e-02,1.257024077667373008e-01,5.018359118880258429e-02,1.278123086911457373e-01,4.532850812532848023e-02,-1.230757304151171294e-01,-4.695814772056855491e-02,1.222816405271208995e-01
3.961791406782357028e-03,-1.318166854107598318e-01,2.506015361556450383e-02,-1.291336812208167262e-01,-2.125877441792991401e-02,-1.303378448151095159e-01,-3.131671658725855567e-02,-1.088557864287123256e-01,-7.163638239570381538e-02,-1.114032829936584118e-01
-5.396884416715274496e-02,-1.209198341373371038e-01,-3.569617966045061930e-02,1.283570520341223153e-01,4.164066382665491950e-02,9.769890015569251962e-02,-8.548023203331089892e-02,1.012248991814375526e-01,8.566243573194190497e-02,1.095414156239661735e-01
-5.549003241671425501e-02,1.236274547926649592e-01,-5.048998339644454603e-02,1.195902547545066724e-01,-6.454863551504068375e-02,-1.121945603465062113e-01,-8.599023762302199225e-02,-9.218232411908067192e-02,-1.125694770758361440e-01,-5.377981735097669969e-02
1.278485636963465344e-01,1.191449502999723103e-02,-1.289163960570820222e-01,3.501361318006220025e-02,-1.273821226289620634e-01,4.334137996455626751e-02,-1.181911464679922114e-01,-6.055284656966867379e-02,1.193062059398429936e-01,6.649308069653145359e-02
-1.225467742802753557e-01,-4.961585173393001647e-02,1.226475503605969630e-01,-4.973574969962019782e-02,-1.228752659888700804e-01,-4.904919315912847216e-02,-1.228752630231513682e-01,-4.944053101555264534e-02,1.227183285777202204e-01,-4.944054398104588688e-02
-3.834257026357251741e-02,1.222671609344454513e-01,-2.098305455869525771e-02,1.292474131200486431e-01,2.128956654429862635e-02,-1.407394539836775149e-01,-5.389061039758115401e-02,1.201907232944697534e-01,-2.179924047378134153e-03,1.249029464637390896e-01
-1.178383923667823824e-01,-7.441634523395995737e-02,-1.055071300734074513e-01,8.051862133575722613e-02,1.054416527328683739e-01,-7.919644821378127308e-02,1.109015307318977628e-01,9.090394742186970467e-02,-9.671733488540135149e-02,9.193205108062121877e-02
3.281144073542204692e-02,1.290630015671059283e-01,-8.632416500223959871e-03,1.324014620107501761e-01,-5.619102892622752921e-02,-1.333724651194082567e-01,-1.915125754508944372e-02,1.288124907386892226e-01,-3.040507175773807247e-02,-1.357876650396406260e-01
-1.320124219600870563e-01,1.968964057762719391e-02,-1.186382756157921409e-01,-5.813276244923936548e-02,-1.223354078223922309e-01,-3.249112674959417357e-02,-1.229350944324460182e-01,4.932529947566931250e-02,-1.277754772710855413e-01,3.429516275946090098e-02
-3.722349176375237129e-02,-1.270294568450192896e-01,-2.980422024109974366e-02,1.303228768711643670e-01,-8.698984672678800045e-02,-1.005346182825465340e-01,-8.692879410530354733e-02,-1.671418367231139901e-05,-1.307311198242922801e-01,-3.363368373027663533e-02
