1.000000000000000000e+02,-4.338259079815920671e+01,-1.000000000000000000e+02,1.000000000000000000e+02,-1.000000000000000000e+02,1.000000000000000000e+02,-1.000000000000000000e+02,1.000000000000000000e+02,-1.000000000000000000e+02,1.000000000000000000e+02,-1.000000000000000000e+02,1.000000000000000000e+02,-1.000000000000000000e+02,1.000000000000000000e+02,-1.000000000000000000e+02,1.000000000000000000e+02,-1.000000000000000000e+02,1.000000000000000000e+02,-1.000000000000000000e+02,1.000000000000000000e+02,-1.000000000000000000e+02,-1.000000000000000000e+02,1.000000000000000000e+02,-4.338259090447154165e+01,-1.000000000000000000e+02,1.000000000000000000e+02,-1.000000000000000000e+02,1.000000000000000000e+02,-1.000000000000000000e+02,1.000000000000000000e+02
-1.000000000000000000e+02,1.000000000000000000e+02,-1.000000000000000000e+02,1.000000000000000000e+02,-1.000000000000000000e+02,1.000000000000000000e+02,-1.000000000000000000e+02,-1.000000000000000000e+02,5.174094913229632908e+01,1.000000000000000000e+02,-1.000000000000000000e+02,1.000000000000000000e+02,-1.000000000000000000e+02,1.000000000000000000e+02,-1.000000000000000000e+02,1.000000000000000000e+02,1.000000000000000000e+02,-1.000000000000000000e+02,1.000000000000000000e+02,-1.000000000000000000e+02,1.000000000000000000e+02,-1.000000000000000000e+02,1.000000000000000000e+02,-1.000000000000000000e+02,1.000000000000000000e+02,-1.000000000000000000e+02,5.174094623185956721e+01,1.000000000000000000e+02,-1.000000000000000000e+02,1.000000000000000000e+02
-1.000000000000000000e+02,1.000000000000000000e+02,-1.000000000000000000e+02,-1.000000000000000000e+02,1.000000000000000000e+02,-1.000000000000000000e+02,1.000000000000000000e+02,-1.000000000000000000e+02,-1.000000000000000000e+02,5.174095061574666232e+01,1.000000000000000000e+02,-1.000000000000000000e+02,1.000000000000000000e+02,-1.000000000000000000e+02,1.000000000000000000e+02,-1.000000000000000000e+02,-1.000000000000000000e+02,1.000000000000000000e+02,-1.000000000000000000e+02,-1.000000000000000000e+02,1.000000000000000000e+02,-1.000000000000000000e+02,-1.000000000000000000e+02,1.000000000000000000e+02,-1.000000000000000000e+02,1.000000000000000000e+02,-1.000000000000000000e+02,1.000000000000000000e+02,-1.000000000000000000e+02,1.000000000000000000e+02
1.000000000000000000e+02,-4.338258943712081361e+01,-1.000000000000000000e+02,1.000000000000000000e+02,-1.000000000000000000e+02,-1.000000000000000000e+02,1.000000000000000000e+02,-1.000000000000000000e+02,-1.000000000000000000e+02,1.000000000000000000e+02,-1.000000000000000000e+02,1.000000000000000000e+02,-1.000000000000000000e+02,1.000000000000000000e+02,-1.000000000000000000e+02,1.000000000000000000e+02,-1.000000000000000000e+02,5.174094965029482296e+01,1.000000000000000000e+02,-1.000000000000000000e+02,-1.000000000000000000e+02,1.000000000000000000e+02,-1.000000000000000000e+02,-1.000000000000000000e+02,1.000000000000000000e+02,-1.000000000000000000e+02,1.000000000000000000e+02,-1.000000000000000000e+02,1.000000000000000000e+02,-1.000000000000000000e+02
-1.000000000000000000e+02,-1.000000000000000000e+02,1.000000000000000000e+02,-1.000000000000000000e+02,-1.000000000000000000e+02,1.000000000000000000e+02,-1.000000000000000000e+02,1.000000000000000000e+02,1.000000000000000000e+02,-1.000000000000000000e+02,1.000000000000000000e+02,-4.338259257126554047e+01,-1.000000000000000000e+02,1.000000000000000000e+02,-4.338259182067917408e+01,-1.000000000000000000e+02,1.000000000000000000e+02,-1.000000000000000000e+02,1.000000000000000000e+02,-1.000000000000000000e+02,5.174094779729977489e+01,1.000000000000000000e+02,-1.000000000000000000e+02,1.000000000000000000e+02,-1.000000000000000000e+02,-1.000000000000000000e+02,-1.000000000000000000e+02,1.000000000000000000e+02,-1.000000000000000000e+02,1.000000000000000000e+02
-1.000000000000000000e+02,-1.000000000000000000e+02,1.000000000000000000e+02,-1.000000000000000000e+02,1.000000000000000000e+02,-1.000000000000000000e+02,5.174094865148136790e+01,1.000000000000000000e+02,-4.338259160488366462e+01,-1.000000000000000000e+02,1.000000000000000000e+02,-1.000000000000000000e+02,1.000000000000000000e+02,-1.000000000000000000e+02,1.000000000000000000e+02,1.000000000000000000e+02,-1.000000000000000000e+02,1.000000000000000000e+02,-1.000000000000000000e+02,1.000000000000000000e+02,-4.338259242561562701e+01,-1.000000000000000000e+02,-1.000000000000000000e+02,1.000000000000000000e+02,-1.000000000000000000e+02,1.000000000000000000e+02,-1.000000000000000000e+02,1.000000000000000000e+02,-1.000000000000000000e+02,-1.000000000000000000e+02
-1.000000000000000000e+02,1.000000000000000000e+02,-1.000000000000000000e+02,-1.000000000000000000e+02,1.000000000000000000e+02,-1.000000000000000000e+02,1.000000000000000000e+02,-1.000000000000000000e+02,1.000000000000000000e+02,-1.000000000000000000e+02,1.000000000000000000e+02,-1.000000000000000000e+02,1.000000000000000000e+02,-4.338258998610959338e+01,-1.000000000000000000e+02,1.000000000000000000e+02,-1.000000000000000000e+02,1.000000000000000000e+02,-1.000000000000000000e+02,1.000000000000000000e+02,-4.338258900361731207e+01,-1.000000000000000000e+02,1.000000000000000000e+02,-1.000000000000000000e+02,1.000000000000000000e+02,-4.338259103917229709e+01,-1.000000000000000000e+02,1.000000000000000000e+02,-1.000000000000000000e+02,1.000000000000000000e+02
1.000000000000000000e+02,-1.000000000000000000e+02,1.000000000000000000e+02,-1.000000000000000000e+02,1.000000000000000000e+02,-1.000000000000000000e+02,5.174094811676099681e+01,1.000000000000000000e+02,-1.000000000000000000e+02,5.174094748539013722e+01,1.000000000000000000e+02,-4.338259273234409363e+01,-1.000000000000000000e+02,1.000000000000000000e+02,-1.000000000000000000e+02,1.000000000000000000e+02,-1.000000000000000000e+02,-1.000000000000000000e+02,1.000000000000000000e+02,-1.000000000000000000e+02,1.000000000000000000e+02,-4.338259075311353286e+01,-1.000000000000000000e+02,1.000000000000000000e+02,-1.000000000000000000e+02,-1.000000000000000000e+02,1.000000000000000000e+02,-1.000000000000000000e+02,-1.000000000000000000e+02,1.000000000000000000e+02
1.000000000000000000e+02,-1.000000000000000000e+02,1.000000000000000000e+02,-1.000000000000000000e+02,1.000000000000000000e+02,-1.000000000000000000e+02,-1.000000000000000000e+02,-1.000000000000000000e+02,1.000000000000000000e+02,-1.000000000000000000e+02,1.000000000000000000e+02,-1.000000000000000000e+02,1.000000000000000000e+02,-1.000000000000000000e+02,1.000000000000000000e+02,-1.000000000000000000e+02,1.000000000000000000e+02,-1.000000000000000000e+02,1.000000000000000000e+02,-1.000000000000000000e+02,-1.000000000000000000e+02,1.000000000000000000e+02,-1.000000000000000000e+02,1.000000000000000000e+02,-1.000000000000000000e+02,-1.000000000000000000e+02,-1.000000000000000000e+02,-1.000000000000000000e+02,1.000000000000000000e+02,-1.000000000000000000e+02
1.000000000000000000e+02,-1.000000000000000000e+02,1.000000000000000000e+02,-1.000000000000000000e+02,1.000000000000000000e+02,-1.000000000000000000e+02,1.000000000000000000e+02,-1.000000000000000000e+02,1.000000000000000000e+02,-1.000000000000000000e+02,-1.000000000000000000e+02,1.000000000000000000e+02,-1.000000000000000000e+02,1.000000000000000000e+02,-1.000000000000000000e+02,1.000000000000000000e+02,-1.000000000000000000e+02,-1.000000000000000000e+02,1.000000000000000000e+02,-1.000000000000000000e+02,1.000000000000000000e+02,-1.000000000000000000e+02,1.000000000000000000e+02,-1.000000000000000000e+02,1.000000000000000000e+02,-1.000000000000000000e+02,1.000000000000000000e+02,-4.338259270927622424e+01,-1.000000000000000000e+02,1.000000000000000000e+02
-1.000000000000000000e+02,1.000000000000000000e+02,1.000000000000000000e+02,-1.000000000000000000e+02,-1.000000000000000000e+02,5.174094715581094306e+01,1.000000000000000000e+02,-1.000000000000000000e+02,1.000000000000000000e+02,1.000000000000000000e+02,-1.000000000000000000e+02,5.174094692201007462e+01,1.000000000000000000e+02,-1.000000000000000000e+02,1.000000000000000000e+02,-1.000000000000000000e+02,5.174094744219750908e+01,1.000000000000000000e+02,-1.000000000000000000e+02,1.000000000000000000e+02,1.000000000000000000e+02,-1.000000000000000000e+02,1.000000000000000000e+02,-1.000000000000000000e+02,1.000000000000000000e+02,-1.000000000000000000e+02,1.000000000000000000e+02,-1.000000000000000000e+02,1.000000000000000000e+02,-1.000000000000000000e+02
1.000000000000000000e+02,-1.000000000000000000e+02,1.000000000000000000e+02,-1.000000000000000000e+02,1.000000000000000000e+02,-4.338258966883060452e+01,-1.000000000000000000e+02,5.174094853520946913e+01,1.000000000000000000e+02,-1.000000000000000000e+02,5.174095124537490875e+01,1.000000000000000000e+02,-1.000000000000000000e+02,1.000000000000000000e+02,-1.000000000000000000e+02,-1.000000000000000000e+02,-1.000000000000000000e+02,1.000000000000000000e+02,-1.000000000000000000e+02,1.000000000000000000e+02,-1.000000000000000000e+02,1.000000000000000000e+02,-1.000000000000000000e+02,-1.000000000000000000e+02,1.000000000000000000e+02,-1.000000000000000000e+02,1.000000000000000000e+02,-1.000000000000000000e+02,1.000000000000000000e+02,-1.000000000000000000e+02
-1.000000000000000000e+02,5.174094486961510597e+01,1.000000000000000000e+02,-1.000000000000000000e+02,5.174095191036739294e+01,1.000000000000000000e+02,-1.000000000000000000e+02,5.174094623529920511e+01,1.000000000000000000e+02,-1.000000000000000000e+02,1.000000000000000000e+02,-1.000000000000000000e+02,1.000000000000000000e+02,-4.338259277996257879e+01,-1.000000000000000000e+02,1.000000000000000000e+02,-1.000000000000000000e+02,5.174094826399087310e+01,1.000000000000000000e+02,-1.000000000000000000e+02,1.000000000000000000e+02,-1.000000000000000000e+02,1.000000000000000000e+02,-1.000000000000000000e+02,1.000000000000000000e+02,-4.338259132834219400e+01,-1.000000000000000000e+02,1.000000000000000000e+02,-1.000000000000000000e+02,-1.000000000000000000e+02
-1.000000000000000000e+02,-1.000000000000000000e+02,1.000000000000000000e+02,-1.000000000000000000e+02,1.000000000000000000e+02,-1.000000000000000000e+02,1.000000000000000000e+02,-1.000000000000000000e+02,1.000000000000000000e+02,-1.000000000000000000e+02,1.000000000000000000e+02,-1.000000000000000000e+02,1.000000000000000000e+02,-1.000000000000000000e+02,1.000000000000000000e+02,-1.000000000000000000e+02,-1.000000000000000000e+02,1.000000000000000000e+02,-1.000000000000000000e+02,-1.000000000000000000e+02,1.000000000000000000e+02,-1.000000000000000000e+02,1.000000000000000000e+02,-1.000000000000000000e+02,1.000000000000000000e+02,-1.000000000000000000e+02,1.000000000000000000e+02,-1.000000000000000000e+02,1.000000000000000000e+02,-1.000000000000000000e+02
-1.000000000000000000e+02,1.000000000000000000e+02,-1.000000000000000000e+02,1.000000000000000000e+02,-1.000000000000000000e+02,1.000000000000000000e+02,-1.000000000000000000e+02,1.000000000000000000e+02,-1.000000000000000000e+02,1.000000000000000000e+02,-1.000000000000000000e+02,-1.000000000000000000e+02,-1.000000000000000000e+02,-1.000000000000000000e+02,1.000000000000000000e+02,-1.000000000000000000e+02,5.174094765724362333e+01,1.000000000000000000e+02,-1.000000000000000000e+02,1.000000000000000000e+02,-1.000000000000000000e+02,1.000000000000000000e+02,-4.338258916302645929e+01,-1.000000000000000000e+02,1.000000000000000000e+02,-4.338258897805507530e+01,-1.000000000000000000e+02,1.000000000000000000e+02,-1.000000000000000000e+02,1.000000000000000000e+02
1.000000000000000000e+02,-1.000000000000000000e+02,1.000000000000000000e+02,-1.000000000000000000e+02,5.174094987320349048e+01,1.000000000000000000e+02,-1.000000000000000000e+02,1.000000000000000000e+02,-1.000000000000000000e+02,1.000000000000000000e+02,-4.338259114171224695e+01,-1.000000000000000000e+02,1.000000000000000000e+02,-1.000000000000000000e+02,1.000000000000000000e+02,-1.000000000000000000e+02,1.000000000000000000e+02,-1.000000000000000000e+02,1.000000000000000000e+02,-1.000000000000000000e+02,1.000000000000000000e+02,-1.000000000000000000e+02,-1.000000000000000000e+02,1.000000000000000000e+02,-1.000000000000000000e+02,1.000000000000000000e+02,-1.000000000000000000e+02,1.000000000000000000e+02,-1.000000000000000000e+02,1.000000000000000000e+02
-1.000000000000000000e+02,1.000000000000000000e+02,-1.000000000000000000e+02,1.000000000000000000e+02,-1.000000000000000000e+02,1.000000000000000000e+02,-1.000000000000000000e+02,1.000000000000000000e+02,-1.000000000000000000e+02,1.000000000000000000e+02,-1.000000000000000000e+02,1.000000000000000000e+02,-1.000000000000000000e+02,1.000000000000000000e+02,-1.000000000000000000e+02,1.000000000000000000e+02,-1.000000000000000000e+02,-1.000000000000000000e+02,1.000000000000000000e+02,-1.000000000000000000e+02,1.000000000000000000e+02,1.000000000000000000e+02,-1.000000000000000000e+02,1.000000000000000000e+02,-1.000000000000000000e+02,1.000000000000000000e+02,-4.338259035384790963e+01,-1.000000000000000000e+02,-1.000000000000000000e+02,1.000000000000000000e+02
-1.000000000000000000e+02,5.174094705610936273e+01,1.000000000000000000e+02,-1.000000000000000000e+02,1.000000000000000000e+02,-1.000000000000000000e+02,1.000000000000000000e+02,-1.000000000000000000e+02,-1.000000000000000000e+02,1.000000000000000000e+02,-1.000000000000000000e+02,1.000000000000000000e+02,-1.000000000000000000e+02,1.000000000000000000e+02,1.000000000000000000e+02,-1.000000000000000000e+02,1.000000000000000000e+02,1.000000000000000000e+02,-1.000000000000000000e+02,1.000000000000000000e+02,-1.000000000000000000e+02,1.000000000000000000e+02,-1.000000000000000000e+02,5.174094773894501031e+01,1.000000000000000000e+02,-1.000000000000000000e+02,1.000000000000000000e+02,-1.000000000000000000e+02,1.000000000000000000e+02,-1.000000000000000000e+02
1.000000000000000000e+02,-1.000000000000000000e+02,1.000000000000000000e+02,-1.000000000000000000e+02,1.000000000000000000e+02,-1.000000000000000000e+02,1.000000000000000000e+02,-1.000000000000000000e+02,5.174094788822134916e+01,1.000000000000000000e+02,-1.000000000000000000e+02,1.000000000000000000e+02,-1.000000000000000000e+02,5.174094635255840302e+01,1.000000000000000000e+02,-1.000000000000000000e+02,1.000000000000000000e+02,-1.000000000000000000e+02,1.000000000000000000e+02,-1.000000000000000000e+02,1.000000000000000000e+02,-1.000000000000000000e+02,5.174094882439834464e+01,1.000000000000000000e+02,-1.000000000000000000e+02,1.000000000000000000e+02,-1.000000000000000000e+02,1.000000000000000000e+02,-1.000000000000000000e+02,-1.000000000000000000e+02
1.000000000000000000e+02,-1.000000000000000000e+02,1.000000000000000000e+02,-1.000000000000000000e+02,-1.000000000000000000e+02,-1.000000000000000000e+02,1.000000000000000000e+02,-1.000000000000000000e+02,-1.000000000000000000e+02,1.000000000000000000e+02,-1.000000000000000000e+02,-1.000000000000000000e+02,1.000000000000000000e+02,1.000000000000000000e+02,-1.000000000000000000e+02,1.000000000000000000e+02,-1.000000000000000000e+02,1.000000000000000000e+02,-1.000000000000000000e+02,1.000000000000000000e+02,-1.000000000000000000e+02,1.000000000000000000e+02,1.000000000000000000e+02,-1.000000000000000000e+02,1.000000000000000000e+02,-1.000000000000000000e+02,1.000000000000000000e+02,-1.000000000000000000e+02,1.000000000000000000e+02,-1.000000000000000000e+02
-1.000000000000000000e+02,-1.000000000000000000e+02,1.000000000000000000e+02,-4.338259309827711263e+01,-1.000000000000000000e+02,1.000000000000000000e+02,-1.000000000000000000e+02,1.000000000000000000e+02,-1.000000000000000000e+02,1.000000000000000000e+02,-1.000000000000000000e+02,5.174094816477832381e+01,1.000000000000000000e+02,-1.000000000000000000e+02,1.000000000000000000e+02,-1.000000000000000000e+02,1.000000000000000000e+02,-1.000000000000000000e+02,1.000000000000000000e+02,-1.000000000000000000e+02,1.000000000000000000e+02,-1.000000000000000000e+02,1.000000000000000000e+02,-4.338259319851173501e+01,-1.000000000000000000e+02,1.000000000000000000e+02,-1.000000000000000000e+02,1.000000000000000000e+02,-1.000000000000000000e+02,1.000000000000000000e+02
-1.000000000000000000e+02,-1.000000000000000000e+02,-1.000000000000000000e+02,1.000000000000000000e+02,-4.338259444125272069e+01,-1.000000000000000000e+02,1.000000000000000000e+02,-1.000000000000000000e+02,1.000000000000000000e+02,-1.000000000000000000e+02,1.000000000000000000e+02,-1.000000000000000000e+02,5.174094789541579331e+01,1.000000000000000000e+02,-1.000000000000000000e+02,1.000000000000000000e+02,-1.000000000000000000e+02,5.174094868497434163e+01,1.000000000000000000e+02,-1.000000000000000000e+02,5.174094463258347787e+01,1.000000000000000000e+02,-1.000000000000000000e+02,1.000000000000000000e+02,-1.000000000000000000e+02,1.000000000000000000e+02,-1.000000000000000000e+02,1.000000000000000000e+02,-4.338259249862613842e+01,-1.000000000000000000e+02
-1.000000000000000000e+02,1.000000000000000000e+02,-1.000000000000000000e+02,-1.000000000000000000e+02,1.000000000000000000e+02,-1.000000000000000000e+02,1.000000000000000000e+02,1.000000000000000000e+02,-4.338259318953901555e+01,-1.000000000000000000e+02,1.000000000000000000e+02,-1.000000000000000000e+02,1.000000000000000000e+02,-1.000000000000000000e+02,5.174094724838672477e+01,1.000000000000000000e+02,-1.000000000000000000e+02,-1.000000000000000000e+02,1.000000000000000000e+02,-1.000000000000000000e+02,1.000000000000000000e+02,-1.000000000000000000e+02,1.000000000000000000e+02,-1.000000000000000000e+02,5.174094618420510017e+01,1.000000000000000000e+02,-1.000000000000000000e+02,-1.000000000000000000e+02,1.000000000000000000e+02,-1.000000000000000000e+02
-1.000000000000000000e+02,1.000000000000000000e+02,-1.000000000000000000e+02,1.000000000000000000e+02,-1.000000000000000000e+02,-1.000000000000000000e+02,1.000000000000000000e+02,1.000000000000000000e+02,-1.000000000000000000e+02,1.000000000000000000e+02,-1.000000000000000000e+02,1.000000000000000000e+02,-1.000000000000000000e+02,1.000000000000000000e+02,-1.000000000000000000e+02,1.000000000000000000e+02,-1.000000000000000000e+02,1.000000000000000000e+02,-4.338259189034273078e+01,-1.000000000000000000e+02,1.000000000000000000e+02,-1.000000000000000000e+02,-1.000000000000000000e+02,5.174094812123136933e+01,1.000000000000000000e+02,-1.000000000000000000e+02,-1.000000000000000000e+02,1.000000000000000000e+02,-1.000000000000000000e+02,-1.000000000000000000e+02
1.000000000000000000e+02,-1.000000000000000000e+02,1.000000000000000000e+02,-1.000000000000000000e+02,1.000000000000000000e+02,-1.000000000000000000e+02,1.000000000000000000e+02,-1.000000000000000000e+02,-1.000000000000000000e+02,5.174094512842746951e+01,1.000000000000000000e+02,-1.000000000000000000e+02,1.000000000000000000e+02,-4.338259587146799845e+01,-1.000000000000000000e+02,1.000000000000000000e+02,-1.000000000000000000e+02,1.000000000000000000e+02,-4.338259218107090476e+01,-1.000000000000000000e+02,1.000000000000000000e+02,-1.000000000000000000e+02,1.000000000000000000e+02,-1.000000000000000000e+02,1.000000000000000000e+02,-1.000000000000000000e+02,-1.000000000000000000e+02,1.000000000000000000e+02,-1.000000000000000000e+02,1.000000000000000000e+02
-1.000000000000000000e+02,1.000000000000000000e+02,1.000000000000000000e+02,-1.000000000000000000e+02,1.000000000000000000e+02,-4.338259154532580908e+01,-1.000000000000000000e+02,1.000000000000000000e+02,-1.000000000000000000e+02,1.000000000000000000e+02,-1.000000000000000000e+02,1.000000000000000000e+02,-1.000000000000000000e+02,1.000000000000000000e+02,1.000000000000000000e+02,-1.000000000000000000e+02,1.000000000000000000e+02,-4.338259127739087972e+01,-1.000000000000000000e+02,1.000000000000000000e+02,-1.000000000000000000e+02,1.000000000000000000e+02,-1.000000000000000000e+02,1.000000000000000000e+02,1.000000000000000000e+02,-1.000000000000000000e+02,1.000000000000000000e+02,-1.000000000000000000e+02,1.000000000000000000e+02,-1.000000000000000000e+02
1.000000000000000000e+02,-1.000000000000000000e+02,5.174094932757865450e+01,1.000000000000000000e+02,-1.000000000000000000e+02,1.000000000000000000e+02,-1.000000000000000000e+02,1.000000000000000000e+02,-1.000000000000000000e+02,1.000000000000000000e+02,-4.338258890182379446e+01,-1.000000000000000000e+02,1.000000000000000000e+02,-1.000000000000000000e+02,1.000000000000000000e+02,-1.000000000000000000e+02,1.000000000000000000e+02,-1.000000000000000000e+02,1.000000000000000000e+02,-4.338259233570000362e+01,-1.000000000000000000e+02,1.000000000000000000e+02,-1.000000000000000000e+02,1.000000000000000000e+02,-1.000000000000000000e+02,1.000000000000000000e+02,-1.000000000000000000e+02,1.000000000000000000e+02,-1.000000000000000000e+02,-1.000000000000000000e+02
-1.000000000000000000e+02,1.000000000000000000e+02,-1.000000000000000000e+02,1.000000000000000000e+02,-1.000000000000000000e+02,1.000000000000000000e+02,-1.000000000000000000e+02,1.000000000000000000e+02,-1.000000000000000000e+02,1.000000000000000000e+02,-1.000000000000000000e+02,1.000000000000000000e+02,-1.000000000000000000e+02,-1.000000000000000000e+02,1.000000000000000000e+02,-1.000000000000000000e+02,5.174094720934306224e+01,1.000000000000000000e+02,-1.000000000000000000e+02,-1.000000000000000000e+02,1.000000000000000000e+02,-1.000000000000000000e+02,5.174095097961867395e+01,1.000000000000000000e+02,-1.000000000000000000e+02,1.000000000000000000e+02,-1.000000000000000000e+02,1.000000000000000000e+02,-1.000000000000000000e+02,1.000000000000000000e+02
-1.000000000000000000e+02,1.000000000000000000e+02,-1.000000000000000000e+02,1.000000000000000000e+02,-1.000000000000000000e+02,1.000000000000000000e+02,-1.000000000000000000e+02,-1.000000000000000000e+02,5.174094667893188415e+01,1.000000000000000000e+02,-1.000000000000000000e+02,-1.000000000000000000e+02,5.174094873606870237e+01,1.000000000000000000e+02,-1.000000000000000000e+02,-1.000000000000000000e+02,1.000000000000000000e+02,-1.000000000000000000e+02,1.000000000000000000e+02,-1.000000000000000000e+02,1.000000000000000000e+02,-1.000000000000000000e+02,1.000000000000000000e+02,1.000000000000000000e+02,-1.000000000000000000e+02,-1.000000000000000000e+02,1.000000000000000000e+02,-1.000000000000000000e+02,1.000000000000000000e+02,-1.000000000000000000e+02
1.000000000000000000e+02,-1.000000000000000000e+02,1.000000000000000000e+02,-1.000000000000000000e+02,1.000000000000000000e+02,-1.000000000000000000e+02,5.174095047809665715e+01,1.000000000000000000e+02,-1.000000000000000000e+02,1.000000000000000000e+02,-4.338259295102828617e+01,-1.000000000000000000e+02,1.000000000000000000e+02,-1.000000000000000000e+02,1.000000000000000000e+02,-1.000000000000000000e+02,1.000000000000000000e+02,-1.000000000000000000e+02,1.000000000000000000e+02,1.000000000000000000e+02,-1.000000000000000000e+02,1.000000000000000000e+02,-1.000000000000000000e+02,-1.000000000000000000e+02,5.174094865955954958e+01,1.000000000000000000e+02,-1.000000000000000000e+02,5.174094805238729577e+01,1.000000000000000000e+02,-1.000000000000000000e+02
