<?xml version="1.0" encoding="UTF-8" standalone="no"?>
<!-- Created with Inkscape (http://www.inkscape.org/) -->

<svg
   width="498.00009"
   height="748.97711"
   viewBox="0 0 131.76252 198.16686"
   version="1.1"
   id="svg5"
   xml:space="preserve"
   xmlns:inkscape="http://www.inkscape.org/namespaces/inkscape"
   xmlns:sodipodi="http://sodipodi.sourceforge.net/DTD/sodipodi-0.dtd"
   xmlns="http://www.w3.org/2000/svg"
   xmlns:svg="http://www.w3.org/2000/svg"><sodipodi:namedview
     id="namedview7"
     pagecolor="#ffffff"
     bordercolor="#000000"
     borderopacity="0.25"
     inkscape:showpageshadow="2"
     inkscape:pageopacity="0.0"
     inkscape:pagecheckerboard="0"
     inkscape:deskcolor="#d1d1d1"
     inkscape:document-units="mm"
     showgrid="false" /><defs
     id="defs2"><inkscape:path-effect
       effect="powerclip"
       id="path-effect3204"
       is_visible="true"
       lpeversion="1"
       inverse="true"
       flatten="false"
       hide_clip="false"
       message="Usar a regra de preenchimento par ou ímpar na caixa de diálogo &lt;b&gt;preenchimento e contorno&lt;/b&gt; se nenhum resultado nivelar após converter o clipe em caminhos." /><clipPath
       clipPathUnits="userSpaceOnUse"
       id="clipPath3307"><rect
         style="fill:#ffffff;stroke:none;stroke-width:51.9856"
         id="rect3309"
         width="7832.5249"
         height="6753.3774"
         x="-499.31653"
         y="-13251.789"
         transform="scale(1,-1)" /></clipPath><clipPath
       clipPathUnits="userSpaceOnUse"
       id="clipPath3313"><rect
         style="fill:#ffffff;stroke:none;stroke-width:0.808302"
         id="rect3315"
         width="132.29167"
         height="198.4375"
         x="-314.17911"
         y="-272.20685"
         transform="rotate(-48.174941)" /></clipPath><clipPath
       clipPathUnits="userSpaceOnUse"
       id="clipPath3317"><rect
         style="fill:#ffffff;stroke:none;stroke-width:0.808302"
         id="rect3319"
         width="132.29167"
         height="198.4375"
         x="-185.33392"
         y="-128.52527"
         transform="rotate(-48.174941)" /></clipPath><clipPath
       clipPathUnits="userSpaceOnUse"
       id="clipPath3321"><rect
         style="fill:#ffffff;stroke:none;stroke-width:0.808302"
         id="rect3323"
         width="132.29167"
         height="198.4375"
         x="53.553413"
         y="-88.730179"
         transform="rotate(42.615459)"
         d="M 53.553413,-88.730179 H 185.84509 V 109.70732 H 53.553413 Z" /></clipPath><clipPath
       clipPathUnits="userSpaceOnUse"
       id="clipPath3325"><rect
         style="fill:#ffffff;stroke:none;stroke-width:51.9856"
         id="rect3327"
         width="8508.2832"
         height="12762.424"
         x="3274.4944"
         y="-10587.292"
         transform="matrix(0.84804043,0.52993153,0.52993153,-0.84804043,0,0)" /></clipPath><clipPath
       clipPathUnits="userSpaceOnUse"
       id="clipPath3329"><rect
         style="fill:#ffffff;stroke:none;stroke-width:0.808302"
         id="rect3331"
         width="132.29167"
         height="198.4375"
         x="0.54126471"
         y="-0.54126471" /></clipPath></defs><g
     inkscape:label="Camada 1"
     inkscape:groupmode="layer"
     id="layer1"
     transform="translate(-0.54125735,0.54126471)"><rect
       style="fill:#ececec;stroke:none;stroke-width:0.811921"
       id="rect2240"
       width="131.47974"
       height="197.62558"
       x="0"
       y="2.7755576e-17"
       clip-path="url(#clipPath3329)" /><path
       style="display:inline;fill:#cccccc;stroke-width:0.264583"
       d="m 86.377588,149.59709 c -0.08853,-0.1155 -0.503444,0.0525 -0.922035,0.3734 -1.309913,1.00409 -6.745836,3.53071 -10.047159,4.66992 -11.360187,3.92012 -24.633677,3.81339 -36.198265,-0.29106 -6.497709,-2.30614 -14.722313,-7.39738 -19.140392,-11.84842 -0.542638,-0.54665 -1.068908,-0.93084 -1.16952,-0.85372 -0.10062,0.0771 -2.138646,-2.41113 -4.528953,-5.52945 -2.390307,-3.11833 -4.264531,-5.73215 -4.164935,-5.80849 0.09959,-0.0763 -0.15522,-0.70364 -0.5662352,-1.39401 C 8.5287037,127.04854 6.1589189,121.33638 5.3181085,118.4975 3.0148984,110.72104 2.4926841,103.15933 3.6913629,94.941727 5.109237,85.221372 8.8003784,76.551712 14.738341,68.994859 c 1.212215,-1.542707 2.745433,-3.326178 3.407151,-3.96327 0.661715,-0.637091 1.190936,-1.27927 1.176043,-1.427061 -0.03538,-0.351123 10.135355,-8.147356 10.46523,-8.021975 0.138856,0.05277 0.896461,-0.29145 1.683581,-0.764943 3.466909,-2.085528 10.046151,-4.494262 15.299495,-5.601309 7.897419,-1.664248 17.634414,-1.319706 25.589057,0.905456 23.97195,6.705701 40.196472,28.265036 40.140582,53.339253 -0.005,2.09657 0.0889,2.70059 0.40388,2.60741 0.22546,-0.0667 1.4659,-0.92944 2.75649,-1.91721 6.01372,-4.602181 11.53227,-7.127916 18.79855,-8.602142 4.81593,-0.977084 6.21436,-0.808523 7.52983,0.907592 0.74553,0.972594 0.88148,1.348238 0.81995,2.265676 -0.0776,1.156853 -0.88084,2.940194 -1.5667,3.478324 -0.22309,0.17479 -2.15012,0.69453 -4.28254,1.15463 -6.97947,1.50593 -9.8935,2.76122 -15.17532,6.53712 -6.51574,4.65802 -10.22723,8.99789 -15.03307,17.5782 -3.28535,5.86565 -6.80397,10.69934 -9.943869,13.66037 -0.718365,0.67745 -1.243686,1.31316 -1.167384,1.4127 0.07631,0.0995 -1.94015,1.77454 -4.481006,3.72219 -2.939836,2.25349 -4.678266,3.46485 -4.780703,3.33122 z M 68.484084,136.56207 c 1.265748,-2.47077 1.674836,-5.34086 1.142106,-8.01276 -0.38226,-1.91719 -0.447411,-2.04164 -2.407573,-4.59881 -1.967213,-2.56637 -2.055059,-2.64709 -3.728595,-3.42608 -2.861015,-1.33173 -6.24595,-1.66008 -8.799338,-0.85357 -6.863748,2.16797 -10.21323,9.45873 -7.404437,16.11709 2.388465,5.66197 8.934485,8.43988 14.95654,6.34707 1.16632,-0.40533 1.936439,-0.87935 3.379666,-2.08026 1.630939,-1.35715 1.99562,-1.8022 2.861631,-3.49268 z m 25.731067,-18.77411 c 1.361531,-1.76678 2.103733,-3.76442 2.372774,-6.38637 0.305127,-2.97353 -0.172724,-4.84503 -1.881845,-7.37023 -3.533525,-5.220713 -9.985535,-6.855156 -15.563591,-3.94263 -4.433938,2.31512 -6.906115,7.89231 -5.793671,13.07039 0.392981,1.8292 0.516852,2.06661 2.275042,4.36029 1.819435,2.37358 1.901988,2.44676 3.839424,3.40126 5.280061,2.6014 11.32171,1.3184 14.751867,-3.13271 z M 61.633723,105.5003 c 0.779511,-1.07884 0.98578,-3.18955 0.44967,-4.60139 -0.559517,-1.473496 -1.863416,-2.364715 -3.842079,-2.62625 -2.497193,-0.330032 -4.516229,1.143355 -5.082676,3.70907 -0.604624,2.73866 1.654044,5.52343 4.474445,5.51667 1.831492,-0.004 2.971474,-0.57376 4.00064,-1.9981 z m -22.642028,14.41239 c 2.513043,-2.78868 3.625424,-7.02079 2.824841,-10.74724 -0.39278,-1.82827 -0.517472,-2.06742 -2.270077,-4.35382 -1.769354,-2.30824 -1.935072,-2.45914 -3.610734,-3.28795 -6.353053,-3.142301 -13.456868,-0.82983 -16.398831,5.33823 -0.682243,1.43038 -1.23244,4.92861 -1.030354,6.55115 0.436644,3.50582 3.035545,7.24634 6.162844,8.86998 4.8658,2.52625 10.793833,1.54515 14.322311,-2.37035 z M 82.601891,86.33674 c 1.668684,-1.949547 2.377538,-3.63058 2.679572,-6.354514 0.581885,-5.247899 -1.663586,-9.462356 -6.33431,-11.888708 -2.997958,-1.557379 -7.180244,-1.660045 -10.271167,-0.252128 -6.453972,2.939781 -8.836199,11.248101 -4.957019,17.288256 3.08152,4.798143 9.706929,6.678308 14.906099,4.230071 1.987927,-0.936096 2.568045,-1.377073 3.97685,-3.022946 z M 48.75777,87.422787 c 3.167643,-3.518589 3.789229,-9.401171 1.45166,-13.738372 -2.735962,-5.076391 -9.911541,-7.437509 -15.2345,-5.012902 -2.366526,1.077952 -4.711673,3.409375 -5.867956,5.833618 -1.24722,2.614899 -1.306286,6.709414 -0.137835,9.554832 3.250098,7.914645 14.040068,9.748258 19.788631,3.362824 z"
       id="path3140"
       clip-path="url(#clipPath3321)"
       inkscape:path-effect="#path-effect3204"
       inkscape:original-d="m 86.377588,149.59709 c -0.08853,-0.1155 -0.503444,0.0525 -0.922035,0.3734 -1.309913,1.00409 -6.745836,3.53071 -10.047159,4.66992 -11.360187,3.92012 -24.633677,3.81339 -36.198265,-0.29106 -6.497709,-2.30614 -14.722313,-7.39738 -19.140392,-11.84842 -0.542638,-0.54665 -1.068908,-0.93084 -1.16952,-0.85372 -0.10062,0.0771 -2.138646,-2.41113 -4.528953,-5.52945 -2.390307,-3.11833 -4.264531,-5.73215 -4.164935,-5.80849 0.09959,-0.0763 -0.15522,-0.70364 -0.5662352,-1.39401 C 8.5287037,127.04854 6.1589189,121.33638 5.3181085,118.4975 3.0148984,110.72104 2.4926841,103.15933 3.6913629,94.941727 5.109237,85.221372 8.8003784,76.551712 14.738341,68.994859 c 1.212215,-1.542707 2.745433,-3.326178 3.407151,-3.96327 0.661715,-0.637091 1.190936,-1.27927 1.176043,-1.427061 -0.03538,-0.351123 10.135355,-8.147356 10.46523,-8.021975 0.138856,0.05277 0.896461,-0.29145 1.683581,-0.764943 3.466909,-2.085528 10.046151,-4.494262 15.299495,-5.601309 7.897419,-1.664248 17.634414,-1.319706 25.589057,0.905456 23.97195,6.705701 40.196472,28.265036 40.140582,53.339253 -0.005,2.09657 0.0889,2.70059 0.40388,2.60741 0.22546,-0.0667 1.4659,-0.92944 2.75649,-1.91721 6.01372,-4.602181 11.53227,-7.127916 18.79855,-8.602142 4.81593,-0.977084 6.21436,-0.808523 7.52983,0.907592 0.74553,0.972594 0.88148,1.348238 0.81995,2.265676 -0.0776,1.156853 -0.88084,2.940194 -1.5667,3.478324 -0.22309,0.17479 -2.15012,0.69453 -4.28254,1.15463 -6.97947,1.50593 -9.8935,2.76122 -15.17532,6.53712 -6.51574,4.65802 -10.22723,8.99789 -15.03307,17.5782 -3.28535,5.86565 -6.80397,10.69934 -9.943869,13.66037 -0.718365,0.67745 -1.243686,1.31316 -1.167384,1.4127 0.07631,0.0995 -1.94015,1.77454 -4.481006,3.72219 -2.939836,2.25349 -4.678266,3.46485 -4.780703,3.33122 z M 68.484084,136.56207 c 1.265748,-2.47077 1.674836,-5.34086 1.142106,-8.01276 -0.38226,-1.91719 -0.447411,-2.04164 -2.407573,-4.59881 -1.967213,-2.56637 -2.055059,-2.64709 -3.728595,-3.42608 -2.861015,-1.33173 -6.24595,-1.66008 -8.799338,-0.85357 -6.863748,2.16797 -10.21323,9.45873 -7.404437,16.11709 2.388465,5.66197 8.934485,8.43988 14.95654,6.34707 1.16632,-0.40533 1.936439,-0.87935 3.379666,-2.08026 1.630939,-1.35715 1.99562,-1.8022 2.861631,-3.49268 z m 25.731067,-18.77411 c 1.361531,-1.76678 2.103733,-3.76442 2.372774,-6.38637 0.305127,-2.97353 -0.172724,-4.84503 -1.881845,-7.37023 -3.533525,-5.220713 -9.985535,-6.855156 -15.563591,-3.94263 -4.433938,2.31512 -6.906115,7.89231 -5.793671,13.07039 0.392981,1.8292 0.516852,2.06661 2.275042,4.36029 1.819435,2.37358 1.901988,2.44676 3.839424,3.40126 5.280061,2.6014 11.32171,1.3184 14.751867,-3.13271 z M 61.633723,105.5003 c 0.779511,-1.07884 0.98578,-3.18955 0.44967,-4.60139 -0.559517,-1.473496 -1.863416,-2.364715 -3.842079,-2.62625 -2.497193,-0.330032 -4.516229,1.143355 -5.082676,3.70907 -0.604624,2.73866 1.654044,5.52343 4.474445,5.51667 1.831492,-0.004 2.971474,-0.57376 4.00064,-1.9981 z m -22.642028,14.41239 c 2.513043,-2.78868 3.625424,-7.02079 2.824841,-10.74724 -0.39278,-1.82827 -0.517472,-2.06742 -2.270077,-4.35382 -1.769354,-2.30824 -1.935072,-2.45914 -3.610734,-3.28795 -6.353053,-3.142301 -13.456868,-0.82983 -16.398831,5.33823 -0.682243,1.43038 -1.23244,4.92861 -1.030354,6.55115 0.436644,3.50582 3.035545,7.24634 6.162844,8.86998 4.8658,2.52625 10.793833,1.54515 14.322311,-2.37035 z M 82.601891,86.33674 c 1.668684,-1.949547 2.377538,-3.63058 2.679572,-6.354514 0.581885,-5.247899 -1.663586,-9.462356 -6.33431,-11.888708 -2.997958,-1.557379 -7.180244,-1.660045 -10.271167,-0.252128 -6.453972,2.939781 -8.836199,11.248101 -4.957019,17.288256 3.08152,4.798143 9.706929,6.678308 14.906099,4.230071 1.987927,-0.936096 2.568045,-1.377073 3.97685,-3.022946 z M 48.75777,87.422787 c 3.167643,-3.518589 3.789229,-9.401171 1.45166,-13.738372 -2.735962,-5.076391 -9.911541,-7.437509 -15.2345,-5.012902 -2.366526,1.077952 -4.711673,3.409375 -5.867956,5.833618 -1.24722,2.614899 -1.306286,6.709414 -0.137835,9.554832 3.250098,7.914645 14.040068,9.748258 19.788631,3.362824 z"
       transform="rotate(-42.615459,103.19792,118.54711)" /><g
       transform="matrix(0.01318583,0.00823968,0.00823968,-0.01318583,-46.139116,170.95524)"
       fill="#000000"
       stroke="none"
       id="g3271"
       clip-path="url(#clipPath3325)"
       style="display:inline"><path
         d="m 3976,12785 c -459,-75 -837,-357 -1030,-766 -49,-103 -91,-227 -101,-293 -4,-23 -10,-48 -14,-54 -5,-8 -140,-42 -167,-42 -1,0 -21,30 -46,68 -161,239 -426,411 -722,467 -94,18 -282,21 -377,6 -389,-63 -728,-330 -870,-686 -179,-449 -68,-945 283,-1263 121,-110 275,-199 421,-243 l 67,-21 v -64 -64 h -113 c -62,0 -117,4 -123,9 -5,5 -65,30 -133,55 -121,45 -128,47 -221,44 l -96,-3 143,-300 c 80,-165 147,-303 151,-307 4,-4 30,-2 57,5 44,11 54,19 85,65 l 34,52 h 108 108 v -705 -705 h 180 c 142,0 180,-3 180,-13 0,-19 -39,-300 -42,-303 -2,-1 -195,-38 -430,-83 l -428,-81 -90,45 c -49,25 -97,45 -107,45 -29,0 -667,-122 -675,-129 -4,-4 1,-79 12,-166 29,-230 27,-224 50,-218 10,3 165,33 345,67 l 326,63 82,81 82,81 210,45 c 524,113 718,156 723,161 4,4 56,295 72,403 0,1 774,2 1720,2 h 1720 v 1170 1170 h -150 c -82,0 -150,2 -150,4 0,2 34,37 76,77 192,186 328,434 386,702 31,145 31,398 0,544 -58,271 -193,514 -391,706 -186,180 -395,293 -651,353 -136,32 -362,41 -494,19 z m -949,-2082 c 54,-85 132,-180 207,-252 37,-35 65,-65 63,-67 -2,-3 -160,-3 -350,-2 l -347,3 31,45 c 42,62 104,186 120,239 7,23 19,45 27,48 14,6 177,40 200,42 7,0 29,-25 49,-56 z M 5009,8496 c 41,-22 61,-59 61,-112 0,-39 -5,-51 -34,-80 -29,-29 -41,-34 -80,-34 -53,0 -90,20 -112,61 -55,107 58,220 165,165 z"
         id="path3265" /><path
         d="m 6275,10318 -340,-207 h -272 l -273,-1 v -525 -525 h 271 272 l 339,-206 c 187,-113 341,-204 344,-202 2,3 3,425 2,939 l -3,935 z"
         id="path3267" /><path
         d="m 2460,7715 v -235 h 61 c 53,0 60,-2 55,-17 -5,-16 -73,-355 -435,-2153 l -107,-535 -57,-3 -57,-3 v -144 -145 h 25 c 14,0 25,-4 25,-8 0,-5 -65,-332 -144,-728 C 1564,2443 1180,535 1175,514 c -4,-18 5,-22 81,-41 60,-15 87,-17 89,-9 2,6 200,736 440,1621 626,2307 645,2377 651,2386 3,5 32,9 65,9 h 59 v 145 c 0,138 -1,145 -20,145 -26,0 -25,7 9,131 16,57 120,439 231,849 111,410 217,799 235,865 l 33,120 6,-75 c 4,-41 24,-365 46,-720 22,-355 62,-1009 90,-1455 28,-445 66,-1062 85,-1370 60,-972 164,-2653 175,-2835 6,-96 13,-199 16,-227 l 5,-53 h 105 104 v 33 c 0,19 16,337 35,708 32,613 53,1032 145,2819 17,322 35,655 41,740 6,85 13,211 15,280 4,123 25,537 84,1680 16,316 30,603 30,638 0,34 4,62 10,62 6,0 10,-6 10,-14 0,-8 34,-140 76,-293 41,-153 174,-642 295,-1086 l 219,-809 v -139 -139 h 35 c 28,0 37,-5 44,-23 5,-13 214,-779 465,-1702 655,-2416 645,-2377 650,-2383 8,-7 166,29 166,38 0,4 -108,545 -241,1201 -132,657 -303,1505 -379,1884 -76,380 -152,754 -168,832 -16,78 -27,145 -24,148 3,3 25,5 49,5 h 43 v 145 145 h -79 -78 l -71,353 c -39,193 -161,800 -271,1347 -111,547 -201,999 -201,1005 0,6 20,9 50,7 l 50,-4 v 236 236 H 3570 2460 Z m 551,-352 c 2,-83 -4,-108 -94,-438 -52,-192 -164,-602 -247,-910 -84,-308 -194,-713 -244,-900 l -93,-340 -62,-3 -62,-3 7,28 c 4,15 127,624 274,1353 l 266,1325 120,5 c 140,6 132,13 135,-117 z m 839,85 c 0,-18 -13,-289 -30,-603 -16,-313 -45,-889 -65,-1280 -19,-390 -38,-734 -41,-762 l -5,-53 h -163 -162 l -12,188 c -7,103 -35,552 -62,997 -27,446 -59,951 -70,1124 -18,288 -19,317 -4,367 l 15,54 h 300 299 z m 550,29 c 0,-2 122,-608 270,-1346 149,-739 270,-1347 270,-1352 0,-6 -27,-9 -62,-7 l -61,3 -172,635 c -95,349 -257,946 -359,1325 -103,380 -191,702 -196,718 l -9,27 h 160 c 87,0 159,-2 159,-3 z M 2250,4474 c 0,-3 -66,-247 -146,-542 -80,-295 -160,-590 -176,-655 -17,-64 -33,-116 -35,-114 -4,5 254,1295 262,1308 7,10 95,13 95,3 z m 2896,-709 c 128,-635 161,-815 125,-668 -7,26 -93,346 -192,709 -98,364 -179,665 -179,669 0,3 23,5 52,3 l 52,-3 z m -1452,623 c -2,-35 -14,-238 -24,-453 -11,-214 -38,-740 -60,-1168 -22,-427 -40,-798 -40,-824 0,-91 -10,-34 -20,113 -10,152 -57,916 -110,1784 -16,267 -32,513 -35,548 l -6,62 h 150 150 z"
         id="path3269"
         clip-path="url(#clipPath3307)" /></g><g
       id="g3229-9"
       transform="rotate(48.174941,-146.14881,486.96597)"
       style="display:inline;fill:#666666"
       clip-path="url(#clipPath3313)"><rect
         style="fill:#666666;stroke:none;stroke-width:0.808302"
         id="rect3224-6"
         width="191.06645"
         height="31.393354"
         x="-219.74138"
         y="60.621651" /><path
         d="m -220.40142,76.047694 v 23.915087 h 96.4518 96.451804 V 76.047694 52.132608 h -96.451804 -96.4518 z m 6.35929,-20.321496 c 0.12142,0.113881 0.16695,0.771862 0.13659,2.049864 l -0.0455,1.88537 -1.50255,0.03796 c -0.97135,0.02531 -1.56326,-0.01265 -1.69986,-0.113881 -0.25802,-0.177149 -0.30355,-3.403788 -0.0607,-3.796046 0.1366,-0.215109 0.3339,-0.240416 1.57844,-0.240416 1.03206,0 1.4722,0.05061 1.59362,0.177149 z m 9.6983,-0.02531 c 0.27319,0.227763 0.25801,3.694818 -0.0304,3.88462 -0.1366,0.101228 -0.72851,0.139189 -1.69986,0.113882 l -1.50256,-0.03796 -0.0455,-1.885369 c -0.0304,-1.278002 0.0152,-1.935983 0.1366,-2.049864 0.22766,-0.227763 2.86851,-0.25307 3.1417,-0.02531 z m 9.5617,-0.05061 c 0.1366,0.08857 0.18213,0.58206 0.15178,2.062518 l -0.0455,1.948636 -1.51773,0.03796 c -1.29007,0.02531 -1.54809,0 -1.69986,-0.189803 -0.1366,-0.139188 -0.19731,-0.733902 -0.19731,-1.885369 0,-2.100478 -0.0152,-2.075171 1.79092,-2.075171 0.72852,0 1.4115,0.05061 1.51773,0.101228 z m 9.71348,0.05061 c 0.25802,0.21511 0.25802,3.656857 0,3.871967 -0.12141,0.101228 -0.69815,0.151842 -1.56326,0.151842 -0.86511,0 -1.44184,-0.05061 -1.56326,-0.151842 -0.12142,-0.101228 -0.18213,-0.721249 -0.18213,-1.935983 0,-1.214735 0.0607,-1.834755 0.18213,-1.935984 0.24283,-0.202455 2.88368,-0.202455 3.12652,0 z m 9.65277,0.05061 c 0.31873,0.25307 0.34908,3.416441 0.0455,3.758085 -0.15178,0.189803 -0.40979,0.21511 -1.69986,0.189803 l -1.51774,-0.03796 -0.0455,-1.948636 c -0.0304,-1.480458 0.0152,-1.973944 0.15177,-2.062518 0.10625,-0.05061 0.78923,-0.101228 1.51774,-0.101228 1.0017,0 1.36595,0.05061 1.54808,0.202455 z m 9.62241,-0.05061 c 0.19731,0.164496 0.27319,3.429095 0.0911,3.821353 -0.0759,0.164495 -0.36425,0.202456 -1.56326,0.202456 -0.941,0 -1.53291,-0.05061 -1.65433,-0.151842 -0.25801,-0.21511 -0.25801,-3.656857 0,-3.871967 0.24284,-0.202455 2.88369,-0.202455 3.12653,0 z m 9.74384,0.08858 c 0.24283,0.392258 0.1973,3.618896 -0.0607,3.796045 -0.1366,0.101228 -0.72852,0.139189 -1.69986,0.113882 l -1.50255,-0.03796 -0.0455,-1.885369 c -0.0304,-1.278002 0.0152,-1.935983 0.13659,-2.049864 0.12142,-0.126535 0.56156,-0.177149 1.59362,-0.177149 1.24454,0 1.44185,0.02531 1.57844,0.240416 z m 9.54653,-0.06327 c 0.12141,0.113881 0.16695,0.771862 0.13659,2.049864 l -0.0455,1.885369 -1.50255,0.03796 c -0.97135,0.02531 -1.56326,-0.01266 -1.69986,-0.113882 -0.28837,-0.189802 -0.30355,-3.656857 -0.0304,-3.88462 0.27319,-0.227762 2.91404,-0.202455 3.1417,0.02531 z m 9.6983,-0.02531 c 0.27319,0.227763 0.25801,3.694817 -0.0304,3.88462 -0.1366,0.101228 -0.72851,0.139188 -1.69986,0.113881 l -1.50256,-0.03796 -0.0455,-1.885369 c -0.0304,-1.278003 0.0152,-1.935984 0.1366,-2.049865 0.22766,-0.227763 2.86851,-0.25307 3.1417,-0.02531 z m 9.57688,0.02531 c 0.12142,0.113881 0.16695,0.771862 0.13659,2.049864 l -0.0455,1.885369 -1.51772,0.03796 c -1.29007,0.02531 -1.54809,0 -1.69986,-0.189803 -0.24284,-0.265723 -0.27319,-3.353173 -0.0455,-3.720124 0.13659,-0.215109 0.3339,-0.240416 1.57844,-0.240416 1.03206,0 1.4722,0.05061 1.59362,0.177149 z m 9.6983,-0.02531 c 0.12142,0.101228 0.18213,0.721249 0.18213,1.935983 0,1.214735 -0.0607,1.834755 -0.18213,1.935983 -0.12142,0.101228 -0.71334,0.151842 -1.65433,0.151842 -1.199,0 -1.48737,-0.03796 -1.56326,-0.202456 -0.18213,-0.392258 -0.10624,-3.656857 0.0911,-3.821352 0.24283,-0.202456 2.88368,-0.202456 3.12652,0 z m 9.56171,-0.05061 c 0.13659,0.08858 0.18212,0.58206 0.15177,2.062518 l -0.0455,1.948637 -1.51773,0.03796 c -1.29007,0.02531 -1.54809,0 -1.69986,-0.189802 -0.1366,-0.139188 -0.19731,-0.733902 -0.19731,-1.885369 0,-2.100479 -0.0152,-2.075172 1.79093,-2.075172 0.72851,0 1.41149,0.05061 1.51773,0.101228 z m 9.713475,0.05061 c 0.121418,0.101228 0.182126,0.721249 0.182126,1.935983 0,1.214735 -0.06071,1.834755 -0.182126,1.935983 -0.121422,0.101228 -0.698157,0.151842 -1.563267,0.151842 -0.865108,0 -1.441838,-0.05061 -1.563258,-0.151842 -0.12142,-0.101228 -0.18213,-0.721248 -0.18213,-1.935983 0,-1.214734 0.0607,-1.834755 0.18213,-1.935983 0.24283,-0.202456 2.883686,-0.202456 3.126525,0 z m 9.652765,0.05061 c 0.318726,0.25307 0.349078,3.416441 0.04554,3.758085 -0.151774,0.189802 -0.409788,0.215109 -1.699863,0.189802 l -1.517728,-0.03796 -0.04553,-1.948637 c -0.03037,-1.480458 0.01519,-1.973943 0.151774,-2.062518 0.106243,-0.05061 0.789222,-0.101228 1.517732,-0.101228 1.001701,0 1.365958,0.05061 1.548084,0.202456 z m 9.637592,-0.02531 c 0.121418,0.113882 0.166952,0.771863 0.136596,2.049865 l -0.04553,1.885369 -1.502553,0.03796 c -0.971349,0.02531 -1.563263,-0.01265 -1.699859,-0.113881 -0.288369,-0.189802 -0.303548,-3.656857 -0.03037,-3.88462 0.273191,-0.227763 2.914042,-0.202455 3.141703,0.02531 z m 9.728657,0.06327 c 0.242835,0.392258 0.197305,3.618896 -0.06071,3.796045 -0.136596,0.101228 -0.728514,0.139188 -1.699862,0.113881 l -1.502554,-0.03796 -0.04553,-1.885369 c -0.03033,-1.278002 0.01519,-1.935983 0.136596,-2.049865 0.121417,-0.126535 0.561561,-0.177148 1.593619,-0.177148 1.24454,0 1.441845,0.02531 1.578441,0.240416 z m 9.546527,-0.06327 c 0.121418,0.113882 0.166948,0.771863 0.136596,2.049865 l -0.04553,1.885369 -1.502554,0.03796 c -0.971349,0.02531 -1.563267,-0.01265 -1.699863,-0.113876 -0.258013,-0.177149 -0.303544,-3.403787 -0.06071,-3.796045 0.136596,-0.215109 0.333901,-0.240416 1.578441,-0.240416 1.032058,0 1.472201,0.05061 1.593619,0.177148 z m 9.698303,-0.02531 c 0.273192,0.227762 0.258013,3.694817 -0.03037,3.88462 -0.136596,0.101227 -0.728509,0.139188 -1.699858,0.113881 l -1.502554,-0.03796 -0.04553,-1.88537 c -0.03037,-1.278002 0.01519,-1.935983 0.136596,-2.049864 0.227661,-0.227763 2.868511,-0.25307 3.141703,-0.02531 z m 9.561705,-0.05061 c 0.136596,0.08857 0.182126,0.58206 0.151774,2.062518 l -0.04554,1.948637 -1.517727,0.03796 c -1.290075,0.02531 -1.548089,0 -1.699863,-0.189803 -0.136596,-0.139188 -0.197304,-0.733902 -0.197304,-1.885368 0,-2.100479 -0.01519,-2.075172 1.790923,-2.075172 0.72851,0 1.411489,0.05061 1.517732,0.101228 z m 9.713479,0.05061 c 0.258014,0.215109 0.258014,3.656857 0,3.871966 -0.121421,0.101228 -0.698157,0.151842 -1.563262,0.151842 -0.86511,0 -1.441845,-0.05061 -1.563267,-0.151842 -0.258013,-0.215109 -0.258013,-3.656857 0,-3.871966 0.24284,-0.202456 2.88369,-0.202456 3.126529,0 z M -173.95886,75.984426 v 14.235168 h -22.76596 -22.76596 V 76.009733 c 0,-7.819853 0.0303,-14.247823 0.0607,-14.27313 0.0304,-0.02531 10.27504,-0.03796 22.76597,-0.01265 l 22.70525,0.02531 z m 48.26385,0.01266 v 14.222513 l -22.79632,-0.02529 -22.8115,-0.03796 -0.0455,-14.197206 -0.0304,-14.209863 22.72043,-0.0253 c 12.5061,-0.02531 22.78114,-0.02531 22.85703,0 0.0607,0.0253 0.10624,6.440623 0.10624,14.27313 z m 48.187955,-0.05062 v 14.20986 h -22.765965 -22.76597 l -0.0455,-14.108632 c -0.0152,-7.756586 0,-14.171903 0.0304,-14.23517 0.0303,-0.08857 7.74043,-0.113881 22.79632,-0.101228 l 22.750788,0.03796 z m 48.263845,0 v 14.20986 h -22.765966 -22.765963 l -0.04554,-14.108632 c -0.01519,-7.756586 0,-14.171903 0.03037,-14.23517 0.03037,-0.08857 7.740429,-0.113881 22.79632,-0.101228 l 22.750788,0.03796 z m -184.8141,16.702596 c 0.12142,0.101231 0.18213,0.733905 0.18213,2.02456 0,2.201705 0.0607,2.125786 -1.76057,2.125786 -1.71503,0 -1.73021,-0.01266 -1.73021,-2.163746 0,-2.163746 -0.0304,-2.138441 1.8061,-2.138441 0.81957,0 1.38113,0.05061 1.50255,0.151841 z m 9.65277,0.05062 c 0.19731,0.151841 0.24284,0.51879 0.24284,1.948634 0,2.163746 0.0152,2.151095 -1.68468,2.151095 -1.86681,0 -1.8061,0.07592 -1.8061,-2.125786 0,-1.290655 0.0607,-1.923329 0.18212,-2.02456 0.28837,-0.240413 2.77745,-0.202454 3.06582,0.05062 z m 9.62241,-0.05062 c 0.12142,0.101231 0.18213,0.733905 0.18213,2.02456 0,2.18905 0.0455,2.125786 -1.69986,2.125786 -1.76056,0 -1.79092,-0.02532 -1.79092,-2.113132 0,-2.189055 0,-2.189055 1.82128,-2.189055 0.8044,0 1.38114,0.06327 1.48737,0.151841 z m 9.60724,-0.02529 c 0.25802,0.126536 0.28837,0.291031 0.28837,2.024556 0,2.227014 0.0607,2.151095 -1.74539,2.151095 -1.8061,0 -1.74539,0.07592 -1.74539,-2.151095 0,-1.657607 0.0304,-1.89802 0.27319,-2.011902 0.3339,-0.177149 2.54979,-0.177149 2.92922,-0.01266 z m 9.75901,0.151841 c 0.1973,0.227762 0.24284,0.645329 0.24284,1.898023 0,2.049865 -0.0607,2.125787 -1.76057,2.125787 -1.79092,0 -1.73021,0.06326 -1.73021,-2.125787 0,-1.290654 0.0607,-1.923328 0.18212,-2.024559 0.12142,-0.101227 0.68298,-0.151841 1.50256,-0.151841 1.19901,0 1.35078,0.02532 1.56326,0.278377 z m 9.51617,-0.151841 c 0.25802,0.126536 0.28837,0.291031 0.28837,2.024556 0,2.227014 0.0607,2.151095 -1.8061,2.151095 -1.69986,0 -1.68468,0.02532 -1.68468,-2.214363 0,-1.60699 0.0303,-1.834752 0.27319,-1.948634 0.3339,-0.177149 2.54979,-0.177149 2.92922,-0.01266 z m 9.75901,0.07592 c 0.19731,0.151841 0.24284,0.51879 0.24284,1.910675 0,2.1764 -0.0152,2.189054 -1.69986,2.189054 -1.85163,0 -1.79092,0.07592 -1.79092,-2.125787 0,-1.290654 0.0607,-1.923328 0.18213,-2.024559 0.28837,-0.240413 2.77744,-0.202454 3.06581,0.05062 z m 9.62242,-0.05062 c 0.12141,0.101231 0.18213,0.733905 0.18213,2.024559 0,2.201706 0.0607,2.125787 -1.8061,2.125787 -1.69986,0 -1.68468,0.01266 -1.68468,-2.151095 0,-2.189051 -0.0304,-2.151092 1.80609,-2.151092 0.81958,0 1.38114,0.05061 1.50256,0.151841 z m 9.65277,0.05062 c 0.1973,0.151841 0.24283,0.51879 0.24283,1.948634 0,2.163746 0.0152,2.151095 -1.68468,2.151095 -1.86681,0 -1.8061,0.07592 -1.8061,-2.125787 0,-1.290654 0.0607,-1.923328 0.18213,-2.024559 0.28837,-0.240413 2.77745,-0.202454 3.06582,0.05062 z m 9.62241,-0.05062 c 0.12142,0.101231 0.18213,0.733905 0.18213,2.024559 0,2.201706 0.0607,2.125787 -1.76057,2.125787 -1.71504,0 -1.73021,-0.01266 -1.73021,-2.163746 0,-2.163746 -0.0303,-2.138441 1.8061,-2.138441 0.81957,0 1.38113,0.05061 1.50255,0.151841 z m 9.60724,-0.02529 c 0.25801,0.126536 0.28837,0.291031 0.28837,1.961288 0,2.239668 0.0152,2.214363 -1.68468,2.214363 -1.86681,0 -1.80611,0.07592 -1.80611,-2.151095 0,-1.657607 0.0304,-1.89802 0.2732,-2.011902 0.3339,-0.177149 2.54979,-0.177149 2.92922,-0.01266 z m 9.66795,0.02529 c 0.12141,0.101231 0.18212,0.733905 0.18212,2.024559 0,2.189051 0.0607,2.125787 -1.73021,2.125787 -1.69986,0 -1.76057,-0.07592 -1.76057,-2.125787 0,-2.151091 0.0152,-2.1764 1.8061,-2.1764 0.81958,0 1.38114,0.05061 1.50256,0.151841 z m 9.607232,-0.02529 c 0.258013,0.126536 0.288369,0.291031 0.288369,2.024556 0,2.227013 0.06071,2.151095 -1.806101,2.151095 -1.69986,0 -1.68468,0.02532 -1.68468,-2.214363 0,-1.60699 0.0304,-1.834752 0.27319,-1.948634 0.3339,-0.177149 2.549791,-0.177149 2.929222,-0.01266 z m 9.759008,0.07592 c 0.197304,0.151841 0.242839,0.51879 0.242839,1.948634 0,2.125786 -0.01519,2.151095 -1.790923,2.151095 -1.745393,0 -1.699859,0.06326 -1.699859,-2.125787 0,-1.290654 0.06071,-1.923328 0.182127,-2.024559 0.28837,-0.240413 2.777446,-0.202454 3.065816,0.05062 z m 9.622414,-0.05062 c 0.121422,0.101231 0.18213,0.733905 0.18213,2.024559 0,2.201705 0.06071,2.125787 -1.806101,2.125787 -1.699859,0 -1.68468,0.01266 -1.68468,-2.151095 0,-2.189051 -0.03037,-2.151092 1.806097,-2.151092 0.819575,0 1.381136,0.05061 1.502554,0.151841 z m 9.65277,0.05062 c 0.197304,0.151841 0.242835,0.51879 0.242835,1.910675 0,2.1764 -0.01519,2.189054 -1.699858,2.189054 -1.851633,0 -1.79092,0.07592 -1.79092,-2.125787 0,-1.290654 0.06071,-1.923328 0.182127,-2.024559 0.28837,-0.240413 2.777446,-0.202454 3.065816,0.05062 z m 9.622414,-0.05062 c 0.121417,0.101231 0.182126,0.733905 0.182126,2.024559 0,2.201705 0.06071,2.125787 -1.760567,2.125787 -1.715036,0 -1.73021,-0.01266 -1.73021,-2.163746 0,-2.163746 -0.03037,-2.138441 1.806097,-2.138441 0.819575,0 1.381136,0.05061 1.502554,0.151841 z m 9.652772,0.05062 c 0.197305,0.151841 0.242835,0.51879 0.242835,1.948634 0,2.163746 0.01519,2.151095 -1.68468,2.151095 -1.86681,0 -1.806101,0.07592 -1.806101,-2.125787 0,-1.290654 0.06071,-1.923328 0.18213,-2.024559 0.288366,-0.240413 2.777446,-0.202454 3.065816,0.05062 z m 9.622414,-0.05062 c 0.121418,0.101231 0.182126,0.733905 0.182126,2.024559 0,2.189051 0.06071,2.125787 -1.73021,2.125787 -1.699863,0 -1.760571,-0.06327 -1.760571,-2.1764 0,-2.125787 0,-2.125787 1.82128,-2.125787 0.804396,0 1.381132,0.06327 1.487375,0.151841 z m 9.607236,-0.02529 c 0.258013,0.126536 0.28837,0.29103 0.28837,2.024556 0,2.227013 0.06071,2.151095 -1.745389,2.151095 -1.806102,0 -1.745393,0.07592 -1.745393,-2.151095 0,-1.657607 0.03037,-1.89802 0.273191,-2.011902 0.333901,-0.177149 2.54979,-0.177149 2.929221,-0.01266 z"
         id="path3210-3"
         style="fill:#666666;stroke:none;stroke-width:0.0138581" /></g><g
       id="g3229"
       transform="rotate(48.174941,-50.202292,271.87854)"
       style="display:inline;fill:#666666"
       clip-path="url(#clipPath3317)"><rect
         style="fill:#666666;stroke:none;stroke-width:0.808302"
         id="rect3224"
         width="191.06645"
         height="31.393354"
         x="-219.74138"
         y="60.621651" /><path
         d="m -220.40142,76.047694 v 23.915087 h 96.4518 96.451804 V 76.047694 52.132608 h -96.451804 -96.4518 z m 6.35929,-20.321496 c 0.12142,0.113881 0.16695,0.771862 0.13659,2.049864 l -0.0455,1.88537 -1.50255,0.03796 c -0.97135,0.02531 -1.56326,-0.01265 -1.69986,-0.113881 -0.25802,-0.177149 -0.30355,-3.403788 -0.0607,-3.796046 0.1366,-0.215109 0.3339,-0.240416 1.57844,-0.240416 1.03206,0 1.4722,0.05061 1.59362,0.177149 z m 9.6983,-0.02531 c 0.27319,0.227763 0.25801,3.694818 -0.0304,3.88462 -0.1366,0.101228 -0.72851,0.139189 -1.69986,0.113882 l -1.50256,-0.03796 -0.0455,-1.885369 c -0.0304,-1.278002 0.0152,-1.935983 0.1366,-2.049864 0.22766,-0.227763 2.86851,-0.25307 3.1417,-0.02531 z m 9.5617,-0.05061 c 0.1366,0.08857 0.18213,0.58206 0.15178,2.062518 l -0.0455,1.948636 -1.51773,0.03796 c -1.29007,0.02531 -1.54809,0 -1.69986,-0.189803 -0.1366,-0.139188 -0.19731,-0.733902 -0.19731,-1.885369 0,-2.100478 -0.0152,-2.075171 1.79092,-2.075171 0.72852,0 1.4115,0.05061 1.51773,0.101228 z m 9.71348,0.05061 c 0.25802,0.21511 0.25802,3.656857 0,3.871967 -0.12141,0.101228 -0.69815,0.151842 -1.56326,0.151842 -0.86511,0 -1.44184,-0.05061 -1.56326,-0.151842 -0.12142,-0.101228 -0.18213,-0.721249 -0.18213,-1.935983 0,-1.214735 0.0607,-1.834755 0.18213,-1.935984 0.24283,-0.202455 2.88368,-0.202455 3.12652,0 z m 9.65277,0.05061 c 0.31873,0.25307 0.34908,3.416441 0.0455,3.758085 -0.15178,0.189803 -0.40979,0.21511 -1.69986,0.189803 l -1.51774,-0.03796 -0.0455,-1.948636 c -0.0304,-1.480458 0.0152,-1.973944 0.15177,-2.062518 0.10625,-0.05061 0.78923,-0.101228 1.51774,-0.101228 1.0017,0 1.36595,0.05061 1.54808,0.202455 z m 9.62241,-0.05061 c 0.19731,0.164496 0.27319,3.429095 0.0911,3.821353 -0.0759,0.164495 -0.36425,0.202456 -1.56326,0.202456 -0.941,0 -1.53291,-0.05061 -1.65433,-0.151842 -0.25801,-0.21511 -0.25801,-3.656857 0,-3.871967 0.24284,-0.202455 2.88369,-0.202455 3.12653,0 z m 9.74384,0.08858 c 0.24283,0.392258 0.1973,3.618896 -0.0607,3.796045 -0.1366,0.101228 -0.72852,0.139189 -1.69986,0.113882 l -1.50255,-0.03796 -0.0455,-1.885369 c -0.0304,-1.278002 0.0152,-1.935983 0.13659,-2.049864 0.12142,-0.126535 0.56156,-0.177149 1.59362,-0.177149 1.24454,0 1.44185,0.02531 1.57844,0.240416 z m 9.54653,-0.06327 c 0.12141,0.113881 0.16695,0.771862 0.13659,2.049864 l -0.0455,1.885369 -1.50255,0.03796 c -0.97135,0.02531 -1.56326,-0.01266 -1.69986,-0.113882 -0.28837,-0.189802 -0.30355,-3.656857 -0.0304,-3.88462 0.27319,-0.227762 2.91404,-0.202455 3.1417,0.02531 z m 9.6983,-0.02531 c 0.27319,0.227763 0.25801,3.694817 -0.0304,3.88462 -0.1366,0.101228 -0.72851,0.139188 -1.69986,0.113881 l -1.50256,-0.03796 -0.0455,-1.885369 c -0.0304,-1.278003 0.0152,-1.935984 0.1366,-2.049865 0.22766,-0.227763 2.86851,-0.25307 3.1417,-0.02531 z m 9.57688,0.02531 c 0.12142,0.113881 0.16695,0.771862 0.13659,2.049864 l -0.0455,1.885369 -1.51772,0.03796 c -1.29007,0.02531 -1.54809,0 -1.69986,-0.189803 -0.24284,-0.265723 -0.27319,-3.353173 -0.0455,-3.720124 0.13659,-0.215109 0.3339,-0.240416 1.57844,-0.240416 1.03206,0 1.4722,0.05061 1.59362,0.177149 z m 9.6983,-0.02531 c 0.12142,0.101228 0.18213,0.721249 0.18213,1.935983 0,1.214735 -0.0607,1.834755 -0.18213,1.935983 -0.12142,0.101228 -0.71334,0.151842 -1.65433,0.151842 -1.199,0 -1.48737,-0.03796 -1.56326,-0.202456 -0.18213,-0.392258 -0.10624,-3.656857 0.0911,-3.821352 0.24283,-0.202456 2.88368,-0.202456 3.12652,0 z m 9.56171,-0.05061 c 0.13659,0.08858 0.18212,0.58206 0.15177,2.062518 l -0.0455,1.948637 -1.51773,0.03796 c -1.29007,0.02531 -1.54809,0 -1.69986,-0.189802 -0.1366,-0.139188 -0.19731,-0.733902 -0.19731,-1.885369 0,-2.100479 -0.0152,-2.075172 1.79093,-2.075172 0.72851,0 1.41149,0.05061 1.51773,0.101228 z m 9.713475,0.05061 c 0.121418,0.101228 0.182126,0.721249 0.182126,1.935983 0,1.214735 -0.06071,1.834755 -0.182126,1.935983 -0.121422,0.101228 -0.698157,0.151842 -1.563267,0.151842 -0.865108,0 -1.441838,-0.05061 -1.563258,-0.151842 -0.12142,-0.101228 -0.18213,-0.721248 -0.18213,-1.935983 0,-1.214734 0.0607,-1.834755 0.18213,-1.935983 0.24283,-0.202456 2.883686,-0.202456 3.126525,0 z m 9.652765,0.05061 c 0.318726,0.25307 0.349078,3.416441 0.04554,3.758085 -0.151774,0.189802 -0.409788,0.215109 -1.699863,0.189802 l -1.517728,-0.03796 -0.04553,-1.948637 c -0.03037,-1.480458 0.01519,-1.973943 0.151774,-2.062518 0.106243,-0.05061 0.789222,-0.101228 1.517732,-0.101228 1.001701,0 1.365958,0.05061 1.548084,0.202456 z m 9.637592,-0.02531 c 0.121418,0.113882 0.166952,0.771863 0.136596,2.049865 l -0.04553,1.885369 -1.502553,0.03796 c -0.971349,0.02531 -1.563263,-0.01265 -1.699859,-0.113881 -0.288369,-0.189802 -0.303548,-3.656857 -0.03037,-3.88462 0.273191,-0.227763 2.914042,-0.202455 3.141703,0.02531 z m 9.728657,0.06327 c 0.242835,0.392258 0.197305,3.618896 -0.06071,3.796045 -0.136596,0.101228 -0.728514,0.139188 -1.699862,0.113881 l -1.502554,-0.03796 -0.04553,-1.885369 c -0.03033,-1.278002 0.01519,-1.935983 0.136596,-2.049865 0.121417,-0.126535 0.561561,-0.177148 1.593619,-0.177148 1.24454,0 1.441845,0.02531 1.578441,0.240416 z m 9.546527,-0.06327 c 0.121418,0.113882 0.166948,0.771863 0.136596,2.049865 l -0.04553,1.885369 -1.502554,0.03796 c -0.971349,0.02531 -1.563267,-0.01265 -1.699863,-0.113876 -0.258013,-0.177149 -0.303544,-3.403787 -0.06071,-3.796045 0.136596,-0.215109 0.333901,-0.240416 1.578441,-0.240416 1.032058,0 1.472201,0.05061 1.593619,0.177148 z m 9.698303,-0.02531 c 0.273192,0.227762 0.258013,3.694817 -0.03037,3.88462 -0.136596,0.101227 -0.728509,0.139188 -1.699858,0.113881 l -1.502554,-0.03796 -0.04553,-1.88537 c -0.03037,-1.278002 0.01519,-1.935983 0.136596,-2.049864 0.227661,-0.227763 2.868511,-0.25307 3.141703,-0.02531 z m 9.561705,-0.05061 c 0.136596,0.08857 0.182126,0.58206 0.151774,2.062518 l -0.04554,1.948637 -1.517727,0.03796 c -1.290075,0.02531 -1.548089,0 -1.699863,-0.189803 -0.136596,-0.139188 -0.197304,-0.733902 -0.197304,-1.885368 0,-2.100479 -0.01519,-2.075172 1.790923,-2.075172 0.72851,0 1.411489,0.05061 1.517732,0.101228 z m 9.713479,0.05061 c 0.258014,0.215109 0.258014,3.656857 0,3.871966 -0.121421,0.101228 -0.698157,0.151842 -1.563262,0.151842 -0.86511,0 -1.441845,-0.05061 -1.563267,-0.151842 -0.258013,-0.215109 -0.258013,-3.656857 0,-3.871966 0.24284,-0.202456 2.88369,-0.202456 3.126529,0 z M -173.95886,75.984426 v 14.235168 h -22.76596 -22.76596 V 76.009733 c 0,-7.819853 0.0303,-14.247823 0.0607,-14.27313 0.0304,-0.02531 10.27504,-0.03796 22.76597,-0.01265 l 22.70525,0.02531 z m 48.26385,0.01266 v 14.222513 l -22.79632,-0.02529 -22.8115,-0.03796 -0.0455,-14.197206 -0.0304,-14.209863 22.72043,-0.0253 c 12.5061,-0.02531 22.78114,-0.02531 22.85703,0 0.0607,0.0253 0.10624,6.440623 0.10624,14.27313 z m 48.187955,-0.05062 v 14.20986 h -22.765965 -22.76597 l -0.0455,-14.108632 c -0.0152,-7.756586 0,-14.171903 0.0304,-14.23517 0.0303,-0.08857 7.74043,-0.113881 22.79632,-0.101228 l 22.750788,0.03796 z m 48.263845,0 v 14.20986 h -22.765966 -22.765963 l -0.04554,-14.108632 c -0.01519,-7.756586 0,-14.171903 0.03037,-14.23517 0.03037,-0.08857 7.740429,-0.113881 22.79632,-0.101228 l 22.750788,0.03796 z m -184.8141,16.702596 c 0.12142,0.101231 0.18213,0.733905 0.18213,2.02456 0,2.201705 0.0607,2.125786 -1.76057,2.125786 -1.71503,0 -1.73021,-0.01266 -1.73021,-2.163746 0,-2.163746 -0.0304,-2.138441 1.8061,-2.138441 0.81957,0 1.38113,0.05061 1.50255,0.151841 z m 9.65277,0.05062 c 0.19731,0.151841 0.24284,0.51879 0.24284,1.948634 0,2.163746 0.0152,2.151095 -1.68468,2.151095 -1.86681,0 -1.8061,0.07592 -1.8061,-2.125786 0,-1.290655 0.0607,-1.923329 0.18212,-2.02456 0.28837,-0.240413 2.77745,-0.202454 3.06582,0.05062 z m 9.62241,-0.05062 c 0.12142,0.101231 0.18213,0.733905 0.18213,2.02456 0,2.18905 0.0455,2.125786 -1.69986,2.125786 -1.76056,0 -1.79092,-0.02532 -1.79092,-2.113132 0,-2.189055 0,-2.189055 1.82128,-2.189055 0.8044,0 1.38114,0.06327 1.48737,0.151841 z m 9.60724,-0.02529 c 0.25802,0.126536 0.28837,0.291031 0.28837,2.024556 0,2.227014 0.0607,2.151095 -1.74539,2.151095 -1.8061,0 -1.74539,0.07592 -1.74539,-2.151095 0,-1.657607 0.0304,-1.89802 0.27319,-2.011902 0.3339,-0.177149 2.54979,-0.177149 2.92922,-0.01266 z m 9.75901,0.151841 c 0.1973,0.227762 0.24284,0.645329 0.24284,1.898023 0,2.049865 -0.0607,2.125787 -1.76057,2.125787 -1.79092,0 -1.73021,0.06326 -1.73021,-2.125787 0,-1.290654 0.0607,-1.923328 0.18212,-2.024559 0.12142,-0.101227 0.68298,-0.151841 1.50256,-0.151841 1.19901,0 1.35078,0.02532 1.56326,0.278377 z m 9.51617,-0.151841 c 0.25802,0.126536 0.28837,0.291031 0.28837,2.024556 0,2.227014 0.0607,2.151095 -1.8061,2.151095 -1.69986,0 -1.68468,0.02532 -1.68468,-2.214363 0,-1.60699 0.0303,-1.834752 0.27319,-1.948634 0.3339,-0.177149 2.54979,-0.177149 2.92922,-0.01266 z m 9.75901,0.07592 c 0.19731,0.151841 0.24284,0.51879 0.24284,1.910675 0,2.1764 -0.0152,2.189054 -1.69986,2.189054 -1.85163,0 -1.79092,0.07592 -1.79092,-2.125787 0,-1.290654 0.0607,-1.923328 0.18213,-2.024559 0.28837,-0.240413 2.77744,-0.202454 3.06581,0.05062 z m 9.62242,-0.05062 c 0.12141,0.101231 0.18213,0.733905 0.18213,2.024559 0,2.201706 0.0607,2.125787 -1.8061,2.125787 -1.69986,0 -1.68468,0.01266 -1.68468,-2.151095 0,-2.189051 -0.0304,-2.151092 1.80609,-2.151092 0.81958,0 1.38114,0.05061 1.50256,0.151841 z m 9.65277,0.05062 c 0.1973,0.151841 0.24283,0.51879 0.24283,1.948634 0,2.163746 0.0152,2.151095 -1.68468,2.151095 -1.86681,0 -1.8061,0.07592 -1.8061,-2.125787 0,-1.290654 0.0607,-1.923328 0.18213,-2.024559 0.28837,-0.240413 2.77745,-0.202454 3.06582,0.05062 z m 9.62241,-0.05062 c 0.12142,0.101231 0.18213,0.733905 0.18213,2.024559 0,2.201706 0.0607,2.125787 -1.76057,2.125787 -1.71504,0 -1.73021,-0.01266 -1.73021,-2.163746 0,-2.163746 -0.0303,-2.138441 1.8061,-2.138441 0.81957,0 1.38113,0.05061 1.50255,0.151841 z m 9.60724,-0.02529 c 0.25801,0.126536 0.28837,0.291031 0.28837,1.961288 0,2.239668 0.0152,2.214363 -1.68468,2.214363 -1.86681,0 -1.80611,0.07592 -1.80611,-2.151095 0,-1.657607 0.0304,-1.89802 0.2732,-2.011902 0.3339,-0.177149 2.54979,-0.177149 2.92922,-0.01266 z m 9.66795,0.02529 c 0.12141,0.101231 0.18212,0.733905 0.18212,2.024559 0,2.189051 0.0607,2.125787 -1.73021,2.125787 -1.69986,0 -1.76057,-0.07592 -1.76057,-2.125787 0,-2.151091 0.0152,-2.1764 1.8061,-2.1764 0.81958,0 1.38114,0.05061 1.50256,0.151841 z m 9.607232,-0.02529 c 0.258013,0.126536 0.288369,0.291031 0.288369,2.024556 0,2.227013 0.06071,2.151095 -1.806101,2.151095 -1.69986,0 -1.68468,0.02532 -1.68468,-2.214363 0,-1.60699 0.0304,-1.834752 0.27319,-1.948634 0.3339,-0.177149 2.549791,-0.177149 2.929222,-0.01266 z m 9.759008,0.07592 c 0.197304,0.151841 0.242839,0.51879 0.242839,1.948634 0,2.125786 -0.01519,2.151095 -1.790923,2.151095 -1.745393,0 -1.699859,0.06326 -1.699859,-2.125787 0,-1.290654 0.06071,-1.923328 0.182127,-2.024559 0.28837,-0.240413 2.777446,-0.202454 3.065816,0.05062 z m 9.622414,-0.05062 c 0.121422,0.101231 0.18213,0.733905 0.18213,2.024559 0,2.201705 0.06071,2.125787 -1.806101,2.125787 -1.699859,0 -1.68468,0.01266 -1.68468,-2.151095 0,-2.189051 -0.03037,-2.151092 1.806097,-2.151092 0.819575,0 1.381136,0.05061 1.502554,0.151841 z m 9.65277,0.05062 c 0.197304,0.151841 0.242835,0.51879 0.242835,1.910675 0,2.1764 -0.01519,2.189054 -1.699858,2.189054 -1.851633,0 -1.79092,0.07592 -1.79092,-2.125787 0,-1.290654 0.06071,-1.923328 0.182127,-2.024559 0.28837,-0.240413 2.777446,-0.202454 3.065816,0.05062 z m 9.622414,-0.05062 c 0.121417,0.101231 0.182126,0.733905 0.182126,2.024559 0,2.201705 0.06071,2.125787 -1.760567,2.125787 -1.715036,0 -1.73021,-0.01266 -1.73021,-2.163746 0,-2.163746 -0.03037,-2.138441 1.806097,-2.138441 0.819575,0 1.381136,0.05061 1.502554,0.151841 z m 9.652772,0.05062 c 0.197305,0.151841 0.242835,0.51879 0.242835,1.948634 0,2.163746 0.01519,2.151095 -1.68468,2.151095 -1.86681,0 -1.806101,0.07592 -1.806101,-2.125787 0,-1.290654 0.06071,-1.923328 0.18213,-2.024559 0.288366,-0.240413 2.777446,-0.202454 3.065816,0.05062 z m 9.622414,-0.05062 c 0.121418,0.101231 0.182126,0.733905 0.182126,2.024559 0,2.189051 0.06071,2.125787 -1.73021,2.125787 -1.699863,0 -1.760571,-0.06327 -1.760571,-2.1764 0,-2.125787 0,-2.125787 1.82128,-2.125787 0.804396,0 1.381132,0.06327 1.487375,0.151841 z m 9.607236,-0.02529 c 0.258013,0.126536 0.28837,0.29103 0.28837,2.024556 0,2.227013 0.06071,2.151095 -1.745389,2.151095 -1.806102,0 -1.745393,0.07592 -1.745393,-2.151095 0,-1.657607 0.03037,-1.89802 0.273191,-2.011902 0.333901,-0.177149 2.54979,-0.177149 2.929221,-0.01266 z"
         id="path3210"
         style="fill:#666666;stroke:none;stroke-width:0.0138581" /></g><text
       xml:space="preserve"
       style="font-size:17.6559px;letter-spacing:-0.147056px;fill:#090909;fill-opacity:1;stroke:#f4f4f4;stroke-width:0.5;stroke-linecap:round;stroke-dasharray:0.5, 0.5;stroke-dashoffset:0;stroke-opacity:1"
       x="55.820446"
       y="188.95889"
       id="text3398"
       transform="scale(1.2144077,0.82344669)"><tspan
         sodipodi:role="line"
         style="font-style:normal;font-variant:normal;font-weight:normal;font-stretch:normal;font-family:Impact;-inkscape-font-specification:Impact;text-align:center;text-anchor:middle;fill:#090909;fill-opacity:1;stroke:#f4f4f4;stroke-width:0.5;stroke-linecap:round;stroke-dasharray:0.5, 0.5;stroke-dashoffset:0;stroke-opacity:1"
         x="55.820446"
         y="188.95889"
         id="tspan3504"><tspan
   dy="0"
   id="tspan3508"
   style="font-style:normal;font-variant:normal;font-weight:normal;font-stretch:normal;font-family:Impact;-inkscape-font-specification:Impact;text-align:center;text-anchor:middle;fill:#090909;fill-opacity:1;stroke:#f4f4f4;stroke-width:0.5;stroke-linecap:round;stroke-dasharray:0.5, 0.5;stroke-dashoffset:0;stroke-opacity:1">Poster </tspan></tspan><tspan
         sodipodi:role="line"
         style="font-style:normal;font-variant:normal;font-weight:normal;font-stretch:normal;font-family:Impact;-inkscape-font-specification:Impact;text-align:center;text-anchor:middle;fill:#090909;fill-opacity:1;stroke:#f4f4f4;stroke-width:0.5;stroke-linecap:round;stroke-dasharray:0.5, 0.5;stroke-dashoffset:0;stroke-opacity:1"
         x="55.820446"
         y="212.59576"
         id="tspan3510">não </tspan><tspan
         sodipodi:role="line"
         style="font-style:normal;font-variant:normal;font-weight:normal;font-stretch:normal;font-family:Impact;-inkscape-font-specification:Impact;text-align:center;text-anchor:middle;fill:#090909;fill-opacity:1;stroke:#f4f4f4;stroke-width:0.5;stroke-linecap:round;stroke-dasharray:0.5, 0.5;stroke-dashoffset:0;stroke-opacity:1"
         x="55.746918"
         y="236.23264"
         dy="0 0 0 0 0 0 0 0 0"
         id="tspan3512">disponível</tspan></text></g></svg>
