{
	"campaign":
	{
		"id":"campaign-102",
		"active":true,
		"showPopup":true,
		"signalCount":3,
		"title":"3 Premium Signals",
		"message":"Review us!\nGet your 3 premium signals for free now!",
		"image":"",
		"buttons":
		[
			{
				"type":0,
				"title":"Rate Now",
				"action":null
			},
			{
				"type":1,
				"title":"Cancel",
				"action":null
			}
		]
	},
	"ads":
	{
		"bannerActive":true,
		"interstitialActive":true,
		"showCount":2
	},
	"messagePopup":
	{
		"id":"message-111",
		"screen":"SignalActiveListVC",
		"active":true,
		"title":"Bitcoin Signals",
		"message":"\nReview us!\nGet your 3 premium signals from purchase page for free now!\n\nHappy new year and happy holidays!\n\nStudio Rain will be on holiday till 2nd January 2019. We will not be serving new signals between 24-29 December.\n\nAnalysts will start serving new signals on 2nd January 2019\n\nIf you have questions, issues or queries you may contact our support team between 24-29th December 2018.\n\nSupport team address: support@studioraingames.com\n",
		"image":"",
		"buttons":
		[
			{
				"type":0,
				"title":"Close",
				"action":null
			}
		]
	}
}
