substance_bnvd;cas_bnvd;nom_substance_active_ephy;numero_cas_ephy
(e)-5-decen-1-yl acetate;38421-90-8;Straight Chain Lepidopteran Pheromones;
(e,z)-2,13-octadecadienyl acetate;86252-65-5;Straight Chain Lepidopteran Pheromones;
(e,z)-3,13-octadecadienyl acetate;53120-26-6;Straight Chain Lepidopteran Pheromones;
(z)-11-hexadecenal;53939-28-9;Straight Chain Lepidopteran Pheromones;
(z)-13-octadecenal;58594-45-9;Straight Chain Lepidopteran Pheromones;
(z)-8-dodecenol;40642-40-8;Straight Chain Lepidopteran Pheromones;
(z)-9-dodecenylacetate;16974-11-1;Straight Chain Lepidopteran Pheromones;
(z)-9-hexadecenal;56219-04-6;Straight Chain Lepidopteran Pheromones;
(z,z)-3,13-octadecadienyl acetate;53120-27-7;Straight Chain Lepidopteran Pheromones;
1-dodecanol;112-53-8;Straight Chain Lepidopteran Pheromones;
acetate de e-8-dodecenyle;38363-29-0;Straight Chain Lepidopteran Pheromones;
acetate de tetradecyle;638-59-5;Straight Chain Lepidopteran Pheromones;
acetate de z-8-dodecenyle;28079-04-1;Straight Chain Lepidopteran Pheromones;
e,z-8-dodecen-1-yl acetate + z-8-dodecen-1-ol;;Straight Chain Lepidopteran Pheromones;
e/z8 acetate de dodecenyle;37338-40-2;Straight Chain Lepidopteran Pheromones;
e/z9-dodecenyl acetate;16974-34-8;Straight Chain Lepidopteran Pheromones;
e7,e/z9-dodecadienyl acetate + n-dodecanyl acetate;;Straight Chain Lepidopteran Pheromones;
e7,z9-dodecadienylacetate;54364-62-4;Straight Chain Lepidopteran Pheromones;
e8,e10-dodecadiene-1-ol;33956-49-9;Straight Chain Lepidopteran Pheromones;
e8,e10-dodécadiène-1-ol + tétradécylacétate;;Straight Chain Lepidopteran Pheromones;
n-hexadecylacetate;629-70-9;Straight Chain Lepidopteran Pheromones;
z/e-11 hexadecenal;53939-28-9;Straight Chain Lepidopteran Pheromones;
z-11-tetradecenyl acetate;20711-10-8;Straight Chain Lepidopteran Pheromones;
z-9-tetradecenyl acetate;16725-53-4;Straight Chain Lepidopteran Pheromones;
